{"text_format":"1","workbook":"xlsx","n_sheets":4,"sheets":["Orçamentária","Composições","Composições Auxiliares","BDI"],"not_rendered":{"charts":0,"images":4,"macros":0,"external_links":1,"defined_names":88,"comments":1,"pivot_tables":0},"unopened":[],"bounds":{"document_bytes":16777216,"sheet_cells":100000,"rows_first":2000,"rows_last":500,"rows_between":2000,"halvings":0,"cell_chars":16384,"cell_head_chars":4096},"cells_cut":0,"cells_raw":0,"read":"whole","date_system":"1900"}

{"sheet":"Orçamentária","index":0,"n_rows":405,"n_cols":19,"rows_kept":405,"cut":false,"hidden":false,"merged":[[404,0,404,7],[403,0,403,7],[0,0,0,8],[2,0,2,8],[3,0,3,8]]}
["Ata de Registro de Preços para Reformas no SF - 2019/2020"]
[]
["PLANILHA ORÇAMENTÁRIA"]
["Data: Julho de 2019 (data-base: Sinapi jun/2019, Pini jun/2019)"]
["Item","DISCRIMINAÇÃO","UN","QUANT. TOTAL","PREÇO UNITÁRIO","CUSTO DIRETO","BDI (%)","PREÇO UNITÁRIO COM BDI","CUSTO TOTAL",null,"PREÇO UNITÁRIO","Diferença","% alterado","CUSTO DIRETO","Diferença","PREÇO UNITÁRIO COM BDI","Diferença","CUSTO TOTAL","Diferença"]
[null,"GRUPO 1 - SERVIÇOS DE REFORMA",null,null,null,{"$f":"SUBTOTAL(109,F7:F383)","v":9210568.359999992},null,null,{"$f":"SUBTOTAL(109,I7:I383)","v":10762200.439999996}]
["SF-00001","Engenheiro(a) /Arquiteto(a) júnior","hh",3000,{"$f":"OFFSET(INDEX(Composições!A:J,MATCH(B7,Composições!B:B,0),10),2,0)","v":76.03},{"$f":"IF(ISNUMBER(E7),ROUND(D7*E7,2),\"-\")","v":228090},{"$f":"BDI!$B$17","v":0.2034},{"$f":"IF(ISNUMBER(E7),ROUND(E7*(1+G7),2),0)","v":91.49},{"$f":"ROUND(H7*D7,2)","v":274470},null,76.03,{"$f":"IF(E7=K7,\"\",E7-K7)","v":""},{"$f":"IF(ISNUMBER(L7),L7/K7,\"\")","v":""},228090,{"$f":"IF(F7=N7,\"\",F7-N7)","v":""},91.49,{"$f":"IF(H7=P7,\"\",H7-P7)","v":""},274470,{"$f":"IF(I7=R7,\"\",I7-R7)","v":""}]
["SF-00002","Mestre de obras","hh",6000,{"$f":"OFFSET(INDEX(Composições!A:J,MATCH(B8,Composições!B:B,0),10),2,0)","v":23.08},{"$f":"IF(ISNUMBER(E8),ROUND(D8*E8,2),\"-\")","v":138480},{"$f":"BDI!$B$17","v":0.2034},{"$f":"IF(ISNUMBER(E8),ROUND(E8*(1+G8),2),0)","v":27.77},{"$f":"ROUND(H8*D8,2)","v":166620},null,23.08,{"$f":"IF(E8=K8,\"\",E8-K8)","v":""},"",138480,{"$f":"IF(F8=N8,\"\",F8-N8)","v":""},27.77,{"$f":"IF(H8=P8,\"\",H8-P8)","v":""},166620,{"$f":"IF(I8=R8,\"\",I8-R8)","v":""}]
["SF-00003","Planejamento físico-financeiro","un",10,{"$f":"OFFSET(INDEX(Composições!A:J,MATCH(B9,Composições!B:B,0),10),2,0)","v":1382.4},13824,{"$f":"BDI!$B$17","v":0.2034},1663.58,16635.8,null,1382.4,"","",13824,"",1663.58,"",16635.8,""]
["SF-00004","Projetos de segurança do trabalho","un",6,{"$f":"OFFSET(INDEX(Composições!A:J,MATCH(B10,Composições!B:B,0),10),2,0)","v":1954.5},11727,{"$f":"BDI!$B$17","v":0.2034},2352.0500000000002,14112.3,null,1954.5,"","",11727,"",2352.0500000000002,"",14112.3,""]
["SF-00005","Demolição de alvenarias","m3",50,{"$f":"OFFSET(INDEX(Composições!A:J,MATCH(B11,Composições!B:B,0),10),2,0)","v":37.39},1869.5,{"$f":"BDI!$B$17","v":0.2034},45,2250,null,37.39,"","",1869.5,"",45,"",2250,""]
["SF-00006","Demolição de concreto simples","m3",20,{"$f":"OFFSET(INDEX(Composições!A:J,MATCH(B12,Composições!B:B,0),10),2,0)","v":209.85},4197,{"$f":"BDI!$B$17","v":0.2034},252.53,5050.6000000000004,null,209.86,-1.0000000000019327E-2,-4.7650814829025663E-5,4197.2,-0.1999999999998181,252.55,-2.0000000000010232E-2,5051,-0.3999999999996362]
["SF-00007","Demolição de contrapiso","m2",634,{"$f":"OFFSET(INDEX(Composições!A:J,MATCH(B13,Composições!B:B,0),10),2,0)","v":9.9499999999999993},6308.3,{"$f":"BDI!$B$17","v":0.2034},11.97,7588.98,null,9.9499999999999993,"","",6308.3,"",11.97,"",7588.98,""]
["SF-00008","Demolição de fechamento ou parede em gesso acartonado","m2",100,{"$f":"OFFSET(INDEX(Composições!A:J,MATCH(B14,Composições!B:B,0),10),2,0)","v":5.0600000000000005},506,{"$f":"BDI!$B$17","v":0.2034},6.09,609,null,5.0599999999999996,"","",506,"",6.09,"",609,""]
["SF-00009","Demolição de forro de gesso","m2",3300,{"$f":"OFFSET(INDEX(Composições!A:J,MATCH(B15,Composições!B:B,0),10),2,0)","v":1.1000000000000001},3630,{"$f":"BDI!$B$17","v":0.2034},1.32,4356,null,3.36,-2.2599999999999998,-0.67261904761904756,11088,-7458,4.04,-2.7199999999999998,13332,-8976]
["SF-00010","Demolição de infraestrutura elétrica (eletrodutos, eletrocalhas, cabos)","m",5000,{"$f":"OFFSET(INDEX(Composições!A:J,MATCH(B16,Composições!B:B,0),10),2,0)","v":2.2800000000000002},11400,{"$f":"BDI!$B$17","v":0.2034},2.74,13700,null,2.27,1.0000000000000231E-2,4.4052863436124367E-3,11350,50,2.73,1.0000000000000231E-2,13650,50]
["SF-00011","Demolição de revestimento cerâmico, granito, mármore ou granitina","m2",340,{"$f":"OFFSET(INDEX(Composições!A:J,MATCH(B17,Composições!B:B,0),10),2,0)","v":8.25},2805,{"$f":"BDI!$B$17","v":0.2034},9.93,3376.2,null,8.25,"","",2805,"",9.93,"",3376.2,""]
["SF-00012","Demolição de revestimento em argamassa","m2",2000,{"$f":"OFFSET(INDEX(Composições!A:J,MATCH(B18,Composições!B:B,0),10),2,0)","v":2.2199999999999998},4440,{"$f":"BDI!$B$17","v":0.2034},2.67,5340,null,2.21,9.9999999999997868E-3,4.5248868778279576E-3,4420,20,2.66,9.9999999999997868E-3,5320,20]
["SF-00013","Demolição de tubulação hidrossanitária embutida com conexões e acessórios","m",100,{"$f":"OFFSET(INDEX(Composições!A:J,MATCH(B19,Composições!B:B,0),10),2,0)","v":0.33},33,{"$f":"BDI!$B$17","v":0.2034},0.4,40,null,0.34,-1.0000000000000009E-2,-2.9411764705882377E-2,34,-1,0.41,-9.9999999999999534E-3,41,-1]
["SF-00014","Demolição em concreto armado","m3",10,{"$f":"OFFSET(INDEX(Composições!A:J,MATCH(B20,Composições!B:B,0),10),2,0)","v":179.72},1797.2,{"$f":"BDI!$B$17","v":0.2034},216.28,2162.8000000000002,null,179.69,3.0000000000001137E-2,1.6695419889810862E-4,1796.9,0.29999999999995453,216.24,3.9999999999992042E-2,2162.4,0.40000000000009095]
["SF-00015","Locação de caçambas","un",110,310,34100,{"$f":"BDI!$G$17","v":0.11},344.1,37851,null,310,"","",34100,"",344.1,"",37851,""]
["SF-00016","Remoção de armários","m2",240,{"$f":"OFFSET(INDEX(Composições!A:J,MATCH(B22,Composições!B:B,0),10),2,0)","v":11.7},2808,{"$f":"BDI!$B$17","v":0.2034},14.08,3379.2,null,11.7,"","",2808,"",14.08,"",3379.2,""]
["SF-00017","Remoção de bancadas","m2",40,{"$f":"OFFSET(INDEX(Composições!A:J,MATCH(B23,Composições!B:B,0),10),2,0)","v":17.11},684.4,{"$f":"BDI!$B$17","v":0.2034},20.59,823.6,null,17.11,"","",684.4,"",20.59,"",823.6,""]
["SF-00018","Remoção de batentes de madeira","un",43,{"$f":"OFFSET(INDEX(Composições!A:J,MATCH(B24,Composições!B:B,0),10),2,0)","v":6.4499999999999993},277.35000000000002,{"$f":"BDI!$B$17","v":0.2034},7.76,333.68,null,6.46,-1.0000000000000675E-2,-1.5479876160991756E-3,277.77999999999997,-0.42999999999994998,7.77,-9.9999999999997868E-3,334.11,-0.43000000000000682]
["SF-00019","Remoção de canaleta em alumínio","m",300,{"$f":"OFFSET(INDEX(Composições!A:J,MATCH(B25,Composições!B:B,0),10),2,0)","v":3.5999999999999996},1080,{"$f":"BDI!$B$17","v":0.2034},4.33,1299,null,3.6,"","",1080,"",4.33,"",1299,""]
["SF-00020","Remoção de carpete","m2",400,{"$f":"OFFSET(INDEX(Composições!A:J,MATCH(B26,Composições!B:B,0),10),2,0)","v":1.6099999999999999},644,{"$f":"BDI!$B$17","v":0.2034},1.94,776,null,1.61,"","",644,"",1.94,"",776,""]
["SF-00021","Remoção de cortinas","m",50,{"$f":"OFFSET(INDEX(Composições!A:J,MATCH(B27,Composições!B:B,0),10),2,0)","v":2.82},141,{"$f":"BDI!$B$17","v":0.2034},3.39,169.5,null,2.82,"","",141,"",3.39,"",169.5,""]
["SF-00022","Remoção de difusores, grelhas e acessórios de climatização","un",120,{"$f":"OFFSET(INDEX(Composições!A:J,MATCH(B28,Composições!B:B,0),10),2,0)","v":17.670000000000002},2120.4,{"$f":"BDI!$B$17","v":0.2034},21.26,2551.1999999999998,null,17.66,1.0000000000001563E-2,5.6625141562862758E-4,2119.1999999999998,1.2000000000002728,21.25,1.0000000000001563E-2,2550,1.1999999999998181]
["SF-00023","Remoção de divisória de mármore ou granito","m2",60,{"$f":"OFFSET(INDEX(Composições!A:J,MATCH(B29,Composições!B:B,0),10),2,0)","v":26.700000000000003},1602,{"$f":"BDI!$B$17","v":0.2034},32.130000000000003,1927.8,null,26.72,-1.9999999999996021E-2,-7.4850299401182712E-4,1603.2,-1.2000000000000455,32.15,-1.9999999999996021E-2,1929,-1.2000000000000455]
["SF-00024","Remoção de divisórias de MDF e gesso acartonado","m2",1387,{"$f":"OFFSET(INDEX(Composições!A:J,MATCH(B30,Composições!B:B,0),10),2,0)","v":23.06},31984.22,{"$f":"BDI!$B$17","v":0.2034},27.75,38489.25,null,23.06,"","",31984.22,"",27.75,"",38489.25,""]
["SF-00025","Remoção de dutos/tubulações","m",2000,{"$f":"OFFSET(INDEX(Composições!A:J,MATCH(B31,Composições!B:B,0),10),2,0)","v":7.58},15160,{"$f":"BDI!$B$17","v":0.2034},9.1199999999999992,18240,null,7.59,-9.9999999999997868E-3,-1.3175230566534633E-3,15180,-20,9.1300000000000008,-1.0000000000001563E-2,18260,-20]
["SF-00026","Remoção de esquadrias metálicas","m2",100,{"$f":"OFFSET(INDEX(Composições!A:J,MATCH(B32,Composições!B:B,0),10),2,0)","v":8.08},808,{"$f":"BDI!$B$17","v":0.2034},9.7200000000000006,972,null,8.07,9.9999999999997868E-3,1.2391573729863428E-3,807,1,9.7100000000000009,9.9999999999997868E-3,971,1]
["SF-00027","Remoção de exaustor","un",20,{"$f":"OFFSET(INDEX(Composições!A:J,MATCH(B33,Composições!B:B,0),10),2,0)","v":5.87},117.4,{"$f":"BDI!$B$17","v":0.2034},7.06,141.19999999999999,null,5.87,"","",117.4,"",7.06,"",141.19999999999999,""]
["SF-00028","Remoção de fechadura/puxador de porta","un",101,{"$f":"OFFSET(INDEX(Composições!A:J,MATCH(B34,Composições!B:B,0),10),2,0)","v":4.8099999999999996},485.81,{"$f":"BDI!$B$17","v":0.2034},5.79,584.79,null,4.8099999999999996,"","",485.81,"",5.79,"",584.79,""]
["SF-00029","Remoção de folha de porta e dobradiças","un",82,{"$f":"OFFSET(INDEX(Composições!A:J,MATCH(B35,Composições!B:B,0),10),2,0)","v":6.21},509.22,{"$f":"BDI!$B$17","v":0.2034},7.47,612.54,null,6.21,"","",509.22,"",7.47,"",612.54,""]
["SF-00030","Remoção de laminado melamínico (LDAP), em PVC ou vinílico","m2",1000,{"$f":"OFFSET(INDEX(Composições!A:J,MATCH(B36,Composições!B:B,0),10),2,0)","v":14.53},14530,{"$f":"BDI!$B$17","v":0.2034},17.489999999999998,17490,null,14.53,"","",14530,"",17.489999999999998,"",17490,""]
["SF-00031","Remoção de louças","un",120,{"$f":"OFFSET(INDEX(Composições!A:J,MATCH(B37,Composições!B:B,0),10),2,0)","v":8.23},987.6,{"$f":"BDI!$B$17","v":0.2034},9.9,1188,null,8.23,"","",987.6,"",9.9,"",1188,""]
["SF-00032","Remoção de luminária","un",500,{"$f":"OFFSET(INDEX(Composições!A:J,MATCH(B38,Composições!B:B,0),10),2,0)","v":4.34},2170,{"$f":"BDI!$B$17","v":0.2034},5.22,2610,null,4.34,"","",2170,"",5.22,"",2610,""]
["SF-00033","Remoção de metais e acessórios","un",300,{"$f":"OFFSET(INDEX(Composições!A:J,MATCH(B39,Composições!B:B,0),10),2,0)","v":6},1800,{"$f":"BDI!$B$17","v":0.2034},7.22,2166,null,6,"","",1800,"",7.22,"",2166,""]
["SF-00034","Remoção de painéis de vidro temperado","m2",586,{"$f":"OFFSET(INDEX(Composições!A:J,MATCH(B40,Composições!B:B,0),10),2,0)","v":11.73},6873.78,{"$f":"BDI!$B$17","v":0.2034},14.12,8274.32,null,11.74,-9.9999999999997868E-3,-8.5178875638839747E-4,6879.64,-5.8600000000005821,14.13,-1.0000000000001563E-2,8280.18,-5.8600000000005821]
["SF-00035","Remoção de película","m2",196,17,3332,{"$f":"BDI!$B$17","v":0.2034},20.46,4010.16,null,17,"","",3332,"",20.46,"",4010.16,""]
["SF-00036","Remoção de persianas","m",186,{"$f":"OFFSET(INDEX(Composições!A:J,MATCH(B42,Composições!B:B,0),10),2,0)","v":2.82},524.52,{"$f":"BDI!$B$17","v":0.2034},3.39,630.54,null,2.82,"","",524.52,"",3.39,"",630.54,""]
["SF-00037","Remoção de pintura ou textura","m2",5800,{"$f":"OFFSET(INDEX(Composições!A:J,MATCH(B43,Composições!B:B,0),10),2,0)","v":5.68},32944,{"$f":"BDI!$B$17","v":0.2034},6.84,39672,null,5.69,-1.0000000000000675E-2,-1.7574692442883435E-3,33002,-58,6.85,-9.9999999999997868E-3,39730,-58]
["SF-00038","Remoção de placas de forro","m2",831,{"$f":"OFFSET(INDEX(Composições!A:J,MATCH(B44,Composições!B:B,0),10),2,0)","v":3.3},2742.3,{"$f":"BDI!$B$17","v":0.2034},3.97,3299.07,null,3.3,"","",2742.3,"",3.97,"",3299.07,""]
["SF-00039","Remoção de quadros de elétricos ou de telecomunicações","un",30,{"$f":"OFFSET(INDEX(Composições!A:J,MATCH(B45,Composições!B:B,0),10),2,0)","v":50.92},1527.6,{"$f":"BDI!$B$17","v":0.2034},61.28,1838.4,null,50.91,1.0000000000005116E-2,1.9642506383824626E-4,1527.3,0.29999999999995453,61.27,9.9999999999980105E-3,1838.1,0.3000000000001819]
["SF-00040","Remoção de revestimento acústico","m2",440,{"$f":"OFFSET(INDEX(Composições!A:J,MATCH(B46,Composições!B:B,0),10),2,0)","v":2.84},1249.5999999999999,{"$f":"BDI!$B$17","v":0.2034},3.42,1504.8,null,2.84,"","",1249.5999999999999,"",3.42,"",1504.8,""]
["SF-00041","Remoção de rodapé/rodabanca de mármore ou granito","m",333,{"$f":"OFFSET(INDEX(Composições!A:J,MATCH(B47,Composições!B:B,0),10),2,0)","v":1.24},412.92,{"$f":"BDI!$B$17","v":0.2034},1.49,496.17,null,1.24,"","",412.92,"",1.49,"",496.17,""]
["SF-00042","Remoção de rodapés de madeira","m2",10,{"$f":"OFFSET(INDEX(Composições!A:J,MATCH(B48,Composições!B:B,0),10),2,0)","v":5.16},51.6,{"$f":"BDI!$B$17","v":0.2034},6.21,62.1,null,5.15,9.9999999999997868E-3,1.9417475728154925E-3,51.5,0.10000000000000142,6.2,9.9999999999997868E-3,62,0.10000000000000142]
["SF-00043","Remoção de soleira de mármore ou granito","m",20,{"$f":"OFFSET(INDEX(Composições!A:J,MATCH(B49,Composições!B:B,0),10),2,0)","v":7.82},156.4,{"$f":"BDI!$B$17","v":0.2034},9.41,188.2,null,7.81,1.0000000000000675E-2,1.2804097311140429E-3,156.19999999999999,0.20000000000001705,9.4,9.9999999999997868E-3,188,0.19999999999998863]
["SF-00044","Remoção de split/fancolete/ACJ (equipamento unitário)","un",200,{"$f":"OFFSET(INDEX(Composições!A:J,MATCH(B50,Composições!B:B,0),10),2,0)","v":35.47},7094,{"$f":"BDI!$B$17","v":0.2034},42.68,8536,null,35.47,"","",7094,"",42.68,"",8536,""]
["SF-00045","Remoção de vidro comum / espelho","m2",53,{"$f":"OFFSET(INDEX(Composições!A:J,MATCH(B51,Composições!B:B,0),10),2,0)","v":11.81},625.92999999999995,{"$f":"BDI!$B$17","v":0.2034},14.21,753.13,null,11.81,"","",625.92999999999995,"",14.21,"",753.13,""]
["SF-00046","Retirada de entulhos","m3",410,{"$f":"OFFSET(INDEX(Composições!A:J,MATCH(B52,Composições!B:B,0),10),2,0)","v":14.21},5826.1,{"$f":"BDI!$B$17","v":0.2034},17.100000000000001,7011,null,14.21,"","",5826.1,"",17.100000000000001,"",7011,""]
["SF-00047","Absorvedor de energia para linha de vida","un",5,450,2250,{"$f":"BDI!$B$17","v":0.2034},541.53,2707.65,null,450,"","",2250,"",541.53,"",2707.65,""]
["SF-00048","Andaime fachadeiro","m2 x mês",350,{"$f":"OFFSET(INDEX(Composições!A:J,MATCH(B54,Composições!B:B,0),10),2,0)","v":3.59},1256.5,{"$f":"BDI!$B$17","v":0.2034},4.32,1512,null,3.59,"","",1256.5,"",4.32,"",1512,""]
["SF-00049","Andaime tubular (aluguel/mês)","m x mês",70,12,840,{"$f":"BDI!$B$17","v":0.2034},14.44,1010.8,null,12,"","",840,"",14.44,"",1010.8,""]
["SF-00050","Cabo de aço com 8 mm de diâmetro galvanizado para linha de vida","m",280,18,5040,{"$f":"BDI!$B$17","v":0.2034},21.66,6064.8,null,18,"","",5040,"",21.66,"",6064.8,""]
["SF-00051","Corda de poliamida 12 mm tipo bombeiro, para trabalho em altura","m",84,{"$f":"OFFSET(INDEX(Composições!A:J,MATCH(B57,Composições!B:B,0),10),2,0)","v":4.37},367.08,{"$f":"BDI!$B$17","v":0.2034},5.26,441.84,null,4.37,"","",367.08,"",5.26,"",441.84,""]
["SF-00052","Ensaio de ponto de ancoragem existente","un",28,291.07,8149.96,{"$f":"BDI!$B$17","v":0.2034},350.27,9807.56,null,291.07,"","",8149.96,"",350.27,"",9807.56,""]
["SF-00053","Escadas de acesso para andaime tubular","m x mês",40,6.15,246,{"$f":"BDI!$B$17","v":0.2034},7.4,296,null,6.15,"","",246,"",7.4,"",296,""]
["SF-00055","Guarda-corpo com rodapé para andaime tubular","m x mês",50,60,3000,{"$f":"BDI!$B$17","v":0.2034},72.2,3610,null,60,"","",3000,"",72.2,"",3610,""]
["SF-00057","Isolamento de obra com tela plástica com malha de 5mm e estrutura de madeira pontaleteada","m2",280,{"$f":"OFFSET(INDEX(Composições!A:J,MATCH(B61,Composições!B:B,0),10),2,0)","v":19.639999999999997},5499.2,{"$f":"BDI!$B$17","v":0.2034},23.63,6616.4,null,19.64,"","",5499.2,"",23.63,"",6616.4,""]
["SF-00058","Suporte intermediário curvo para linha de vida","un",5,650,3250,{"$f":"BDI!$B$17","v":0.2034},782.21,3911.05,null,650,"","",3250,"",782.21,"",3911.05,""]
["SF-00060","Kit para montagem de dois olhais","un",5,123.11,615.54999999999995,{"$f":"BDI!$B$17","v":0.2034},148.15,740.75,null,123.11,"","",615.54999999999995,"",148.15,"",740.75,""]
["SF-00061","Manilha com travamento por porca e cupilha","un",14,33.03,462.42,{"$f":"BDI!$B$17","v":0.2034},39.75,556.5,null,33.03,"","",462.42,"",39.75,"",556.5,""]
["SF-00062","Pilar de ancoragem para linha de vida","un",14,484.89,6788.46,{"$f":"BDI!$B$17","v":0.2034},583.52,8169.28,null,484.89,"","",6788.46,"",583.52,"",8169.28,""]
["SF-00063","Piso metálico para andaime tubular","m2 x mês",50,54,2700,{"$f":"BDI!$B$17","v":0.2034},64.98,3249,null,54,"","",2700,"",64.98,"",3249,""]
["SF-00065","Placa de ancoragem para montagem no pilar","un",10,141.83000000000001,1418.3,{"$f":"BDI!$B$17","v":0.2034},170.68,1706.8,null,141.83000000000001,"","",1418.3,"",170.68,"",1706.8,""]
["SF-00066","Ponto de ancoragem","un",32,150,{"$f":"IF(ISNUMBER(E68),ROUND(D68*E68,2),\"-\")","v":4800},{"$f":"BDI!$B$17","v":0.2034},{"$f":"IF(ISNUMBER(E68),ROUND(E68*(1+G68),2),0)","v":180.51},5776.32,null,150,"","",4800,"",180.51,"",5776.32,""]
["SF-00067","Sapatas e rodízios para andaime tubular","conj x mês",25,57,1425,{"$f":"BDI!$B$17","v":0.2034},68.59,1714.75,null,57,"","",1425,"",68.59,"",1714.75,""]
["SF-00068","Sistema Guarda-corpo-Rodapé (GcR) metálico","m x mês",315,10,3150,{"$f":"BDI!$B$17","v":0.2034},12.03,3789.45,null,10,"","",3150,"",12.03,"",3789.45,""]
["SF-00069","Suporte intermediário para linha de vida","un",17,227.12,3861.04,{"$f":"BDI!$B$17","v":0.2034},273.32,4646.4399999999996,null,227.12,"",{"$f":"IF(ISNUMBER(L71),L71/K71,\"\")","v":""},3861.04,"",273.32,"",4646.4399999999996,""]
["SF-00070","Tapume","m2",55,{"$f":"OFFSET(INDEX(Composições!A:J,MATCH(B72,Composições!B:B,0),10),2,0)","v":46.75},2571.25,{"$f":"BDI!$B$17","v":0.2034},56.26,{"$f":"ROUND(H72*D72,2)","v":3094.3},null,46.75,{"$f":"IF(E72=K72,\"\",E72-K72)","v":""},"",2571.25,{"$f":"IF(F72=N72,\"\",F72-N72)","v":""},56.26,{"$f":"IF(H72=P72,\"\",H72-P72)","v":""},3094.3,{"$f":"IF(I72=R72,\"\",I72-R72)","v":""}]
["SF-00071","Trole para linha de vida horizontal","un",5,264.01,1320.05,{"$f":"BDI!$B$17","v":0.2034},317.70999999999998,1588.55,null,264.01,"","",1320.05,"",317.70999999999998,"",1588.55,""]
["SF-00073","Limpeza final de obra","m2",5904,{"$f":"OFFSET(INDEX(Composições!A:J,MATCH(B74,Composições!B:B,0),10),2,0)","v":2.13},12575.52,{"$f":"BDI!$B$17","v":0.2034},2.56,15114.24,null,2.13,"","",12575.52,"",2.56,"",15114.24,""]
["SF-00074","Abertura/fechamento rasgo em alvenaria","m",3000,{"$f":"OFFSET(INDEX(Composições!A:J,MATCH(B75,Composições!B:B,0),10),2,0)","v":14.190000000000001},42570,{"$f":"BDI!$B$17","v":0.2034},17.079999999999998,51240,null,14.08,0.11000000000000121,7.812500000000085E-3,42240,330,16.940000000000001,0.13999999999999702,50820,420]
["SF-00075","Furo em concreto de até 75mm de diâmetro","un",20,{"$f":"OFFSET(INDEX(Composições!A:J,MATCH(B76,Composições!B:B,0),10),2,0)","v":71.14},1422.8,{"$f":"BDI!$B$17","v":0.2034},85.61,1712.2,null,71.14,"","",1422.8,"",85.61,"",1712.2,""]
["SF-00076","Furo em concreto para diâmetros maiores que 75mm","un",20,{"$f":"OFFSET(INDEX(Composições!A:J,MATCH(B77,Composições!B:B,0),10),2,0)","v":90.86},1817.2,{"$f":"BDI!$B$17","v":0.2034},109.34,2186.8000000000002,null,90.86,"","",1817.2,"",109.34,"",2186.8000000000002,""]
["SF-00077","Concreto virado em betoneira, fck = 15 MPa","m3",10,{"$f":"OFFSET(INDEX(Composições!A:J,MATCH(B78,Composições!B:B,0),10),2,0)","v":414.28000000000009},4142.8,{"$f":"BDI!$B$17","v":0.2034},498.54,4985.3999999999996,null,414.03,0.25000000000011369,6.0382097915637439E-4,4140.3,2.5,498.24,0.30000000000001137,4982.3999999999996,3]
["SF-00078","Concreto virado em betoneira, fck = 25MPa","m3",10,{"$f":"OFFSET(INDEX(Composições!A:J,MATCH(B79,Composições!B:B,0),10),2,0)","v":441.39000000000004},4413.8999999999996,{"$f":"BDI!$B$17","v":0.2034},531.16999999999996,5311.7,null,441.02,0.37000000000006139,8.3896421930992112E-4,4410.2,3.6999999999998181,530.72,0.44999999999993179,5307.2,4.5]
["SF-00079","Escoramento metálico","m2 x mês",100,{"$f":"OFFSET(INDEX(Composições!A:J,MATCH(B80,Composições!B:B,0),10),2,0)","v":7.06},706,{"$f":"BDI!$B$17","v":0.2034},8.5,850,null,7.07,-1.0000000000000675E-2,-1.4144271570015099E-3,707,-1,8.51,-9.9999999999997868E-3,851,-1]
["SF-00080","Estrutura metálica em aço","kg",105,{"$f":"OFFSET(INDEX(Composições!A:J,MATCH(B81,Composições!B:B,0),10),2,0)","v":14.109999999999998},1481.55,{"$f":"BDI!$B$17","v":0.2034},16.98,1782.9,null,14.14,-3.0000000000002913E-2,-2.1216407355023276E-3,1484.7,-3.1500000000000909,17.02,-3.9999999999999147E-2,1787.1,-4.1999999999998181]
["SF-00081","Forma para estruturas de concreto","m2",100,{"$f":"OFFSET(INDEX(Composições!A:J,MATCH(B82,Composições!B:B,0),10),2,0)","v":99.97},9997,{"$f":"BDI!$B$17","v":0.2034},120.3,12030,null,99.97,"","",9997,"",120.3,"",12030,""]
["SF-00082","Verga/contraverga/cinta em bloco de concreto canaleta 11,5 x 19 x 39 cm","m",20,{"$f":"OFFSET(INDEX(Composições!A:J,MATCH(B83,Composições!B:B,0),10),2,0)","v":22.25},445,{"$f":"BDI!$B$17","v":0.2034},26.78,535.6,null,21.67,0.57999999999999829,2.6765113059529222E-2,433.4,11.600000000000023,26.08,0.70000000000000284,521.6,14]
["SF-00083","Impermeabilização de superfície com revestimento bicomponente semi flexível","m2",500,{"$f":"OFFSET(INDEX(Composições!A:J,MATCH(B84,Composições!B:B,0),10),2,0)","v":26.61},13305,{"$f":"BDI!$B$17","v":0.2034},32.020000000000003,16010,null,26.6,9.9999999999980105E-3,3.7593984962398536E-4,13300,5,32.01,1.0000000000005116E-2,16005,5]
["SF-00084","Alvenaria de vedação","m2",250,{"$f":"OFFSET(INDEX(Composições!A:J,MATCH(B85,Composições!B:B,0),10),2,0)","v":53.150000000000006},13287.5,{"$f":"BDI!$B$17","v":0.2034},63.96,15990,null,52.79,0.36000000000000654,6.81947338511094E-3,13197.5,90,63.53,0.42999999999999972,15882.5,107.5]
["SF-00085","Fechamento ou shaft em gesso acartonado tipo drywall","m2",10,{"$f":"OFFSET(INDEX(Composições!A:J,MATCH(B86,Composições!B:B,0),10),2,0)","v":47.159999999999989},471.6,{"$f":"BDI!$B$17","v":0.2034},56.75,567.5,null,47.24,-8.0000000000012506E-2,-1.6934801016090708E-3,472.4,-0.79999999999995453,56.85,-0.10000000000000142,568.5,-1]
["SF-00086","Fixação (encunhamento) de Alvenaria de Vedação","m",30,{"$f":"OFFSET(INDEX(Composições!A:J,MATCH(B87,Composições!B:B,0),10),2,0)","v":16.880000000000003},506.4,{"$f":"BDI!$B$17","v":0.2034},20.309999999999999,609.29999999999995,null,16.649999999999999,0.23000000000000398,1.3813813813814054E-2,499.5,6.8999999999999773,20.04,0.26999999999999957,601.20000000000005,8.0999999999999091]
["SF-00087","Parede em gesso acartonado (drywall)","m2",400,{"$f":"OFFSET(INDEX(Composições!A:J,MATCH(B88,Composições!B:B,0),10),2,0)","v":76.41},30564,{"$f":"BDI!$B$17","v":0.2034},91.95,36780,null,76.52,-0.10999999999999943,-1.4375326711970652E-3,30608,-44,92.08,-0.12999999999999545,36832,-52]
["SF-00088","Reparos superficiais em painéis de gesso acartonado","m2",20,{"$f":"OFFSET(INDEX(Composições!A:J,MATCH(B89,Composições!B:B,0),10),2,0)","v":5.2200000000000006},104.4,{"$f":"BDI!$B$17","v":0.2034},6.28,125.6,null,5.21,1.0000000000000675E-2,1.9193857965452352E-3,104.2,0.20000000000000284,6.27,1.0000000000000675E-2,125.4,0.19999999999998863]
["SF-00089","Sóculo h=10 cm","m2",20,{"$f":"OFFSET(INDEX(Composições!A:J,MATCH(B90,Composições!B:B,0),10),2,0)","v":55.139999999999993},1102.8,{"$f":"BDI!$B$17","v":0.2034},66.36,1327.2,null,54,1.1399999999999935,2.111111111111099E-2,1080,22.799999999999955,64.98,1.3799999999999955,1299.5999999999999,27.600000000000136]
["SF-00090","Chapisco colante industrializado em vigas e pilares","m2",50,{"$f":"OFFSET(INDEX(Composições!A:J,MATCH(B91,Composições!B:B,0),10),2,0)","v":10.58},529,{"$f":"BDI!$B$17","v":0.2034},12.73,636.5,null,10.59,-9.9999999999997868E-3,-9.4428706326721312E-4,529.5,-0.5,12.74,-9.9999999999997868E-3,637,-0.5]
["SF-00091","Chapisco com argamassa traço 1:3","m2",500,{"$f":"OFFSET(INDEX(Composições!A:J,MATCH(B92,Composições!B:B,0),10),2,0)","v":3.31},1655,{"$f":"BDI!$B$17","v":0.2034},3.98,1990,null,3.19,0.12000000000000011,3.7617554858934206E-2,1595,60,3.84,0.14000000000000012,1920,70]
["SF-00092","Gesso cola","m2",440,{"$f":"OFFSET(INDEX(Composições!A:J,MATCH(B93,Composições!B:B,0),10),2,0)","v":12.09},5319.6,{"$f":"BDI!$B$17","v":0.2034},14.55,6402,null,12.08,9.9999999999997868E-3,8.2781456953640617E-4,5315.2,4.4000000000005457,14.54,1.0000000000001563E-2,6397.6,4.3999999999996362]
["SF-00093","Reboco com argamassa industrializada e=2,0 cm","m2",600,{"$f":"OFFSET(INDEX(Composições!A:J,MATCH(B94,Composições!B:B,0),10),2,0)","v":26.160000000000004},15696,{"$f":"BDI!$B$17","v":0.2034},31.48,18888,null,26,0.16000000000000369,6.1538461538462961E-3,15600,96,31.29,0.19000000000000128,18774,114]
["SF-00094","Regularização com argamassa industrializada e=0,5 cm","m2",200,{"$f":"OFFSET(INDEX(Composições!A:J,MATCH(B95,Composições!B:B,0),10),2,0)","v":9.36},1872,{"$f":"BDI!$B$17","v":0.2034},11.26,2252,null,9.32,3.9999999999999147E-2,4.2918454935621398E-3,1864,8,11.22,3.9999999999999147E-2,2244,8]
["SF-00095","Tratamento de trincas superficiais","m",100,{"$f":"OFFSET(INDEX(Composições!A:J,MATCH(B96,Composições!B:B,0),10),2,0)","v":16.09},1609,{"$f":"BDI!$B$17","v":0.2034},19.36,1936,null,16.079999999999998,1.0000000000001563E-2,6.2189054726377883E-4,1608,1,19.350000000000001,9.9999999999980105E-3,1935,1]
["SF-00096","Aplicação de fundo selador base água","m2",5400,{"$f":"OFFSET(INDEX(Composições!A:J,MATCH(B97,Composições!B:B,0),10),2,0)","v":3.6399999999999997},19656,{"$f":"BDI!$B$17","v":0.2034},4.38,23652,null,3.65,-1.0000000000000231E-2,-2.7397260273973236E-3,19710,-54,4.3899999999999997,-9.9999999999997868E-3,23706,-54]
["SF-00097","Fundo anticorrosivo e de aderência (base água)","m2",400,{"$f":"OFFSET(INDEX(Composições!A:J,MATCH(B98,Composições!B:B,0),10),2,0)","v":18.29},7316,{"$f":"BDI!$B$17","v":0.2034},22.01,8804,null,18.3,-1.0000000000001563E-2,-5.4644808743177942E-4,7320,-4,22.02,-9.9999999999980105E-3,8808,-4]
["SF-00098","Massa acrílica","m2",500,{"$f":"OFFSET(INDEX(Composições!A:J,MATCH(B99,Composições!B:B,0),10),2,0)","v":15.059999999999999},7530,{"$f":"BDI!$B$17","v":0.2034},18.12,9060,null,15.06,"","",7530,"",18.12,"",9060,""]
["SF-00099","Massa corrida","m2",2700,{"$f":"OFFSET(INDEX(Composições!A:J,MATCH(B100,Composições!B:B,0),10),2,0)","v":11.54},31158,{"$f":"BDI!$B$17","v":0.2034},13.89,37503,null,11.54,"","",31158,"",13.89,"",37503,""]
["SF-00100","Pintura com tinta látex acrílica Premium (paredes)","m2",9000,{"$f":"OFFSET(INDEX(Composições!A:J,MATCH(B101,Composições!B:B,0),10),2,0)","v":10.98},98820,{"$f":"BDI!$B$17","v":0.2034},13.21,118890,null,10.98,"","",98820,"",13.21,"",118890,""]
["SF-00101","Pintura em verniz sintético","m2",300,{"$f":"OFFSET(INDEX(Composições!A:J,MATCH(B102,Composições!B:B,0),10),2,0)","v":17.600000000000001},5280,{"$f":"BDI!$B$17","v":0.2034},21.18,6354,null,17.61,-9.9999999999980105E-3,-5.6785917092549748E-4,5283,-3,21.19,-1.0000000000001563E-2,6357,-3]
["SF-00102","Pintura esmalte acetinado (metais e madeiras)","m2",650,{"$f":"OFFSET(INDEX(Composições!A:J,MATCH(B103,Composições!B:B,0),10),2,0)","v":23.26},15119,{"$f":"BDI!$B$17","v":0.2034},27.99,18193.5,null,23.26,"","",15119,"",27.99,"",18193.5,""]
["SF-00103","Pintura tinta látex acrílica standard (tetos)","m2",6000,{"$f":"OFFSET(INDEX(Composições!A:J,MATCH(B104,Composições!B:B,0),10),2,0)","v":12.42},74520,{"$f":"BDI!$B$17","v":0.2034},14.95,89700,null,12.43,-9.9999999999997868E-3,-8.0450522928397316E-4,74580,-60,14.96,-1.0000000000001563E-2,89760,-60]
["SF-00104","Cerâmica para revestimento de superfícies internas ou externas – Linha Administrativa","m2",200,{"$f":"OFFSET(INDEX(Composições!A:J,MATCH(B105,Composições!B:B,0),10),2,0)","v":73.849999999999994},14770,{"$f":"BDI!$B$17","v":0.2034},88.87,17774,null,73.86,-1.0000000000005116E-2,-1.3539128080158566E-4,14772,-2,88.88,-9.9999999999909051E-3,17776,-2]
["SF-00105","Contrapiso em argamassa","m2",60,{"$f":"OFFSET(INDEX(Composições!A:J,MATCH(B106,Composições!B:B,0),10),2,0)","v":39.96},2397.6,{"$f":"BDI!$B$17","v":0.2034},48.09,2885.4,null,37.65,2.3100000000000023,6.1354581673306832E-2,2259,138.59999999999991,45.31,2.7800000000000011,2718.6,166.80000000000018]
["SF-00106","Contrapiso em argamassa (e=2cm) ou Regularização de contrapiso existente","m2",550,{"$f":"OFFSET(INDEX(Composições!A:J,MATCH(B107,Composições!B:B,0),10),2,0)","v":27.330000000000002},15031.5,{"$f":"BDI!$B$17","v":0.2034},32.89,18089.5,null,25.99,1.3400000000000034,5.1558291650634996E-2,14294.5,737,31.28,1.6099999999999994,17204,885.5]
["SF-00107","Granito cinza andorinha para piso","m2",1050,{"$f":"OFFSET(INDEX(Composições!A:J,MATCH(B108,Composições!B:B,0),10),2,0)","v":164.38},172599,{"$f":"BDI!$B$17","v":0.2034},197.81,207700.5,null,164.43,-5.0000000000011369E-2,-3.0408076385094791E-4,172651.5,-52.5,197.88,-6.9999999999993179E-2,207774,-73.5]
["SF-00108","Granito Cinza Andorinha para rodapé","m2",270,{"$f":"OFFSET(INDEX(Composições!A:J,MATCH(B109,Composições!B:B,0),10),2,0)","v":256.03999999999996},69130.8,{"$f":"BDI!$B$17","v":0.2034},308.12,83192.399999999994,null,256.07,-3.0000000000029559E-2,-1.1715546530257179E-4,69138.899999999994,-8.0999999999912689,308.14999999999998,-2.9999999999972715E-2,83200.5,-8.1000000000058208]
["SF-00109","Granito Cinza Andorinha para soleira e peitoril","m2",25,{"$f":"OFFSET(INDEX(Composições!A:J,MATCH(B110,Composições!B:B,0),10),2,0)","v":213.47000000000003},5336.75,{"$f":"BDI!$B$17","v":0.2034},256.89,6422.25,null,213.53,-5.9999999999973852E-2,-2.8099096145728402E-4,5338.25,-1.5,256.95999999999998,-6.9999999999993179E-2,6424,-1.75]
["SF-00110","Granito Preto São Gabriel para piso","m2",30,{"$f":"OFFSET(INDEX(Composições!A:J,MATCH(B111,Composições!B:B,0),10),2,0)","v":222.38},6671.4,{"$f":"BDI!$B$17","v":0.2034},267.61,8028.3,null,222.43,-5.0000000000011369E-2,-2.2478982151693283E-4,6672.9,-1.5,267.67,-6.0000000000002274E-2,8030.1,-1.8000000000001819]
["SF-00111","Granito Preto São Gabriel para rodapé","m2",3,{"$f":"OFFSET(INDEX(Composições!A:J,MATCH(B112,Composições!B:B,0),10),2,0)","v":375.2},1125.5999999999999,{"$f":"BDI!$B$17","v":0.2034},451.52,1354.56,null,375.23,-3.0000000000029559E-2,-7.9950963409187854E-5,1125.69,-9.0000000000145519E-2,451.55,-3.0000000000029559E-2,1354.65,-9.0000000000145519E-2]
["SF-00112","Granito Preto São Gabriel para soleira e peitoril","m2",2,{"$f":"OFFSET(INDEX(Composições!A:J,MATCH(B113,Composições!B:B,0),10),2,0)","v":288.47000000000003},576.94000000000005,{"$f":"BDI!$B$17","v":0.2034},347.14,694.28,null,288.52999999999997,-5.999999999994543E-2,-2.0795064637973672E-4,577.05999999999995,-0.11999999999989086,347.22,-8.0000000000040927E-2,694.44,-0.16000000000008185]
["SF-00113","Instalação de rodapé de madeira reaproveitado","m",70,{"$f":"OFFSET(INDEX(Composições!A:J,MATCH(B114,Composições!B:B,0),10),2,0)","v":6.3599999999999994},445.2,{"$f":"BDI!$B$17","v":0.2034},7.65,535.5,null,6.36,"","",445.2,"",7.65,"",535.5,""]
["SF-00114","Mármore Bege Bahia para piso e parede","m2",10,{"$f":"OFFSET(INDEX(Composições!A:J,MATCH(B115,Composições!B:B,0),10),2,0)","v":222.38},2223.8000000000002,{"$f":"BDI!$B$17","v":0.2034},267.61,2676.1,null,222.43,-5.0000000000011369E-2,-2.2478982151693283E-4,2224.3000000000002,-0.5,267.67,-6.0000000000002274E-2,2676.7,-0.59999999999990905]
["SF-00115","Mármore Branco Especial para piso e parede","m2",40,{"$f":"OFFSET(INDEX(Composições!A:J,MATCH(B116,Composições!B:B,0),10),2,0)","v":373.17999999999995},14927.2,{"$f":"BDI!$B$17","v":0.2034},449.08,17963.2,null,373.23,-5.0000000000068212E-2,-1.3396565120721328E-4,14929.2,-2,449.14,-6.0000000000002274E-2,17965.599999999999,-2.3999999999978172]
["SF-00116","Rodapé de madeira","m",70,{"$f":"OFFSET(INDEX(Composições!A:J,MATCH(B117,Composições!B:B,0),10),2,0)","v":15.629999999999999},1094.0999999999999,{"$f":"BDI!$B$17","v":0.2034},18.809999999999999,1316.7,null,15.63,"","",1094.0999999999999,"",18.809999999999999,"",1316.7,""]
["SF-00117","Acabamento abaulado em placas de granito ou mármore reaproveitadas","m",20,22.5,450,{"$f":"BDI!$B$17","v":0.2034},27.08,541.6,null,22.5,"","",450,"",27.08,"",541.6,""]
["SF-00118","Acabamento em meia esquadria em placas de granito ou mármore reaproveitadas","m",20,10,200,{"$f":"BDI!$B$17","v":0.2034},12.03,240.6,null,10,"","",200,"",12.03,"",240.6,""]
["SF-00119","Acabamento reto em placas de granito ou mármore reaproveitadas","m",20,10,200,{"$f":"BDI!$B$17","v":0.2034},12.03,240.6,null,10,"","",200,"",12.03,"",240.6,""]
["SF-00120","Corte de peça de granito ou mármore reaproveitada","m",20,13.52,270.39999999999998,{"$f":"BDI!$B$17","v":0.2034},16.27,325.39999999999998,null,13.52,"","",270.39999999999998,"",16.27,"",325.39999999999998,""]
["SF-00121","Corte em placas de granito ou mármore reaproveitadas, para instalação de cubas","un",20,{"$f":"OFFSET(INDEX(Composições!A:J,MATCH(B122,Composições!B:B,0),10),2,0)","v":61.25},1225,{"$f":"BDI!$B$17","v":0.2034},73.709999999999994,1474.2,null,61.25,"","",1225,"",73.709999999999994,"",1474.2,""]
["SF-00122","Furo em placas de granito ou mármore reaproveitadas, para instalação de torneira ou misturador","un",20,{"$f":"OFFSET(INDEX(Composições!A:J,MATCH(B123,Composições!B:B,0),10),2,0)","v":9.18},183.6,{"$f":"BDI!$B$17","v":0.2034},11.05,221,null,9.18,"","",183.6,"",11.05,"",221,""]
["SF-00123","Granito Cinza Andorinha 20mm para rodabancada","m2",30,{"$f":"OFFSET(INDEX(Composições!A:J,MATCH(B124,Composições!B:B,0),10),2,0)","v":178.61},5358.3,{"$f":"BDI!$B$17","v":0.2034},214.94,6448.2,null,178.65,-3.9999999999992042E-2,-2.2390148334728262E-4,5359.5,-1.1999999999998181,214.99,-5.0000000000011369E-2,6449.7,-1.5]
["SF-00124","Granito Cinza Andorinha 20mm para bancadas","m2",50,{"$f":"OFFSET(INDEX(Composições!A:J,MATCH(B125,Composições!B:B,0),10),2,0)","v":191.88000000000002},9594,{"$f":"BDI!$B$17","v":0.2034},230.91,11545.5,null,191.88,"","",9594,"",230.91,"",11545.5,""]
["SF-00125","Granito Cinza Andorinha 30mm para divisória","m2",100,{"$f":"OFFSET(INDEX(Composições!A:J,MATCH(B126,Composições!B:B,0),10),2,0)","v":307.77000000000004},30777,{"$f":"BDI!$B$17","v":0.2034},370.37,37037,null,307.64,0.1300000000000523,4.2257183721249611E-4,30764,13,370.21,0.16000000000002501,37021,16]
["SF-00126","Granito Preto São Gabriel 20mm para rodabancada","m2",30,{"$f":"OFFSET(INDEX(Composições!A:J,MATCH(B127,Composições!B:B,0),10),2,0)","v":256.61},7698.3,{"$f":"BDI!$B$17","v":0.2034},308.8,9264,null,256.64999999999998,-3.999999999996362E-2,-1.5585427625156291E-4,7699.5,-1.1999999999998181,308.85000000000002,-5.0000000000011369E-2,9265.5,-1.5]
["SF-00127","Granito Preto São Gabriel 20mm para bancadas","m2",8,{"$f":"OFFSET(INDEX(Composições!A:J,MATCH(B128,Composições!B:B,0),10),2,0)","v":313},2504,{"$f":"BDI!$B$17","v":0.2034},376.66,3013.28,null,313,"","",2504,"",376.66,"",3013.28,""]
["SF-00128","Instalação de bancada de granito ou mármore reaproveitada","m2",30,{"$f":"OFFSET(INDEX(Composições!A:J,MATCH(B129,Composições!B:B,0),10),2,0)","v":46.88},1406.4,{"$f":"BDI!$B$17","v":0.2034},56.42,1692.6,null,46.88,"","",1406.4,"",56.42,"",1692.6,""]
["SF-00129","Instalação de rodapé reaproveitado, de mármore ou granito","m2",15,{"$f":"OFFSET(INDEX(Composições!A:J,MATCH(B130,Composições!B:B,0),10),2,0)","v":8.07},121.05,{"$f":"BDI!$B$17","v":0.2034},9.7100000000000009,145.65,null,8.08,-9.9999999999997868E-3,-1.2376237623762112E-3,121.2,-0.15000000000000568,9.7200000000000006,-9.9999999999997868E-3,145.80000000000001,-0.15000000000000568]
["SF-00130","Instalação de soleira ou peitoril, de mármore ou granito, reaproveitados","m2",10,{"$f":"OFFSET(INDEX(Composições!A:J,MATCH(B131,Composições!B:B,0),10),2,0)","v":36.51},{"$f":"IF(ISNUMBER(E131),ROUND(D131*E131,2),\"-\")","v":365.1},{"$f":"BDI!$B$17","v":0.2034},{"$f":"IF(ISNUMBER(E131),ROUND(E131*(1+G131),2),0)","v":43.94},439.4,null,36.56,-5.0000000000004263E-2,-1.3676148796500072E-3,365.6,-0.5,44,-6.0000000000002274E-2,440,-0.60000000000002274]
["SF-00131","Mármore Branco Especial 20mm para rodabancada","m2",1,{"$f":"OFFSET(INDEX(Composições!A:J,MATCH(B132,Composições!B:B,0),10),2,0)","v":338.38},338.38,{"$f":"BDI!$B$17","v":0.2034},407.21,407.21,null,338.43,-5.0000000000011369E-2,-1.4774103950598755E-4,338.43,-5.0000000000011369E-2,407.27,-6.0000000000002274E-2,407.27,-6.0000000000002274E-2]
["SF-00132","Divisória em gesso acartonado revestido - Painel liso cego - Ed. Anexo I","m2",500,450,225000,{"$f":"BDI!$G$17","v":0.11},499.5,249750,null,450,"","",225000,"",499.5,"",249750,""]
["SF-00133","Divisória em gesso acartonado revestido - Painel liso, painel de vidro e bandeira – ed. Anexo I","m2",500,850,425000,{"$f":"BDI!$G$17","v":0.11},943.5,471750,null,850,"","",425000,"",943.5,"",471750,""]
["SF-00134","Divisória MDF com painel liso cego e bandeira","m2",1000,608.08000000000004,608080,{"$f":"BDI!$G$17","v":0.11},674.97,674970,null,608.08000000000004,"",{"$f":"IF(ISNUMBER(L135),L135/K135,\"\")","v":""},608080,"",674.97,"",674970,""]
["SF-00135","Divisória MDF com painel liso, painel de vidro e bandeira","m2",1000,816.25,816250,{"$f":"BDI!$G$17","v":0.11},906.04,{"$f":"ROUND(H136*D136,2)","v":906040},null,816.25,{"$f":"IF(E136=K136,\"\",E136-K136)","v":""},"",816250,{"$f":"IF(F136=N136,\"\",F136-N136)","v":""},906.04,{"$f":"IF(H136=P136,\"\",H136-P136)","v":""},906040,{"$f":"IF(I136=R136,\"\",I136-R136)","v":""}]
["SF-00136","Divisória MDF com painel paginado cego e bandeira - Interlegis","m2",200,749.45,149890,{"$f":"BDI!$G$17","v":0.11},831.89,166378,null,749.45,"","",149890,"",831.89,"",166378,""]
["SF-00137","Divisória MDF com painel paginado, painel de vidro e bandeira - Interlegis","m2",200,965.66,193132,{"$f":"BDI!$G$17","v":0.11},1071.8800000000001,214376,null,965.66,"","",193132,"",1071.8800000000001,"",214376,""]
["SF-00138","Instalação de divisória e porta de divisória com dobradiça reaproveitadas","m2",700,{"$f":"OFFSET(INDEX(Composições!A:J,MATCH(B139,Composições!B:B,0),10),2,0)","v":12.56},8792,{"$f":"BDI!$B$17","v":0.2034},15.11,10577,null,12.56,"","",8792,"",15.11,"",10577,""]
["SF-00139","Alçapão em forro de gesso acartonado","m2",100,{"$f":"OFFSET(INDEX(Composições!A:J,MATCH(B140,Composições!B:B,0),10),2,0)","v":92.52},9252,{"$f":"BDI!$B$17","v":0.2034},111.34,11134,null,92.53,-1.0000000000005116E-2,-1.0807305738684877E-4,9253,-1,111.35,-9.9999999999909051E-3,11135,-1]
["SF-00140","Forro de PVC em réguas de 100 x 6000mm","m2",50,{"$f":"OFFSET(INDEX(Composições!A:J,MATCH(B141,Composições!B:B,0),10),2,0)","v":33.32},1666,{"$f":"BDI!$B$17","v":0.2034},40.1,2005,null,33.35,-3.0000000000001137E-2,-8.9955022488759026E-4,1667.5,-1.5,40.130000000000003,-3.0000000000001137E-2,2006.5,-1.5]
["SF-00141","Forro de PVC em réguas de 100 x 6000mm, sem estrutura","m2",100,{"$f":"OFFSET(INDEX(Composições!A:J,MATCH(B142,Composições!B:B,0),10),2,0)","v":22.21},2221,{"$f":"BDI!$B$17","v":0.2034},26.73,2673,null,22.23,-1.9999999999999574E-2,-8.9968511021140684E-4,2223,-2,26.75,-1.9999999999999574E-2,2675,-2]
["SF-00142","Forro de PVC modular em placas","m2",20,{"$f":"OFFSET(INDEX(Composições!A:J,MATCH(B143,Composições!B:B,0),10),2,0)","v":62.02000000000001},1240.4000000000001,{"$f":"BDI!$B$17","v":0.2034},74.63,1492.6,null,62.04,-1.9999999999988916E-2,-3.2237266279801604E-4,1240.8,-0.39999999999986358,74.66,-3.0000000000001137E-2,1493.2,-0.60000000000013642]
["SF-00144","Forro em gesso acartonado monolítico","m2",2500,{"$f":"OFFSET(INDEX(Composições!A:J,MATCH(B144,Composições!B:B,0),10),2,0)","v":54.680000000000007},136700,{"$f":"BDI!$B$17","v":0.2034},65.8,164500,null,54.73,-4.9999999999990052E-2,-9.1357573542828535E-4,136825,-125,65.86,-6.0000000000002274E-2,164650,-150]
["SF-00145","Forro em gesso acartonado monolítico, sem estrutura","m2",2300,{"$f":"OFFSET(INDEX(Composições!A:J,MATCH(B145,Composições!B:B,0),10),2,0)","v":41.930000000000007},96439,{"$f":"BDI!$B$17","v":0.2034},50.46,116058,null,41.97,-3.9999999999992042E-2,-9.5306171074558115E-4,96531,-92,50.51,-4.9999999999997158E-2,116173,-115]
["SF-00146","Forro mineral modulado","m2",300,{"$f":"OFFSET(INDEX(Composições!A:J,MATCH(B146,Composições!B:B,0),10),2,0)","v":65.040000000000006},19512,{"$f":"BDI!$B$17","v":0.2034},78.27,23481,null,65.040000000000006,"","",19512,"",78.27,"",23481,""]
["SF-00147","Forro mineral modulado, sem estrutura","m2",100,{"$f":"OFFSET(INDEX(Composições!A:J,MATCH(B147,Composições!B:B,0),10),2,0)","v":19.560000000000002},1956,{"$f":"BDI!$B$17","v":0.2034},23.54,2354,null,19.559999999999999,"","",1956,"",23.54,"",2354,""]
["SF-00148","Instalação de forro de PVC reaproveitado","m2",100,{"$f":"OFFSET(INDEX(Composições!A:J,MATCH(B148,Composições!B:B,0),10),2,0)","v":10.029999999999999},1003,{"$f":"BDI!$B$17","v":0.2034},12.07,1207,null,10.039999999999999,-9.9999999999997868E-3,-9.9601593625495903E-4,1004,-1,12.08,-9.9999999999997868E-3,1208,-1]
["SF-00149","Instalação de forro mineral reaproveitado","m2",100,{"$f":"OFFSET(INDEX(Composições!A:J,MATCH(B149,Composições!B:B,0),10),2,0)","v":37.96},3796,{"$f":"BDI!$B$17","v":0.2034},45.68,4568,null,37.97,-9.9999999999980105E-3,-2.6336581511714538E-4,3797,-1,45.69,-9.9999999999980105E-3,4569,-1]
["SF-00150","Tabica metálica em forro de gesso acartonado","m",3300,{"$f":"OFFSET(INDEX(Composições!A:J,MATCH(B150,Composições!B:B,0),10),2,0)","v":7.68},25344,{"$f":"BDI!$B$17","v":0.2034},9.24,30492,null,7.68,"","",25344,"",9.24,"",30492,""]
["SF-00151","Instalação de revestimento de piso têxtil (carpete) reaproveitado","m2",400,{"$f":"OFFSET(INDEX(Composições!A:J,MATCH(B151,Composições!B:B,0),10),2,0)","v":5.55},2220,{"$f":"BDI!$B$17","v":0.2034},6.68,2672,null,5.56,-9.9999999999997868E-3,-1.7985611510790984E-3,2224,-4,6.69,-1.0000000000000675E-2,2676,-4]
["SF-00154","Espelho cristal, e=5 mm","m2",130,{"$f":"OFFSET(INDEX(Composições!A:J,MATCH(B152,Composições!B:B,0),10),2,0)","v":409.21},53197.3,{"$f":"BDI!$B$17","v":0.2034},492.44,64017.2,null,409.19,1.999999999998181E-2,4.8877049781230746E-5,53194.7,2.6000000000058208,492.42,1.999999999998181E-2,64014.6,2.5999999999985448]
["SF-00155","Instalação de vidro reaproveitado","m2",50,{"$f":"OFFSET(INDEX(Composições!A:J,MATCH(B153,Composições!B:B,0),10),2,0)","v":20.68},1034,{"$f":"BDI!$B$17","v":0.2034},24.89,1244.5,null,20.69,-1.0000000000001563E-2,-4.8332527791211031E-4,1034.5,-0.5,24.9,-9.9999999999980105E-3,1245,-0.5]
["SF-00159","Instalação de painéis de vidro temperado reaproveitados","m2",100,{"$f":"OFFSET(INDEX(Composições!A:J,MATCH(B154,Composições!B:B,0),10),2,0)","v":35.36},3536,{"$f":"BDI!$B$17","v":0.2034},42.55,4255,null,35.36,"","",3536,"",42.55,"",4255,""]
["SF-00161","Instalação de persianas reaproveitadas","m",1200,{"$f":"OFFSET(INDEX(Composições!A:J,MATCH(B155,Composições!B:B,0),10),2,0)","v":5.63},6756,{"$f":"BDI!$B$17","v":0.2034},6.78,8136,null,5.63,"","",6756,"",6.78,"",8136,""]
["SF-00165","Película jateada","m2",80,89,7120,{"$f":"BDI!$B$17","v":0.2034},107.1,8568,null,89,"","",7120,"",107.1,"",8568,""]
["SF-00166","Tubo de ligação para bacia sanitária","un",15,{"$f":"OFFSET(INDEX(Composições!A:J,MATCH(B157,Composições!B:B,0),10),2,0)","v":59.89},898.35,{"$f":"BDI!$B$17","v":0.2034},72.069999999999993,1081.05,null,59.89,"","",898.35,"",72.069999999999993,"",1081.05,""]
["SF-00167","Tubo PVC esgoto ou aguas pluviais predial DN 100mm","m",215,{"$f":"OFFSET(INDEX(Composições!A:J,MATCH(B158,Composições!B:B,0),10),2,0)","v":40.659999999999997},8741.9,{"$f":"BDI!$B$17","v":0.2034},48.93,10519.95,null,40.659999999999997,"","",8741.9,"",48.93,"",10519.95,""]
["SF-00168","Tubo PVC esgoto ou aguas pluviais predial DN 40mm","m",80,{"$f":"OFFSET(INDEX(Composições!A:J,MATCH(B159,Composições!B:B,0),10),2,0)","v":12.689999999999998},1015.2,{"$f":"BDI!$B$17","v":0.2034},15.27,1221.5999999999999,null,12.67,1.9999999999997797E-2,1.5785319652721229E-3,1013.6,1.6000000000000227,15.25,1.9999999999999574E-2,1220,1.5999999999999091]
["SF-00169","Tubo PVC esgoto ou aguas pluviais predial DN 50mm","m",80,{"$f":"OFFSET(INDEX(Composições!A:J,MATCH(B160,Composições!B:B,0),10),2,0)","v":17.420000000000002},1393.6,{"$f":"BDI!$B$17","v":0.2034},20.96,1676.8,null,17.43,-9.9999999999980105E-3,-5.7372346528961624E-4,1394.4,-0.8000000000001819,20.98,-1.9999999999999574E-2,1678.4,-1.6000000000001364]
["SF-00170","Tubo PVC esgoto ou aguas pluviais predial DN 75mm","m",100,{"$f":"OFFSET(INDEX(Composições!A:J,MATCH(B161,Composições!B:B,0),10),2,0)","v":26.11},2611,{"$f":"BDI!$B$17","v":0.2034},31.42,3142,null,26.13,-1.9999999999999574E-2,-7.654037504783611E-4,2613,-2,31.44,-1.9999999999999574E-2,3144,-2]
["SF-00171","Tubo PVC soldavel agua fria DN 25mm","m",200,{"$f":"OFFSET(INDEX(Composições!A:J,MATCH(B162,Composições!B:B,0),10),2,0)","v":2.88},576,{"$f":"BDI!$B$17","v":0.2034},3.47,694,null,2.88,"","",576,"",3.47,"",694,""]
["SF-00172","Tubo PVC soldavel agua fria DN 32mm","m",100,{"$f":"OFFSET(INDEX(Composições!A:J,MATCH(B163,Composições!B:B,0),10),2,0)","v":5.93},593,{"$f":"BDI!$B$17","v":0.2034},7.14,714,null,5.94,-1.0000000000000675E-2,-1.6835016835017971E-3,594,-1,7.15,-1.0000000000000675E-2,715,-1]
["SF-00173","Tubo PVC soldavel agua fria DN 40mm","m",100,{"$f":"OFFSET(INDEX(Composições!A:J,MATCH(B164,Composições!B:B,0),10),2,0)","v":8.4599999999999991},846,{"$f":"BDI!$B$17","v":0.2034},10.18,1018,null,8.4700000000000006,-1.0000000000001563E-2,-1.1806375442740924E-3,847,-1,10.19,-9.9999999999997868E-3,1019,-1]
["SF-00174","Tubo PVC soldavel agua fria DN 50mm","m",100,{"$f":"OFFSET(INDEX(Composições!A:J,MATCH(B165,Composições!B:B,0),10),2,0)","v":9.74},974,{"$f":"BDI!$B$17","v":0.2034},11.72,1172,null,9.76,-1.9999999999999574E-2,-2.0491803278688088E-3,976,-2,11.75,-2.9999999999999361E-2,1175,-3]
["SF-00175","Base registro gaveta 3/4\"","un",80,{"$f":"OFFSET(INDEX(Composições!A:J,MATCH(B166,Composições!B:B,0),10),2,0)","v":38.949999999999996},3116,{"$f":"BDI!$B$17","v":0.2034},46.87,3749.6,null,38.950000000000003,"","",3116,"",46.87,"",3749.6,""]
["SF-00176","Caixa sifonada de PVC DN 150mm","un",60,{"$f":"OFFSET(INDEX(Composições!A:J,MATCH(B167,Composições!B:B,0),10),2,0)","v":50.86},3051.6,{"$f":"BDI!$B$17","v":0.2034},61.2,3672,null,50.87,-9.9999999999980105E-3,-1.9657951641435052E-4,3052.2,-0.59999999999990905,61.22,-1.9999999999996021E-2,3673.2,-1.1999999999998181]
["SF-00177","Caixa sifonada de PVC DN 250mm","un",60,{"$f":"OFFSET(INDEX(Composições!A:J,MATCH(B168,Composições!B:B,0),10),2,0)","v":87.11999999999999},5227.2,{"$f":"BDI!$B$17","v":0.2034},104.84,6290.4,null,87.13,-1.0000000000005116E-2,-1.1477103179163453E-4,5227.8,-0.6000000000003638,104.85,-9.9999999999909051E-3,6291,-0.6000000000003638]
["SF-00178","Grelha quadrada para ralo 10x10cm","un",60,{"$f":"OFFSET(INDEX(Composições!A:J,MATCH(B169,Composições!B:B,0),10),2,0)","v":47.13},2827.8,{"$f":"BDI!$B$17","v":0.2034},56.72,3403.2,null,47.13,"","",2827.8,"",56.72,"",3403.2,""]
["SF-00179","Grelha quadrada para ralo 15x15cm","un",60,{"$f":"OFFSET(INDEX(Composições!A:J,MATCH(B170,Composições!B:B,0),10),2,0)","v":49.410000000000004},2964.6,{"$f":"BDI!$B$17","v":0.2034},59.46,3567.6,null,49.41,"","",2964.6,"",59.46,"",3567.6,""]
["SF-00180","Ralo seco PVC DN 100x40mm","un",60,{"$f":"OFFSET(INDEX(Composições!A:J,MATCH(B171,Composições!B:B,0),10),2,0)","v":8.36},501.6,{"$f":"BDI!$B$17","v":0.2034},10.06,603.6,null,8.34,1.9999999999999574E-2,2.3980815347721313E-3,500.4,1.2000000000000455,10.039999999999999,2.000000000000135E-2,602.4,1.2000000000000455]
["SF-00181","Assento para bacia convencional – Linha Administrativa","un",60,{"$f":"OFFSET(INDEX(Composições!A:J,MATCH(B172,Composições!B:B,0),10),2,0)","v":51.32},3079.2,{"$f":"BDI!$B$17","v":0.2034},61.76,3705.6,null,51.32,"","",3079.2,"",61.76,"",3705.6,""]
["SF-00182","Bacia convencional – Linha Administrativa","un",60,{"$f":"OFFSET(INDEX(Composições!A:J,MATCH(B173,Composições!B:B,0),10),2,0)","v":209.45999999999995},12567.6,{"$f":"BDI!$B$17","v":0.2034},252.06,15123.6,null,209.49,-3.000000000005798E-2,-1.4320492624973974E-4,12569.4,-1.7999999999992724,252.1,-3.9999999999992042E-2,15126,-2.3999999999996362]
["SF-00183","Bacia convencional com saída horizontal","un",2,{"$f":"OFFSET(INDEX(Composições!A:J,MATCH(B174,Composições!B:B,0),10),2,0)","v":242.51999999999995},485.04,{"$f":"BDI!$B$17","v":0.2034},291.85000000000002,583.70000000000005,null,242.55,-3.000000000005798E-2,-1.236858379717913E-4,485.1,-6.0000000000002274E-2,291.88,-2.9999999999972715E-2,583.76,-5.999999999994543E-2]
["SF-00184","Cuba oval de embutir","un",60,{"$f":"OFFSET(INDEX(Composições!A:J,MATCH(B175,Composições!B:B,0),10),2,0)","v":86.949999999999989},5217,{"$f":"BDI!$B$17","v":0.2034},104.64,6278.4,null,86.94,9.9999999999909051E-3,1.1502185415218432E-4,5216.3999999999996,0.6000000000003638,104.62,1.9999999999996021E-2,6277.2,1.1999999999998181]
["SF-00185","Cuba retangular em aço inox – Linha Administrativa","un",20,{"$f":"OFFSET(INDEX(Composições!A:J,MATCH(B176,Composições!B:B,0),10),2,0)","v":212.58999999999997},4251.8,{"$f":"BDI!$B$17","v":0.2034},255.83,5116.6000000000004,null,212.58,9.9999999999624833E-3,4.7041113933401463E-5,4251.6000000000004,0.1999999999998181,255.82,1.0000000000019327E-2,5116.3999999999996,0.2000000000007276]
["SF-00186","Cuba semiencaixe quadrada com mesa","un",10,{"$f":"OFFSET(INDEX(Composições!A:J,MATCH(B177,Composições!B:B,0),10),2,0)","v":660.43999999999994},6604.4,{"$f":"BDI!$B$17","v":0.2034},794.77,7947.7,null,660.43,9.9999999999909051E-3,1.5141650137018163E-5,6604.3,9.9999999999454303E-2,794.76,9.9999999999909051E-3,7947.6,9.9999999999454303E-2]
["SF-00187","Instalação de lavatório reaproveitado","un",60,{"$f":"OFFSET(INDEX(Composições!A:J,MATCH(B178,Composições!B:B,0),10),2,0)","v":33.81},2028.6,{"$f":"BDI!$B$17","v":0.2034},40.69,2441.4,null,33.81,"","",2028.6,"",40.69,"",2441.4,""]
["SF-00188","Instalação de mictório reaproveitado","un",60,{"$f":"OFFSET(INDEX(Composições!A:J,MATCH(B179,Composições!B:B,0),10),2,0)","v":117.6},7056,{"$f":"BDI!$B$17","v":0.2034},141.52000000000001,8491.2000000000007,null,117.62,-2.0000000000010232E-2,-1.7003910899515584E-4,7057.2,-1.1999999999998181,141.54,-1.999999999998181E-2,8492.4,-1.1999999999989086]
["SF-00189","Instalação de vaso sanitário reaproveitado","un",60,{"$f":"OFFSET(INDEX(Composições!A:J,MATCH(B180,Composições!B:B,0),10),2,0)","v":57.1},3426,{"$f":"BDI!$B$17","v":0.2034},68.709999999999994,4122.6000000000004,null,57.13,-3.0000000000001137E-2,-5.2511815158412631E-4,3427.8,-1.8000000000001819,68.75,-4.0000000000006253E-2,4125,-2.3999999999996362]
["SF-00190","Lavatório suspenso","un",10,{"$f":"OFFSET(INDEX(Composições!A:J,MATCH(B181,Composições!B:B,0),10),2,0)","v":97.740000000000009},977.4,{"$f":"BDI!$B$17","v":0.2034},117.62,1176.2,null,97.74,"","",977.4,"",117.62,"",1176.2,""]
["SF-00191","Mictório – Linha Administrativa","un",20,{"$f":"OFFSET(INDEX(Composições!A:J,MATCH(B182,Composições!B:B,0),10),2,0)","v":340.29},6805.8,{"$f":"BDI!$B$17","v":0.2034},409.5,8190,null,340.31,-1.999999999998181E-2,-5.8769945050047929E-5,6806.2,-0.3999999999996362,409.53,-2.9999999999972715E-2,8190.6,-0.6000000000003638]
["SF-00192","Tanque 38 litros – Linha Administrativa","un",5,{"$f":"OFFSET(INDEX(Composições!A:J,MATCH(B183,Composições!B:B,0),10),2,0)","v":417.84000000000003},2089.1999999999998,{"$f":"BDI!$B$17","v":0.2034},502.83,2514.15,null,417.83,1.0000000000047748E-2,2.3933178565559555E-5,2089.15,4.9999999999727152E-2,502.82,9.9999999999909051E-3,2514.1,5.0000000000181899E-2]
["SF-00193","Acabamento para registro GD – Linha Administrativa","un",40,{"$f":"OFFSET(INDEX(Composições!A:J,MATCH(B184,Composições!B:B,0),10),2,0)","v":45.35},1814,{"$f":"BDI!$B$17","v":0.2034},54.57,2182.8000000000002,null,45.34,9.9999999999980105E-3,2.2055580061751236E-4,1813.6,0.40000000000009095,54.56,9.9999999999980105E-3,2182.4,0.40000000000009095]
["SF-00194","Acabamento para registro PQ – Linha Administrativa","un",40,{"$f":"OFFSET(INDEX(Composições!A:J,MATCH(B185,Composições!B:B,0),10),2,0)","v":33.520000000000003},{"$f":"IF(ISNUMBER(E185),ROUND(D185*E185,2),\"-\")","v":1340.8},{"$f":"BDI!$B$17","v":0.2034},{"$f":"IF(ISNUMBER(E185),ROUND(E185*(1+G185),2),0)","v":40.340000000000003},1613.6,null,33.51,1.0000000000005116E-2,2.9841838257251913E-4,1340.4,0.39999999999986358,40.33,1.0000000000005116E-2,1613.2,0.39999999999986358]
["SF-00195","Ducha higiênica – Linha Administrativa","un",60,{"$f":"OFFSET(INDEX(Composições!A:J,MATCH(B186,Composições!B:B,0),10),2,0)","v":232.84999999999997},13971,{"$f":"BDI!$B$17","v":0.2034},280.20999999999998,16812.599999999999,null,232.85,"","",13971,"",280.20999999999998,"",16812.599999999999,""]
["SF-00196","Instalação de metais e acessórios reaproveitados","un",200,{"$f":"OFFSET(INDEX(Composições!A:J,MATCH(B187,Composições!B:B,0),10),2,0)","v":3.4099999999999997},682,{"$f":"BDI!$B$17","v":0.2034},4.0999999999999996,820,null,3.4,9.9999999999997868E-3,2.9411764705881728E-3,680,2,4.09,9.9999999999997868E-3,818,2]
["SF-00197","Ligação flexível 1/2” x 40 cm – Linha Administrativa","un",60,{"$f":"OFFSET(INDEX(Composições!A:J,MATCH(B188,Composições!B:B,0),10),2,0)","v":25.71},1542.6,{"$f":"BDI!$B$17","v":0.2034},30.94,1856.4,null,25.71,"","",1542.6,"",30.94,"",1856.4,""]
["SF-00198","Sifão articulado para cozinha – Linha Administrativa","un",20,{"$f":"OFFSET(INDEX(Composições!A:J,MATCH(B189,Composições!B:B,0),10),2,0)","v":174.48999999999998},3489.8,{"$f":"BDI!$B$17","v":0.2034},209.98,4199.6000000000004,null,174.49,"","",3489.8,"",209.98,"",4199.6000000000004,""]
["SF-00199","Sifão para lavatório 1 1/2\"","un",60,{"$f":"OFFSET(INDEX(Composições!A:J,MATCH(B190,Composições!B:B,0),10),2,0)","v":94.64},5678.4,{"$f":"BDI!$B$17","v":0.2034},113.89,{"$f":"ROUND(H190*D190,2)","v":6833.4},null,94.64,"","",5678.4,"",113.89,"",6833.4,""]
["SF-00200","Sifão para tanque – Linha Administrativa","un",5,{"$f":"OFFSET(INDEX(Composições!A:J,MATCH(B191,Composições!B:B,0),10),2,0)","v":99.84},499.2,{"$f":"BDI!$B$17","v":0.2034},120.15,600.75,null,99.84,"","",499.2,"",120.15,"",600.75,""]
["SF-00201","Torneira de mesa para cozinha bica móvel – Linha Administrativa","un",20,{"$f":"OFFSET(INDEX(Composições!A:J,MATCH(B192,Composições!B:B,0),10),2,0)","v":264.15000000000003},5283,{"$f":"BDI!$B$17","v":0.2034},317.88,6357.6,null,264.14999999999998,"","",5283,"",317.88,"",6357.6,""]
["SF-00202","Torneira de mesa para cozinha bica móvel com arejador – Linha Administrativa","un",20,{"$f":"OFFSET(INDEX(Composições!A:J,MATCH(B193,Composições!B:B,0),10),2,0)","v":147.58000000000001},2951.6,{"$f":"BDI!$B$17","v":0.2034},177.6,3552,null,147.58000000000001,"","",2951.6,"",177.6,"",3552,""]
["SF-00203","Torneira de mesa para lavatório – Linha Acessibilidade","un",10,{"$f":"OFFSET(INDEX(Composições!A:J,MATCH(B194,Composições!B:B,0),10),2,0)","v":227.73000000000002},2277.3000000000002,{"$f":"BDI!$B$17","v":0.2034},274.05,2740.5,null,227.72,1.0000000000019327E-2,4.3913578078426691E-5,2277.1999999999998,0.1000000000003638,274.04000000000002,9.9999999999909051E-3,2740.4,9.9999999999909051E-2]
["SF-00204","Torneira de mesa para lavatório bica alta – Linha Administrativa","un",60,{"$f":"OFFSET(INDEX(Composições!A:J,MATCH(B195,Composições!B:B,0),10),2,0)","v":144.80000000000001},8688,{"$f":"BDI!$B$17","v":0.2034},174.25,10455,null,144.79,1.0000000000019327E-2,6.9065543200630761E-5,8687.4,0.6000000000003638,174.24,9.9999999999909051E-3,10454.4,0.6000000000003638]
["SF-00205","Torneira de mesa para lavatório bica baixa – Linha Administrativa","un",60,{"$f":"OFFSET(INDEX(Composições!A:J,MATCH(B196,Composições!B:B,0),10),2,0)","v":104.07000000000001},6244.2,{"$f":"BDI!$B$17","v":0.2034},125.24,7514.4,null,104.06,1.0000000000005116E-2,9.609840476653004E-5,6243.6,0.5999999999994543,125.23,9.9999999999909051E-3,7513.8,0.5999999999994543]
["SF-00206","Torneira de mesa para lavatório com fechamento automático – Linha Administrativa","un",60,{"$f":"OFFSET(INDEX(Composições!A:J,MATCH(B197,Composições!B:B,0),10),2,0)","v":130.38000000000002},7822.8,{"$f":"BDI!$B$17","v":0.2034},156.9,9414,null,130.37,1.0000000000019327E-2,7.6704763365953256E-5,7822.2,0.6000000000003638,156.88999999999999,1.0000000000019327E-2,9413.4,0.6000000000003638]
["SF-00207","Torneira de parede para cozinha bica móvel – Linha Administrativa","un",20,{"$f":"OFFSET(INDEX(Composições!A:J,MATCH(B198,Composições!B:B,0),10),2,0)","v":139.34},2786.8,{"$f":"BDI!$B$17","v":0.2034},167.68,3353.6,null,139.34,"","",2786.8,"",167.68,"",3353.6,""]
["SF-00208","Torneira de parede para tanque – Linha Administrativa","un",5,{"$f":"OFFSET(INDEX(Composições!A:J,MATCH(B199,Composições!B:B,0),10),2,0)","v":49.18},245.9,{"$f":"BDI!$B$17","v":0.2034},59.18,295.89999999999998,null,49.18,"",{"$f":"IF(ISNUMBER(L199),L199/K199,\"\")","v":""},245.9,"",59.18,"",295.89999999999998,""]
["SF-00209","Válvula de descarga 1 1/2\" – Linha Acessibilidade","un",10,{"$f":"OFFSET(INDEX(Composições!A:J,MATCH(B200,Composições!B:B,0),10),2,0)","v":359.94},3599.4,{"$f":"BDI!$B$17","v":0.2034},433.15,4331.5,null,359.94,{"$f":"IF(E200=K200,\"\",E200-K200)","v":""},"",3599.4,{"$f":"IF(F200=N200,\"\",F200-N200)","v":""},433.15,{"$f":"IF(H200=P200,\"\",H200-P200)","v":""},4331.5,{"$f":"IF(I200=R200,\"\",I200-R200)","v":""}]
["SF-00210","Válvula de descarga 1 1/2\" – Linha Administrativa","un",60,{"$f":"OFFSET(INDEX(Composições!A:J,MATCH(B201,Composições!B:B,0),10),2,0)","v":174.2},10452,{"$f":"BDI!$B$17","v":0.2034},209.63,12577.8,null,174.2,"","",10452,"",209.63,"",12577.8,""]
["SF-00211","Válvula de descarga 1 1/4\" – Linha Acessibilidade","un",10,{"$f":"OFFSET(INDEX(Composições!A:J,MATCH(B202,Composições!B:B,0),10),2,0)","v":365.75},3657.5,{"$f":"BDI!$B$17","v":0.2034},440.14,4401.3999999999996,null,365.75,"","",3657.5,"",440.14,"",4401.3999999999996,""]
["SF-00212","Válvula de descarga 1 1/4\" – Linha Administrativa","un",60,{"$f":"OFFSET(INDEX(Composições!A:J,MATCH(B203,Composições!B:B,0),10),2,0)","v":146.22},8773.2000000000007,{"$f":"BDI!$B$17","v":0.2034},175.96,10557.6,null,146.22,"","",8773.2000000000007,"",175.96,"",10557.6,""]
["SF-00213","Válvula de escoamento para lavatório – Linha Administrativa","un",60,{"$f":"OFFSET(INDEX(Composições!A:J,MATCH(B204,Composições!B:B,0),10),2,0)","v":26.07},1564.2,{"$f":"BDI!$B$17","v":0.2034},31.37,1882.2,null,26.08,-9.9999999999980105E-3,-3.8343558282200962E-4,1564.8,-0.59999999999990905,31.38,-9.9999999999980105E-3,1882.8,-0.59999999999990905]
["SF-00214","Válvula de escoamento para tanque – Linha Administrativa","un",5,{"$f":"OFFSET(INDEX(Composições!A:J,MATCH(B205,Composições!B:B,0),10),2,0)","v":21.38},106.9,{"$f":"BDI!$B$17","v":0.2034},25.73,128.65,null,21.39,-1.0000000000001563E-2,-4.6750818139324742E-4,106.95,-4.9999999999997158E-2,25.74,-9.9999999999980105E-3,128.69999999999999,-4.9999999999982947E-2]
["SF-00215","Válvula descarga para mictório – Linha Administrativa","un",60,{"$f":"OFFSET(INDEX(Composições!A:J,MATCH(B206,Composições!B:B,0),10),2,0)","v":153.69},9221.4,{"$f":"BDI!$B$17","v":0.2034},184.95,11097,null,153.69,"","",9221.4,"",184.95,"",11097,""]
["SF-00216","Alarme de emergência para sanitários PNE","un",15,{"$f":"OFFSET(INDEX(Composições!A:J,MATCH(B207,Composições!B:B,0),10),2,0)","v":344.97999999999996},5174.7,{"$f":"BDI!$B$17","v":0.2034},415.15,6227.25,null,344.98,"","",5174.7,"",415.15,"",6227.25,""]
["SF-00217","Barra de apoio 40cm – Linha Acessibilidade","un",25,{"$f":"OFFSET(INDEX(Composições!A:J,MATCH(B208,Composições!B:B,0),10),2,0)","v":109.67000000000002},2741.75,{"$f":"BDI!$B$17","v":0.2034},131.97999999999999,3299.5,null,109.69,-1.999999999998181E-2,-1.8233202662031007E-4,2742.25,-0.5,132,-2.0000000000010232E-2,3300,-0.5]
["SF-00218","Barra de apoio 70cm – Linha Acessibilidade","un",20,{"$f":"OFFSET(INDEX(Composições!A:J,MATCH(B209,Composições!B:B,0),10),2,0)","v":128},2560,{"$f":"BDI!$B$17","v":0.2034},154.04,3080.8,null,128.02000000000001,-2.0000000000010232E-2,-1.5622558975168124E-4,2560.4,-0.40000000000009095,154.06,-2.0000000000010232E-2,3081.2,-0.3999999999996362]
["SF-00219","Barra de apoio 80cm – Linha Acessibilidade","un",25,{"$f":"OFFSET(INDEX(Composições!A:J,MATCH(B210,Composições!B:B,0),10),2,0)","v":119.9},2997.5,{"$f":"BDI!$B$17","v":0.2034},144.29,3607.25,null,119.92,-1.9999999999996021E-2,-1.6677785190123432E-4,2998,-0.5,144.31,-2.0000000000010232E-2,3607.75,-0.5]
["SF-00220","Barra de apoio lateral fixa 30cm – Linha Acessibilidade","un",25,{"$f":"OFFSET(INDEX(Composições!A:J,MATCH(B211,Composições!B:B,0),10),2,0)","v":134.9},3372.5,{"$f":"BDI!$B$17","v":0.2034},162.34,4058.5,null,134.91999999999999,-1.999999999998181E-2,-1.4823599169864967E-4,3373,-0.5,162.36000000000001,-2.0000000000010232E-2,4059,-0.5]
["SF-00221","Lavatório suspenso – Linha Acessibilidade","un",10,{"$f":"OFFSET(INDEX(Composições!A:J,MATCH(B212,Composições!B:B,0),10),2,0)","v":173.70999999999998},1737.1,{"$f":"BDI!$B$17","v":0.2034},209.04,2090.4,null,173.71,"","",1737.1,"",209.04,"",2090.4,""]
["SF-00222","Lavatório suspenso com Coluna – Linha Acessibilidade","un",10,{"$f":"OFFSET(INDEX(Composições!A:J,MATCH(B213,Composições!B:B,0),10),2,0)","v":368.93},3689.3,{"$f":"BDI!$B$17","v":0.2034},443.97,4439.7,null,368.91,1.999999999998181E-2,5.4213764874852424E-5,3689.1,0.20000000000027285,443.95,2.0000000000038654E-2,4439.5,0.1999999999998181]
["SF-00223","Cabide – Linha Administrativa","un",60,{"$f":"OFFSET(INDEX(Composições!A:J,MATCH(B214,Composições!B:B,0),10),2,0)","v":50.93},3055.8,{"$f":"BDI!$B$17","v":0.2034},61.29,3677.4,null,50.93,"","",3055.8,"",61.29,"",3677.4,""]
["SF-00224","Papeleira – Linha Administrativa","un",60,{"$f":"OFFSET(INDEX(Composições!A:J,MATCH(B215,Composições!B:B,0),10),2,0)","v":93.01},5580.6,{"$f":"BDI!$B$17","v":0.2034},111.93,6715.8,null,93.01,"","",5580.6,"",111.93,"",6715.8,""]
["SF-00225","Porta toalha argola – Linha Administrativa","un",60,{"$f":"OFFSET(INDEX(Composições!A:J,MATCH(B216,Composições!B:B,0),10),2,0)","v":100.07000000000001},6004.2,{"$f":"BDI!$B$17","v":0.2034},120.42,7225.2,null,100.07,"","",6004.2,"",120.42,"",7225.2,""]
["SF-00226","Porta toalha barra – Linha Administrativa","un",60,{"$f":"OFFSET(INDEX(Composições!A:J,MATCH(B217,Composições!B:B,0),10),2,0)","v":116.26},6975.6,{"$f":"BDI!$B$17","v":0.2034},139.91,8394.6,null,116.26,"","",6975.6,"",139.91,"",8394.6,""]
["SF-00227","Caixa 4x2 de embutir para alvenaria","un",2000,{"$f":"OFFSET(INDEX(Composições!A:J,MATCH(B218,Composições!B:B,0),10),2,0)","v":6.86},13720,{"$f":"BDI!$B$17","v":0.2034},8.26,16520,null,6.84,2.0000000000000462E-2,2.923976608187202E-3,13680,40,8.23,2.9999999999999361E-2,16460,60]
["SF-00228","Caixa 4x2 para drywall","un",500,{"$f":"OFFSET(INDEX(Composições!A:J,MATCH(B219,Composições!B:B,0),10),2,0)","v":9.61},4805,{"$f":"BDI!$B$17","v":0.2034},11.56,5780,null,9.6199999999999992,-9.9999999999997868E-3,-1.0395010395010174E-3,4810,-5,11.58,-1.9999999999999574E-2,5790,-10]
["SF-00229","Caixa 4x4 de embutir para alvenaria","un",500,{"$f":"OFFSET(INDEX(Composições!A:J,MATCH(B220,Composições!B:B,0),10),2,0)","v":9.14},4570,{"$f":"BDI!$B$17","v":0.2034},11,5500,null,9.1,4.0000000000000924E-2,4.3956043956044971E-3,4550,20,10.95,5.0000000000000711E-2,5475,25]
["SF-00230","Caixa 4x4 para drywall","un",100,{"$f":"OFFSET(INDEX(Composições!A:J,MATCH(B221,Composições!B:B,0),10),2,0)","v":11.899999999999999},1190,{"$f":"BDI!$B$17","v":0.2034},14.32,1432,null,11.9,"","",1190,"",14.32,"",1432,""]
["SF-00231","Caixa de passagem em alumínio 100x100x50mm","un",1900,{"$f":"OFFSET(INDEX(Composições!A:J,MATCH(B222,Composições!B:B,0),10),2,0)","v":54.599999999999994},103740,{"$f":"BDI!$B$17","v":0.2034},65.709999999999994,124849,null,54.59,9.9999999999909051E-3,1.8318373328431772E-4,103721,19,65.69,1.9999999999996021E-2,124811,38]
["SF-00232","Caixa de passagem em alumínio 200x200x100mm","un",200,{"$f":"OFFSET(INDEX(Composições!A:J,MATCH(B223,Composições!B:B,0),10),2,0)","v":90.18},18036,{"$f":"BDI!$B$17","v":0.2034},108.52,21704,null,90.18,"","",18036,"",108.52,"",21704,""]
["SF-00233","Caixa de passagem em PVC 150x150x75mm","un",1900,{"$f":"OFFSET(INDEX(Composições!A:J,MATCH(B224,Composições!B:B,0),10),2,0)","v":58.180000000000007},110542,{"$f":"BDI!$B$17","v":0.2034},70.010000000000005,133019,null,58.19,-9.9999999999909051E-3,-1.7185083347638608E-4,110561,-19,70.03,-1.9999999999996021E-2,133057,-38]
["SF-00234","Caixa para piso elevado","un",200,{"$f":"OFFSET(INDEX(Composições!A:J,MATCH(B225,Composições!B:B,0),10),2,0)","v":241.17},48234,{"$f":"BDI!$B$17","v":0.2034},290.22000000000003,58044,null,241.17,"","",48234,"",290.22000000000003,"",58044,""]
["SF-00235","Canaleta em alumínio aparente 73mmx25mm","m",1000,{"$f":"OFFSET(INDEX(Composições!A:J,MATCH(B226,Composições!B:B,0),10),2,0)","v":94.38},94380,{"$f":"BDI!$B$17","v":0.2034},113.58,113580,null,94.38,"","",94380,"",113.58,"",113580,""]
["SF-00236","Condulete de alumínio de 1’’","un",1900,{"$f":"OFFSET(INDEX(Composições!A:J,MATCH(B227,Composições!B:B,0),10),2,0)","v":29.369999999999997},55803,{"$f":"BDI!$B$17","v":0.2034},35.340000000000003,67146,null,29.37,"","",55803,"",35.340000000000003,"",67146,""]
["SF-00237","Eletrocalha 100x50 mm","m",1500,{"$f":"OFFSET(INDEX(Composições!A:J,MATCH(B228,Composições!B:B,0),10),2,0)","v":46.76},70140,{"$f":"BDI!$B$17","v":0.2034},56.27,84405,null,46.7,5.9999999999995168E-2,1.2847965738756995E-3,70050,90,56.2,7.0000000000000284E-2,84300,105]
["SF-00238","Eletrocalha 200x100 mm","m",1500,{"$f":"OFFSET(INDEX(Composições!A:J,MATCH(B229,Composições!B:B,0),10),2,0)","v":81.91},122865,{"$f":"BDI!$B$17","v":0.2034},98.57,147855,null,81.87,3.9999999999992042E-2,4.8857945523381023E-4,122805,60,98.52,4.9999999999997158E-2,147780,75]
["SF-00239","Eletrocalha 200x50 mm","m",1500,{"$f":"OFFSET(INDEX(Composições!A:J,MATCH(B230,Composições!B:B,0),10),2,0)","v":69.410000000000011},104115,{"$f":"BDI!$B$17","v":0.2034},83.53,125295,null,69.349999999999994,6.0000000000016485E-2,8.6517664023095153E-4,104025,90,83.46,7.000000000000739E-2,125190,105]
["SF-00240","Eletrocalha 300x100 mm","m",1500,{"$f":"OFFSET(INDEX(Composições!A:J,MATCH(B231,Composições!B:B,0),10),2,0)","v":94.36999999999999},141555,{"$f":"BDI!$B$17","v":0.2034},113.56,170340,null,94.32,4.9999999999997158E-2,5.3011026293466035E-4,141480,75,113.5,6.0000000000002274E-2,170250,90]
["SF-00241","Eletrocalha 300x50 mm","m",1500,{"$f":"OFFSET(INDEX(Composições!A:J,MATCH(B232,Composições!B:B,0),10),2,0)","v":81.819999999999993},122730,{"$f":"BDI!$B$17","v":0.2034},98.46,147690,null,81.78,3.9999999999992042E-2,4.891171435557843E-4,122670,60,98.41,4.9999999999997158E-2,147615,75]
["SF-00242","Eletrocalha 400x50 mm","m",1500,{"$f":"OFFSET(INDEX(Composições!A:J,MATCH(B233,Composições!B:B,0),10),2,0)","v":106.34999999999998},159525,{"$f":"BDI!$B$17","v":0.2034},127.98,191970,null,106.3,4.9999999999982947E-2,4.7036688617105315E-4,159450,75,127.92,6.0000000000002274E-2,191880,90]
["SF-00243","Eletrocalha 50x50 mm","m",3000,{"$f":"OFFSET(INDEX(Composições!A:J,MATCH(B234,Composições!B:B,0),10),2,0)","v":40.020000000000003},120060,{"$f":"BDI!$B$17","v":0.2034},48.16,144480,null,39.96,6.0000000000002274E-2,1.5015015015015583E-3,119880,180,48.09,6.9999999999993179E-2,144270,210]
["SF-00244","Eletroduto de aço galvanizado de 1 1/2\"","m",6000,{"$f":"OFFSET(INDEX(Composições!A:J,MATCH(B235,Composições!B:B,0),10),2,0)","v":30.129999999999995},180780,{"$f":"BDI!$B$17","v":0.2034},36.26,217560,null,30.12,9.9999999999944578E-3,3.3200531208480935E-4,180720,60,36.25,9.9999999999980105E-3,217500,60]
["SF-00245","Eletroduto de aço galvanizado de 1 1/4\"","m",8000,{"$f":"OFFSET(INDEX(Composições!A:J,MATCH(B236,Composições!B:B,0),10),2,0)","v":25.5},204000,{"$f":"BDI!$B$17","v":0.2034},30.69,245520,null,25.48,1.9999999999999574E-2,7.8492935635791103E-4,203840,160,30.66,3.0000000000001137E-2,245280,240]
["SF-00246","Eletroduto de aço galvanizado de 1\"","m",1500,{"$f":"OFFSET(INDEX(Composições!A:J,MATCH(B237,Composições!B:B,0),10),2,0)","v":21.430000000000003},32145,{"$f":"BDI!$B$17","v":0.2034},25.79,38685,null,21.41,2.0000000000003126E-2,9.341429238674977E-4,32115,30,25.76,2.9999999999997584E-2,38640,45]
["SF-00247","Eletroduto de aço galvanizado de 2\"","m",3000,{"$f":"OFFSET(INDEX(Composições!A:J,MATCH(B238,Composições!B:B,0),10),2,0)","v":37.019999999999996},111060,{"$f":"BDI!$B$17","v":0.2034},44.55,133650,null,37,1.9999999999996021E-2,5.40540540540433E-4,111000,60,44.53,1.9999999999996021E-2,133590,60]
["SF-00248","Eletroduto de aço galvanizado de 3/4\"","m",2400,{"$f":"OFFSET(INDEX(Composições!A:J,MATCH(B239,Composições!B:B,0),10),2,0)","v":16.919999999999998},40608,{"$f":"BDI!$B$17","v":0.2034},20.36,48864,null,16.91,9.9999999999980105E-3,5.9136605558829153E-4,40584,24,20.350000000000001,9.9999999999980105E-3,48840,24]
["SF-00249","Eletroduto de PVC Corrugado Reforçado 1'' (DE 32mm)","m",1900,{"$f":"OFFSET(INDEX(Composições!A:J,MATCH(B240,Composições!B:B,0),10),2,0)","v":9.57},18183,{"$f":"BDI!$B$17","v":0.2034},11.52,21888,null,9.57,"","",18183,"",11.52,"",21888,""]
["SF-00250","Eletroduto de PVC Corrugado Reforçado 3/4'' (DE 25mm)","m",1900,{"$f":"OFFSET(INDEX(Composições!A:J,MATCH(B241,Composições!B:B,0),10),2,0)","v":6.76},12844,{"$f":"BDI!$B$17","v":0.2034},8.1300000000000008,15447,null,6.75,9.9999999999997868E-3,1.48148148148145E-3,12825,19,8.1199999999999992,1.0000000000001563E-2,15428,19]
["SF-00251","Eletroduto flexível metálico com capa de PVC 1’’","m",3000,{"$f":"OFFSET(INDEX(Composições!A:J,MATCH(B242,Composições!B:B,0),10),2,0)","v":16.939999999999998},50820,{"$f":"BDI!$B$17","v":0.2034},20.39,61170,null,16.93,9.9999999999980105E-3,5.9066745422315476E-4,50790,30,20.37,1.9999999999999574E-2,61110,60]
["SF-00252","Eletroduto flexível metálico com capa de PVC 3/4\"","m",3000,{"$f":"OFFSET(INDEX(Composições!A:J,MATCH(B243,Composições!B:B,0),10),2,0)","v":13.09},39270,{"$f":"BDI!$B$17","v":0.2034},15.75,47250,null,13.1,-9.9999999999997868E-3,-7.6335877862593793E-4,39300,-30,15.76,-9.9999999999997868E-3,47280,-30]
["SF-00253","Perfilado 38x38mm","m",1500,{"$f":"OFFSET(INDEX(Composições!A:J,MATCH(B244,Composições!B:B,0),10),2,0)","v":41.54},62310,{"$f":"BDI!$B$17","v":0.2034},49.99,74985,null,41.5,3.9999999999999147E-2,9.6385542168672645E-4,62250,60,49.94,5.0000000000004263E-2,74910,75]
["SF-00254","Espelho 4x2","un",2500,{"$f":"OFFSET(INDEX(Composições!A:J,MATCH(B245,Composições!B:B,0),10),2,0)","v":4.96},12400,{"$f":"BDI!$B$17","v":0.2034},5.97,14925,null,4.96,"","",12400,"",5.97,"",14925,""]
["SF-00255","Espelho 4x4","un",600,{"$f":"OFFSET(INDEX(Composições!A:J,MATCH(B246,Composições!B:B,0),10),2,0)","v":8.19},4914,{"$f":"BDI!$B$17","v":0.2034},9.86,5916,null,8.19,"","",4914,"",9.86,"",5916,""]
["SF-00256","Espelho cego redondo","un",10,{"$f":"OFFSET(INDEX(Composições!A:J,MATCH(B247,Composições!B:B,0),10),2,0)","v":6.75},67.5,{"$f":"BDI!$B$17","v":0.2034},8.1199999999999992,81.2,null,6.75,"","",67.5,"",8.1199999999999992,"",81.2,""]
["SF-00257","Interruptor para condulete","un",100,{"$f":"OFFSET(INDEX(Composições!A:J,MATCH(B248,Composições!B:B,0),10),2,0)","v":21.25},2125,{"$f":"BDI!$B$17","v":0.2034},25.57,2557,null,21.26,-1.0000000000001563E-2,-4.7036688617128702E-4,2126,-1,25.58,-9.9999999999980105E-3,2558,-1]
["SF-00258","Módulo cego","un",2000,{"$f":"OFFSET(INDEX(Composições!A:J,MATCH(B249,Composições!B:B,0),10),2,0)","v":4.05},{"$f":"IF(ISNUMBER(E249),ROUND(D249*E249,2),\"-\")","v":8100},{"$f":"BDI!$B$17","v":0.2034},{"$f":"IF(ISNUMBER(E249),ROUND(E249*(1+G249),2),0)","v":4.87},9740,null,4.04,9.9999999999997868E-3,2.4752475247524224E-3,8080,20,4.8600000000000003,9.9999999999997868E-3,9720,20]
["SF-00259","Módulo interruptor paralelo","un",100,{"$f":"OFFSET(INDEX(Composições!A:J,MATCH(B250,Composições!B:B,0),10),2,0)","v":17.28},1728,{"$f":"BDI!$B$17","v":0.2034},20.79,2079,null,17.28,"","",1728,"",20.79,"",2079,""]
["SF-00260","Módulo interruptor simples","un",800,{"$f":"OFFSET(INDEX(Composições!A:J,MATCH(B251,Composições!B:B,0),10),2,0)","v":12.87},10296,{"$f":"BDI!$B$17","v":0.2034},15.49,12392,null,12.87,"","",10296,"",15.49,"",12392,""]
["SF-00261","Módulo para saída de fio","un",100,{"$f":"OFFSET(INDEX(Composições!A:J,MATCH(B252,Composições!B:B,0),10),2,0)","v":4.13},413,{"$f":"BDI!$B$17","v":0.2034},4.97,497,null,4.12,9.9999999999997868E-3,2.4271844660193657E-3,412,1,4.96,9.9999999999997868E-3,496,1]
["SF-00262","Módulo sensor de presença","un",100,{"$f":"OFFSET(INDEX(Composições!A:J,MATCH(B253,Composições!B:B,0),10),2,0)","v":132.44999999999999},13245,{"$f":"BDI!$B$17","v":0.2034},159.38999999999999,15939,null,132.44999999999999,"","",13245,"",159.38999999999999,"",15939,""]
["SF-00263","Módulo tomada 10 A","un",1800,{"$f":"OFFSET(INDEX(Composições!A:J,MATCH(B254,Composições!B:B,0),10),2,0)","v":13.91},25038,{"$f":"BDI!$B$17","v":0.2034},16.739999999999998,{"$f":"ROUND(H254*D254,2)","v":30132},null,13.9,9.9999999999997868E-3,7.194244604316393E-4,25020,18,16.73,9.9999999999980105E-3,30114,18]
["SF-00264","Módulo tomada 20 A","un",360,{"$f":"OFFSET(INDEX(Composições!A:J,MATCH(B255,Composições!B:B,0),10),2,0)","v":15.51},5583.6,{"$f":"BDI!$B$17","v":0.2034},18.66,6717.6,null,15.5,9.9999999999997868E-3,6.4516129032256688E-4,5580,3.6000000000003638,18.649999999999999,1.0000000000001563E-2,6714,3.6000000000003638]
["SF-00265","Porta equipamentos para canaleta de alumínio aparente","un",50,{"$f":"OFFSET(INDEX(Composições!A:J,MATCH(B256,Composições!B:B,0),10),2,0)","v":23.979999999999997},1199,{"$f":"BDI!$B$17","v":0.2034},28.86,1443,null,23.61,0.36999999999999744,1.5671325709445041E-2,1180.5,18.5,28.41,0.44999999999999929,1420.5,22.5]
["SF-00266","Tampa cega metálica para caixas de piso 4x2","un",50,{"$f":"OFFSET(INDEX(Composições!A:J,MATCH(B257,Composições!B:B,0),10),2,0)","v":10.98},549,{"$f":"BDI!$B$17","v":0.2034},13.21,660.5,null,10.98,"","",549,"",13.21,"",660.5,""]
["SF-00267","Tampa cega metálica para caixas de piso 4x4","un",50,{"$f":"OFFSET(INDEX(Composições!A:J,MATCH(B258,Composições!B:B,0),10),2,0)","v":14.42},721,{"$f":"BDI!$B$17","v":0.2034},17.350000000000001,867.5,null,14.42,"","",721,"",17.350000000000001,"",867.5,""]
["SF-00268","Tampa cega para condulete","un",100,{"$f":"OFFSET(INDEX(Composições!A:J,MATCH(B259,Composições!B:B,0),10),2,0)","v":5.26},526,{"$f":"BDI!$B$17","v":0.2034},6.33,633,null,5.27,-9.9999999999997868E-3,-1.8975332068310792E-3,527,-1,6.34,-9.9999999999997868E-3,634,-1]
["SF-00269","Tampa RJ45 dupla para condulete","un",600,{"$f":"OFFSET(INDEX(Composições!A:J,MATCH(B260,Composições!B:B,0),10),2,0)","v":10.75},6450,{"$f":"BDI!$B$17","v":0.2034},12.94,7764,null,10.53,0.22000000000000064,2.0892687559354289E-2,6318,132,12.67,0.26999999999999957,7602,162]
["SF-00270","Tomada para condulete","un",880,{"$f":"OFFSET(INDEX(Composições!A:J,MATCH(B261,Composições!B:B,0),10),2,0)","v":26.03},22906.400000000001,{"$f":"BDI!$B$17","v":0.2034},31.32,27561.599999999999,null,26.03,"","",22906.400000000001,"",31.32,"",27561.599999999999,""]
["SF-00271","Tomada para perfilado e eletrocalha","un",100,{"$f":"OFFSET(INDEX(Composições!A:J,MATCH(B262,Composições!B:B,0),10),2,0)","v":32.53},3253,{"$f":"BDI!$B$17","v":0.2034},39.15,3915,null,32.53,"","",3253,"",39.15,"",3915,""]
["SF-00272","Bloco autônomo de emergência","un",100,{"$f":"OFFSET(INDEX(Composições!A:J,MATCH(B263,Composições!B:B,0),10),2,0)","v":160.88999999999999},16089,{"$f":"BDI!$B$17","v":0.2034},193.62,19362,null,160.88,9.9999999999909051E-3,{"$f":"IF(ISNUMBER(L263),L263/K263,\"\")","v":6.2158130283384541E-5},16088,1,193.6,2.0000000000010232E-2,19360,2]
["SF-00273","Instalação de luminária reaproveitada","un",500,{"$f":"OFFSET(INDEX(Composições!A:J,MATCH(B264,Composições!B:B,0),10),2,0)","v":22.700000000000003},11350,{"$f":"BDI!$B$17","v":0.2034},27.32,13660,null,22.7,{"$f":"IF(E264=K264,\"\",E264-K264)","v":""},"",11350,{"$f":"IF(F264=N264,\"\",F264-N264)","v":""},27.32,{"$f":"IF(H264=P264,\"\",H264-P264)","v":""},13660,{"$f":"IF(I264=R264,\"\",I264-R264)","v":""}]
["SF-00274","Luminária 2x14 W de embutir","un",50,{"$f":"OFFSET(INDEX(Composições!A:J,MATCH(B265,Composições!B:B,0),10),2,0)","v":202.43000000000004},10121.5,{"$f":"BDI!$B$17","v":0.2034},243.6,12180,null,202.43,"","",10121.5,"",243.6,"",12180,""]
["SF-00275","Luminária 2x14 W de sobrepor","un",20,{"$f":"OFFSET(INDEX(Composições!A:J,MATCH(B266,Composições!B:B,0),10),2,0)","v":197.09000000000003},3941.8,{"$f":"BDI!$B$17","v":0.2034},237.18,4743.6000000000004,null,197.09,"","",3941.8,"",237.18,"",4743.6000000000004,""]
["SF-00276","Luminária 2x28 W de embutir","un",500,{"$f":"OFFSET(INDEX(Composições!A:J,MATCH(B267,Composições!B:B,0),10),2,0)","v":216.47000000000003},108235,{"$f":"BDI!$B$17","v":0.2034},260.5,130250,null,216.47,"","",108235,"",260.5,"",130250,""]
["SF-00277","Luminária 2x28 W de sobrepor","un",100,{"$f":"OFFSET(INDEX(Composições!A:J,MATCH(B268,Composições!B:B,0),10),2,0)","v":229.43000000000004},22943,{"$f":"BDI!$B$17","v":0.2034},276.10000000000002,27610,null,229.43,"","",22943,"",276.10000000000002,"",27610,""]
["SF-00278","Condutor 10mm²","m",2000,{"$f":"OFFSET(INDEX(Composições!A:J,MATCH(B269,Composições!B:B,0),10),2,0)","v":9.43},18860,{"$f":"BDI!$B$17","v":0.2034},11.35,22700,null,9.42,9.9999999999997868E-3,1.0615711252653702E-3,18840,20,11.34,9.9999999999997868E-3,22680,20]
["SF-00279","Condutor 16mm²","m",2000,{"$f":"OFFSET(INDEX(Composições!A:J,MATCH(B270,Composições!B:B,0),10),2,0)","v":13.969999999999999},27940,{"$f":"BDI!$B$17","v":0.2034},16.809999999999999,33620,null,13.97,"","",27940,"",16.809999999999999,"",33620,""]
["SF-00280","Condutor 2,5 mm²","m",24000,{"$f":"OFFSET(INDEX(Composições!A:J,MATCH(B271,Composições!B:B,0),10),2,0)","v":2.4499999999999997},58800,{"$f":"BDI!$B$17","v":0.2034},2.95,70800,null,2.46,-1.0000000000000231E-2,-4.0650406504065982E-3,59040,-240,2.96,-9.9999999999997868E-3,71040,-240]
["SF-00281","Condutor 3x2,5 mm²","m",5000,{"$f":"OFFSET(INDEX(Composições!A:J,MATCH(B272,Composições!B:B,0),10),2,0)","v":7.79},38950,{"$f":"BDI!$B$17","v":0.2034},9.3699999999999992,46850,null,7.8,-9.9999999999997868E-3,-1.2820512820512547E-3,39000,-50,9.39,-2.000000000000135E-2,46950,-100]
["SF-00282","Condutor 4 mm²","m",9500,{"$f":"OFFSET(INDEX(Composições!A:J,MATCH(B273,Composições!B:B,0),10),2,0)","v":3.73},35435,{"$f":"BDI!$B$17","v":0.2034},4.49,42655,null,3.74,-1.0000000000000231E-2,-2.6737967914439117E-3,35530,-95,4.5,-9.9999999999997868E-3,42750,-95]
["SF-00283","Condutor 4x2,5 mm²","m",5000,{"$f":"OFFSET(INDEX(Composições!A:J,MATCH(B274,Composições!B:B,0),10),2,0)","v":5.91},29550,{"$f":"BDI!$B$17","v":0.2034},7.11,35550,null,5.91,"","",29550,"",7.11,"",35550,""]
["SF-00284","Condutor 6 mm²","m",6000,{"$f":"OFFSET(INDEX(Composições!A:J,MATCH(B275,Composições!B:B,0),10),2,0)","v":5.0200000000000005},30120,{"$f":"BDI!$B$17","v":0.2034},6.04,36240,null,5.03,-9.9999999999997868E-3,-1.9880715705764985E-3,30180,-60,6.05,-9.9999999999997868E-3,36300,-60]
["SF-00285","Quadro elétrico TTA","un",20,{"$f":"OFFSET(INDEX(Composições!A:J,MATCH(B276,Composições!B:B,0),10),2,0)","v":8520.2300000000014},170404.6,{"$f":"BDI!$G$17","v":0.11},9457.4599999999991,189149.2,null,8520.2199999999993,1.0000000002037268E-2,1.173678614171614E-6,170404.4,0.20000000001164153,9457.44,1.9999999998617568E-2,189148.79999999999,0.40000000002328306]
["SF-00286","Ar-condicionado do tipo split piso-teto inverter 54.000BTU/h","un",5,10464.26,52321.3,{"$f":"BDI!$G$17","v":0.11},11615.33,58076.65,null,10464.26,"","",52321.3,"",11615.33,"",58076.65,""]
["SF-00287","Ar-condicionado fancolete hidrônico dutado 2,5 TR","un",60,2693,161580,{"$f":"BDI!$G$17","v":0.11},2989.23,179353.8,null,2693,"","",161580,"",2989.23,"",179353.8,""]
["SF-00288","Ar-condicionado fancolete hidrônico dutado 4,5 TR","un",10,3224.5,32245,{"$f":"BDI!$G$17","v":0.11},3579.2,35792,null,3224.5,"","",32245,"",3579.2,"",35792,""]
["SF-00289","Ar-condicionado fancolete hidrônico hi-wall 1,4 TR","un",5,3093.75,15468.75,{"$f":"BDI!$G$17","v":0.11},3434.06,17170.3,null,3093.75,"","",15468.75,"",3434.06,"",17170.3,""]
["SF-00290","Ar-condicionado split dutado inverter 30.000 BTU/h","un",40,9632.0499999999993,385282,{"$f":"BDI!$G$17","v":0.11},10691.58,427663.2,null,9632.0499999999993,"","",385282,"",10691.58,"",427663.2,""]
["SF-00291","Ar-condicionado split hi-wall inverter 12.000 BTU/h","un",40,1640,65600,{"$f":"BDI!$G$17","v":0.11},1820.4,72816,null,1640,"","",65600,"",1820.4,"",72816,""]
["SF-00292","Ar-condicionado split hi-wall inverter 22.000 BTU/h","un",40,2742.03,109681.2,{"$f":"BDI!$G$17","v":0.11},3043.65,121746,null,2742.03,"","",109681.2,"",3043.65,"",121746,""]
["SF-00293","Instalação de fancolete reaproveitado","un",30,{"$f":"OFFSET(INDEX(Composições!A:J,MATCH(B284,Composições!B:B,0),10),2,0)","v":70.94},2128.1999999999998,{"$f":"BDI!$B$17","v":0.2034},85.37,2561.1,null,70.94,"","",2128.1999999999998,"",85.37,"",2561.1,""]
["SF-00294","Instalação de split reaproveitado","un",50,{"$f":"OFFSET(INDEX(Composições!A:J,MATCH(B285,Composições!B:B,0),10),2,0)","v":106.41},5320.5,{"$f":"BDI!$B$17","v":0.2034},128.05000000000001,6402.5,null,106.4,9.9999999999909051E-3,9.3984962405929554E-5,5320,0.5,128.04,1.0000000000019327E-2,6402,0.5]
["SF-00295","Exaustor axial 340 m3/h","un",60,{"$f":"OFFSET(INDEX(Composições!A:J,MATCH(B286,Composições!B:B,0),10),2,0)","v":187.18},11230.8,{"$f":"BDI!$B$17","v":0.2034},225.25,13515,null,187.18,"","",11230.8,"",225.25,"",13515,""]
["SF-00296","Exaustor axial 865 m3/h","un",5,{"$f":"OFFSET(INDEX(Composições!A:J,MATCH(B287,Composições!B:B,0),10),2,0)","v":894.02},4470.1000000000004,{"$f":"BDI!$B$17","v":0.2034},1075.8599999999999,5379.3,null,894.02,"","",4470.1000000000004,"",1075.8599999999999,"",5379.3,""]
["SF-00297","Duto chapa galvanizada # 22","m2",880,{"$f":"OFFSET(INDEX(Composições!A:J,MATCH(B288,Composições!B:B,0),10),2,0)","v":176.03},154906.4,{"$f":"BDI!$B$17","v":0.2034},211.83,186410.4,null,176.04,-9.9999999999909051E-3,-5.680527152914625E-5,154915.20000000001,-8.8000000000174623,211.85,-1.999999999998181E-2,186428,-17.600000000005821]
["SF-00298","Duto flexível 6”","m",40,{"$f":"OFFSET(INDEX(Composições!A:J,MATCH(B289,Composições!B:B,0),10),2,0)","v":26.42},1056.8,{"$f":"BDI!$B$17","v":0.2034},31.79,1271.5999999999999,null,26.43,-9.9999999999980105E-3,-3.7835792659848697E-4,1057.2,-0.40000000000009095,31.81,-1.9999999999999574E-2,1272.4000000000001,-0.8000000000001819]
["SF-00299","Duto flexível 8”","m",20,{"$f":"OFFSET(INDEX(Composições!A:J,MATCH(B290,Composições!B:B,0),10),2,0)","v":28.38},567.6,{"$f":"BDI!$B$17","v":0.2034},34.15,683,null,28.39,-1.0000000000001563E-2,-3.522367030645144E-4,567.79999999999995,-0.19999999999993179,34.159999999999997,-9.9999999999980105E-3,683.2,-0.20000000000004547]
["SF-00300","Difusor de ar quadrado 360x360 mm","un",180,{"$f":"OFFSET(INDEX(Composições!A:J,MATCH(B291,Composições!B:B,0),10),2,0)","v":207.59},37366.199999999997,{"$f":"BDI!$B$17","v":0.2034},249.81,44965.8,null,207.59,"","",37366.199999999997,"",249.81,"",44965.8,""]
["SF-00301","Difusor de ar quadrado com caixa plenum AK6 360x360 mm","un",10,{"$f":"OFFSET(INDEX(Composições!A:J,MATCH(B292,Composições!B:B,0),10),2,0)","v":246.68},2466.8000000000002,{"$f":"BDI!$B$17","v":0.2034},296.85000000000002,2968.5,null,246.68,"","",2466.8000000000002,"",296.85000000000002,"",2968.5,""]
["SF-00302","Difusor de ar quadrado para insuflamento em duas direções perpendiculares 376x376 mm","un",10,{"$f":"OFFSET(INDEX(Composições!A:J,MATCH(B293,Composições!B:B,0),10),2,0)","v":191.18},1911.8,{"$f":"BDI!$B$17","v":0.2034},230.07,2300.6999999999998,null,191.18,"","",1911.8,"",230.07,"",2300.6999999999998,""]
["SF-00303","Difusor de ar retangular para insuflamento em duas direções 371x208 mm","un",5,{"$f":"OFFSET(INDEX(Composições!A:J,MATCH(B294,Composições!B:B,0),10),2,0)","v":154.99},774.95,{"$f":"BDI!$B$17","v":0.2034},186.51,932.55,null,154.99,"","",774.95,"",186.51,"",932.55,""]
["SF-00304","Difusor de ar retangular para insuflamento em três direções 264x432 mm","un",5,{"$f":"OFFSET(INDEX(Composições!A:J,MATCH(B295,Composições!B:B,0),10),2,0)","v":208.9},1044.5,{"$f":"BDI!$B$17","v":0.2034},251.39,1256.95,null,208.9,"","",1044.5,"",251.39,"",1256.95,""]
["SF-00305","Difusor de ar retangular para insuflamento em três direções 320x562 mm","un",5,{"$f":"OFFSET(INDEX(Composições!A:J,MATCH(B296,Composições!B:B,0),10),2,0)","v":246.31},1231.55,{"$f":"BDI!$B$17","v":0.2034},296.41000000000003,1482.05,null,246.31,"","",1231.55,"",296.41000000000003,"",1482.05,""]
["SF-00306","Difusor de ar retangular para insuflamento em três direções 371x208 mm","un",5,{"$f":"OFFSET(INDEX(Composições!A:J,MATCH(B297,Composições!B:B,0),10),2,0)","v":167.16000000000003},835.8,{"$f":"BDI!$B$17","v":0.2034},201.16,1005.8,null,167.16,"","",835.8,"",201.16,"",1005.8,""]
["SF-00307","Difusor de ar retangular para insuflamento em uma direção 371x208 mm","un",10,{"$f":"OFFSET(INDEX(Composições!A:J,MATCH(B298,Composições!B:B,0),10),2,0)","v":152.27000000000001},1522.7,{"$f":"BDI!$B$17","v":0.2034},183.24,1832.4,null,152.27000000000001,"","",1522.7,"",183.24,"",1832.4,""]
["SF-00308","Grelha para retorno retangular 425x225 mm","un",180,{"$f":"OFFSET(INDEX(Composições!A:J,MATCH(B299,Composições!B:B,0),10),2,0)","v":165.4},29772,{"$f":"BDI!$B$17","v":0.2034},199.04,35827.199999999997,null,165.4,"","",29772,"",199.04,"",35827.199999999997,""]
["SF-00309","Grelha para retorno retangular 525x325 mm","un",10,{"$f":"OFFSET(INDEX(Composições!A:J,MATCH(B300,Composições!B:B,0),10),2,0)","v":185.08},1850.8,{"$f":"BDI!$B$17","v":0.2034},222.73,2227.3000000000002,null,185.08,"","",1850.8,"",222.73,"",2227.3000000000002,""]
["SF-00310","Instalação de difusores, grelhas e acessórios de climatização reaproveitados","un",120,{"$f":"OFFSET(INDEX(Composições!A:J,MATCH(B301,Composições!B:B,0),10),2,0)","v":88.68},10641.6,{"$f":"BDI!$B$17","v":0.2034},106.72,12806.4,null,88.68,"","",10641.6,"",106.72,"",12806.4,""]
["SF-00311","Instalação de exaustor reaproveitado","un",20,{"$f":"OFFSET(INDEX(Composições!A:J,MATCH(B302,Composições!B:B,0),10),2,0)","v":34.770000000000003},695.4,{"$f":"BDI!$B$17","v":0.2034},41.84,836.8,null,34.770000000000003,"","",695.4,"",41.84,"",836.8,""]
["SF-00312","Preparação para instalação de difusores/grelhas de ar em portas","un",20,{"$f":"OFFSET(INDEX(Composições!A:J,MATCH(B303,Composições!B:B,0),10),2,0)","v":26.78},535.6,{"$f":"BDI!$B$17","v":0.2034},32.229999999999997,644.6,null,26.78,"","",535.6,"",32.229999999999997,"",644.6,""]
["SF-00313","Bomba para condensado de ar-condicionado para instalação oculta","un",10,{"$f":"OFFSET(INDEX(Composições!A:J,MATCH(B304,Composições!B:B,0),10),2,0)","v":472.02},4720.2,{"$f":"BDI!$B$17","v":0.2034},568.03,5680.3,null,472.02,"","",4720.2,"",568.03,"",5680.3,""]
["SF-00314","Fita aluminizada para refrigeração 48 mm","m",600,0.09,54,{"$f":"BDI!$B$17","v":0.2034},0.11,66,null,0.09,"","",54,"",0.11,"",66,""]
["SF-00315","Fita PVC 100 mm para acabamento em refrigeração","m",9600,0.3,2880,{"$f":"BDI!$B$17","v":0.2034},0.36,3456,null,0.3,"","",2880,"",0.36,"",3456,""]
["SF-00316","Mangueira emborrachada 3/4\" para água gelada","m",75,23.98,1798.5,{"$f":"BDI!$B$17","v":0.2034},28.86,2164.5,null,23.98,"","",1798.5,"",28.86,"",2164.5,""]
["SF-00317","Suporte para unidade condensadora de aparelho split","un",125,{"$f":"OFFSET(INDEX(Composições!A:J,MATCH(B308,Composições!B:B,0),10),2,0)","v":56.03},7003.75,{"$f":"BDI!$B$17","v":0.2034},67.430000000000007,8428.75,null,56.01,2.0000000000003126E-2,3.5707909301915954E-4,7001.25,2.5,67.400000000000006,3.0000000000001137E-2,8425,3.75]
["SF-00318","Suporte para unidade evaporadora de aparelho split ou fancolete","un",200,{"$f":"OFFSET(INDEX(Composições!A:J,MATCH(B309,Composições!B:B,0),10),2,0)","v":79.599999999999994},15920,{"$f":"BDI!$B$17","v":0.2034},95.79,19158,null,79.58,1.9999999999996021E-2,2.5131942699165645E-4,15916,4,95.77,2.0000000000010232E-2,19154,4]
["SF-00319","Filtro em Y 1\"","un",10,{"$f":"OFFSET(INDEX(Composições!A:J,MATCH(B310,Composições!B:B,0),10),2,0)","v":130.23000000000002},1302.3,{"$f":"BDI!$B$17","v":0.2034},156.72,1567.2,null,130.22999999999999,"","",1302.3,"",156.72,"",1567.2,""]
["SF-00320","Filtro em Y 3/4\"","un",65,{"$f":"OFFSET(INDEX(Composições!A:J,MATCH(B311,Composições!B:B,0),10),2,0)","v":98.84},6424.6,{"$f":"BDI!$B$17","v":0.2034},118.94,7731.1,null,98.84,"","",6424.6,"",118.94,"",7731.1,""]
["SF-00321","Válvula de balanceamento e controle independente da pressão (PIBCV) 2 vias 1\"","un",10,{"$f":"OFFSET(INDEX(Composições!A:J,MATCH(B312,Composições!B:B,0),10),2,0)","v":498.51},4985.1000000000004,{"$f":"BDI!$B$17","v":0.2034},599.91,5999.1,null,498.51,"","",4985.1000000000004,"",599.91,"",5999.1,""]
["SF-00322","Válvula de balanceamento e controle independente da pressão (PIBCV) 2 vias 3/4\"","un",65,{"$f":"OFFSET(INDEX(Composições!A:J,MATCH(B313,Composições!B:B,0),10),2,0)","v":519.82999999999993},{"$f":"IF(ISNUMBER(E313),ROUND(D313*E313,2),\"-\")","v":33788.949999999997},{"$f":"BDI!$B$17","v":0.2034},{"$f":"IF(ISNUMBER(E313),ROUND(E313*(1+G313),2),0)","v":625.55999999999995},40661.4,null,519.83000000000004,"","",33788.949999999997,"",625.55999999999995,"",40661.4,""]
["SF-00323","Válvula de esfera em bronze 1 1/2\"","un",20,{"$f":"OFFSET(INDEX(Composições!A:J,MATCH(B314,Composições!B:B,0),10),2,0)","v":106.41},2128.1999999999998,{"$f":"BDI!$B$17","v":0.2034},128.05000000000001,2561,null,106.41,"","",2128.1999999999998,"",128.05000000000001,"",2561,""]
["SF-00324","Válvula de esfera em bronze 1 1/4\"","un",20,{"$f":"OFFSET(INDEX(Composições!A:J,MATCH(B315,Composições!B:B,0),10),2,0)","v":92.86999999999999},1857.4,{"$f":"BDI!$B$17","v":0.2034},111.76,2235.1999999999998,null,92.87,"","",1857.4,"",111.76,"",2235.1999999999998,""]
["SF-00325","Válvula de esfera em bronze 1\"","un",20,{"$f":"OFFSET(INDEX(Composições!A:J,MATCH(B316,Composições!B:B,0),10),2,0)","v":70.549999999999983},1411,{"$f":"BDI!$B$17","v":0.2034},84.9,1698,null,70.55,"","",1411,"",84.9,"",1698,""]
["SF-00326","Válvula de esfera em bronze 3/4\"","un",150,{"$f":"OFFSET(INDEX(Composições!A:J,MATCH(B317,Composições!B:B,0),10),2,0)","v":59.059999999999995},8859,{"$f":"BDI!$B$17","v":0.2034},71.069999999999993,10660.5,null,59.06,"","",8859,"",71.069999999999993,"",10660.5,""]
["SF-00327","Isolamento elastomérico em formato de prancha autoadesiva","m2",825,{"$f":"OFFSET(INDEX(Composições!A:J,MATCH(B318,Composições!B:B,0),10),2,0)","v":107.64999999999999},88811.25,{"$f":"BDI!$B$17","v":0.2034},129.55000000000001,{"$f":"ROUND(H318*D318,2)","v":106878.75},null,107.65,"","",88811.25,"",129.55000000000001,"",106878.75,""]
["SF-00328","Isolamento elastomérico para tubulações de cobre de 1 1/8\" / tubulações de ferro de 3/4\"","m",810,{"$f":"OFFSET(INDEX(Composições!A:J,MATCH(B319,Composições!B:B,0),10),2,0)","v":12.1},9801,{"$f":"BDI!$B$17","v":0.2034},14.56,11793.6,null,12.11,-9.9999999999997868E-3,-8.2576383154416076E-4,9809.1,-8.1000000000003638,14.57,-9.9999999999997868E-3,11801.7,-8.1000000000003638]
["SF-00329","Isolamento elastomérico para tubulações de cobre de 1/2\"","m",400,{"$f":"OFFSET(INDEX(Composições!A:J,MATCH(B320,Composições!B:B,0),10),2,0)","v":8.2999999999999989},3320,{"$f":"BDI!$B$17","v":0.2034},9.99,3996,null,8.3000000000000007,"","",3320,"",9.99,"",3996,""]
["SF-00330","Isolamento elastomérico para tubulações de cobre de 1/4\"","m",400,{"$f":"OFFSET(INDEX(Composições!A:J,MATCH(B321,Composições!B:B,0),10),2,0)","v":5.41},2164,{"$f":"BDI!$B$17","v":0.2034},6.51,2604,null,5.41,"","",2164,"",6.51,"",2604,""]
["SF-00331","Isolamento elastomérico para tubulações de cobre de 3/4\"","m",400,{"$f":"OFFSET(INDEX(Composições!A:J,MATCH(B322,Composições!B:B,0),10),2,0)","v":9.6699999999999982},3868,{"$f":"BDI!$B$17","v":0.2034},11.64,4656,null,9.68,-1.0000000000001563E-2,-1.033057851239831E-3,3872,-4,11.65,-9.9999999999997868E-3,4660,-4]
["SF-00332","Isolamento elastomérico para tubulações de cobre de 3/8\"","m",800,{"$f":"OFFSET(INDEX(Composições!A:J,MATCH(B323,Composições!B:B,0),10),2,0)","v":7.3000000000000007},5840,{"$f":"BDI!$B$17","v":0.2034},8.7799999999999994,7024,null,7.3,"","",5840,"",8.7799999999999994,"",7024,""]
["SF-00333","Isolamento elastomérico para tubulações de cobre de 5/8\"","m",400,{"$f":"OFFSET(INDEX(Composições!A:J,MATCH(B324,Composições!B:B,0),10),2,0)","v":8.9499999999999993},3580,{"$f":"BDI!$B$17","v":0.2034},10.77,4308,null,8.9600000000000009,-1.0000000000001563E-2,-1.1160714285716028E-3,3584,-4,10.78,-9.9999999999997868E-3,4312,-4]
["SF-00334","Isolamento elastomérico para tubulações de cobre de 7/8\" / tubulações de ferro de 1/2\"","m",100,{"$f":"OFFSET(INDEX(Composições!A:J,MATCH(B325,Composições!B:B,0),10),2,0)","v":10.36},1036,{"$f":"BDI!$B$17","v":0.2034},12.47,1247,null,10.37,-9.9999999999997868E-3,-9.6432015429120423E-4,1037,-1,12.48,-9.9999999999997868E-3,1248,-1]
["SF-00335","Isolamento elastomérico para tubulações de cobre de 1\"","m",30,{"$f":"OFFSET(INDEX(Composições!A:J,MATCH(B326,Composições!B:B,0),10),2,0)","v":10.54},{"$f":"IF(ISNUMBER(E326),ROUND(D326*E326,2),\"-\")","v":316.2},{"$f":"BDI!$B$17","v":0.2034},{"$f":"IF(ISNUMBER(E326),ROUND(E326*(1+G326),2),0)","v":12.68},380.4,null,10.55,-1.0000000000001563E-2,-9.4786729857834718E-4,316.5,-0.30000000000001137,12.7,-1.9999999999999574E-2,381,-0.60000000000002274]
["SF-00336","Isolamento elastomérico para tubulações de ferro de 1 1/2\"","m",100,{"$f":"OFFSET(INDEX(Composições!A:J,MATCH(B327,Composições!B:B,0),10),2,0)","v":20.64},2064,{"$f":"BDI!$B$17","v":0.2034},24.84,2484,null,20.65,-9.9999999999980105E-3,{"$f":"IF(ISNUMBER(L327),L327/K327,\"\")","v":-4.8426150121055742E-4},2065,-1,24.85,-1.0000000000001563E-2,2485,-1]
["SF-00337","Isolamento elastomérico para tubulações de ferro de 1 1/4\"","m",100,{"$f":"OFFSET(INDEX(Composições!A:J,MATCH(B328,Composições!B:B,0),10),2,0)","v":18.28},1828,{"$f":"BDI!$B$17","v":0.2034},22,2200,null,18.29,{"$f":"IF(E328=K328,\"\",E328-K328)","v":-9.9999999999980105E-3},-5.4674685620546804E-4,1829,{"$f":"IF(F328=N328,\"\",F328-N328)","v":-1},22.01,{"$f":"IF(H328=P328,\"\",H328-P328)","v":-1.0000000000001563E-2},2201,{"$f":"IF(I328=R328,\"\",I328-R328)","v":-1}]
["SF-00338","Isolamento elastomérico para tubulações de ferro de 1\"","m",100,{"$f":"OFFSET(INDEX(Composições!A:J,MATCH(B329,Composições!B:B,0),10),2,0)","v":14.709999999999999},1471,{"$f":"BDI!$B$17","v":0.2034},17.7,1770,null,14.72,-1.0000000000001563E-2,-6.7934782608706265E-4,1472,-1,17.71,-1.0000000000001563E-2,1771,-1]
["SF-00339","Proteção mecânica em alumínio","m2",100,{"$f":"OFFSET(INDEX(Composições!A:J,MATCH(B330,Composições!B:B,0),10),2,0)","v":21.29},2129,{"$f":"BDI!$B$17","v":0.2034},25.62,2562,null,21.28,9.9999999999980105E-3,4.6992481202998165E-4,2128,1,25.61,1.0000000000001563E-2,2561,1]
["SF-00340","Tubo de aço-carbono galvanizado 1 1/2\"","m",100,{"$f":"OFFSET(INDEX(Composições!A:J,MATCH(B331,Composições!B:B,0),10),2,0)","v":49.49},4949,{"$f":"BDI!$B$17","v":0.2034},59.56,5956,null,49.49,"","",4949,"",59.56,"",5956,""]
["SF-00341","Tubo de aço-carbono galvanizado 1 1/4\"","m",100,{"$f":"OFFSET(INDEX(Composições!A:J,MATCH(B332,Composições!B:B,0),10),2,0)","v":57.19},5719,{"$f":"BDI!$B$17","v":0.2034},68.819999999999993,6882,null,57.2,-1.0000000000005116E-2,-1.7482517482526424E-4,5720,-1,68.83,-1.0000000000005116E-2,6883,-1]
["SF-00342","Tubo de aço-carbono galvanizado 1\"","m",100,{"$f":"OFFSET(INDEX(Composições!A:J,MATCH(B333,Composições!B:B,0),10),2,0)","v":45.099999999999994},4510,{"$f":"BDI!$B$17","v":0.2034},54.27,5427,null,45.09,9.9999999999909051E-3,2.2177866489223562E-4,4509,1,54.26,1.0000000000005116E-2,5426,1]
["SF-00343","Tubo de aço-carbono galvanizado 3/4\"","m",750,{"$f":"OFFSET(INDEX(Composições!A:J,MATCH(B334,Composições!B:B,0),10),2,0)","v":34.14},25605,{"$f":"BDI!$B$17","v":0.2034},41.08,30810,null,34.14,"","",25605,"",41.08,"",30810,""]
["SF-00344","Tubo de cobre de 1/2\"","m",400,{"$f":"OFFSET(INDEX(Composições!A:J,MATCH(B335,Composições!B:B,0),10),2,0)","v":22.919999999999998},9168,{"$f":"BDI!$B$17","v":0.2034},27.58,11032,null,22.92,"","",9168,"",27.58,"",11032,""]
["SF-00345","Tubo de cobre de 1/4\"","m",400,{"$f":"OFFSET(INDEX(Composições!A:J,MATCH(B336,Composições!B:B,0),10),2,0)","v":11.53},4612,{"$f":"BDI!$B$17","v":0.2034},13.88,5552,null,11.54,-9.9999999999997868E-3,-8.665511265164461E-4,4616,-4,13.89,-9.9999999999997868E-3,5556,-4]
["SF-00346","Tubo de cobre de 3/4\"","m",400,{"$f":"OFFSET(INDEX(Composições!A:J,MATCH(B337,Composições!B:B,0),10),2,0)","v":33.839999999999996},13536,{"$f":"BDI!$B$17","v":0.2034},40.72,16288,null,33.85,-1.0000000000005116E-2,-2.9542097488936825E-4,13540,-4,40.74,-2.0000000000003126E-2,16296,-8]
["SF-00347","Tubo de cobre de 3/8\"","m",800,{"$f":"OFFSET(INDEX(Composições!A:J,MATCH(B338,Composições!B:B,0),10),2,0)","v":17.200000000000003},13760,{"$f":"BDI!$B$17","v":0.2034},20.7,16560,null,17.190000000000001,1.0000000000001563E-2,5.8173356602685068E-4,13752,8,20.69,9.9999999999980105E-3,16552,8]
["SF-00348","Tubo de cobre de 5/8\"","m",400,{"$f":"OFFSET(INDEX(Composições!A:J,MATCH(B339,Composições!B:B,0),10),2,0)","v":28.240000000000002},11296,{"$f":"BDI!$B$17","v":0.2034},33.979999999999997,13592,null,28.25,-9.9999999999980105E-3,-3.5398230088488534E-4,11300,-4,34,-2.0000000000003126E-2,13600,-8]
["SF-00349","Tubo de cobre de 7/8\"","m",100,{"$f":"OFFSET(INDEX(Composições!A:J,MATCH(B340,Composições!B:B,0),10),2,0)","v":29.990000000000002},2999,{"$f":"BDI!$B$17","v":0.2034},36.090000000000003,3609,null,30,-9.9999999999980105E-3,-3.3333333333326702E-4,3000,-1,36.1,-9.9999999999980105E-3,3610,-1]
["SF-00350","Tubo de cobre de 1\"","m",30,{"$f":"OFFSET(INDEX(Composições!A:J,MATCH(B341,Composições!B:B,0),10),2,0)","v":33.83},{"$f":"IF(ISNUMBER(E341),ROUND(D341*E341,2),\"-\")","v":1014.9},{"$f":"BDI!$B$17","v":0.2034},{"$f":"IF(ISNUMBER(E341),ROUND(E341*(1+G341),2),0)","v":40.71},1221.3,null,33.840000000000003,-1.0000000000005116E-2,-2.9550827423182962E-4,1015.2,-0.30000000000006821,40.72,-9.9999999999980105E-3,1221.5999999999999,-0.29999999999995453]
["SF-00351","Tubo de cobre de 1 1/8\"","m",60,{"$f":"OFFSET(INDEX(Composições!A:J,MATCH(B342,Composições!B:B,0),10),2,0)","v":37.669999999999995},{"$f":"IF(ISNUMBER(E342),ROUND(D342*E342,2),\"-\")","v":2260.1999999999998},{"$f":"BDI!$B$17","v":0.2034},{"$f":"IF(ISNUMBER(E342),ROUND(E342*(1+G342),2),0)","v":45.33},2719.8,null,37.67,"","",2260.1999999999998,"",45.33,"",2719.8,""]
["SF-00354","Instalação de armários reaproveitados","m2",240,{"$f":"OFFSET(INDEX(Composições!A:J,MATCH(B343,Composições!B:B,0),10),2,0)","v":86.09},20661.599999999999,{"$f":"BDI!$B$17","v":0.2034},103.6,24864,null,86.1,-9.9999999999909051E-3,-1.1614401858293734E-4,20664,-2.4000000000014552,103.61,-1.0000000000005116E-2,24866.400000000001,-2.4000000000014552]
["SF-00359","Batentes e guarnições para porta, em madeira","un",64,{"$f":"OFFSET(INDEX(Composições!A:J,MATCH(B344,Composições!B:B,0),10),2,0)","v":309.71999999999997},19822.080000000002,{"$f":"BDI!$B$17","v":0.2034},372.72,23854.080000000002,null,308.97000000000003,0.74999999999994316,2.4274201378772795E-3,19774.080000000002,48,371.81,0.91000000000002501,23795.84,58.240000000001601]
["SF-00360","Chapa de proteção para porta – Linha Acessibilidade","m2",5,{"$f":"OFFSET(INDEX(Composições!A:J,MATCH(B345,Composições!B:B,0),10),2,0)","v":193.28},966.4,{"$f":"BDI!$B$17","v":0.2034},232.59,1162.95,null,193.29,-9.9999999999909051E-3,-5.1735733871337918E-5,966.45,-5.0000000000068212E-2,232.61,-2.0000000000010232E-2,1163.05,-9.9999999999909051E-2]
["SF-00361","Folha de porta em madeira 2,10x0,60m, com ou sem bandeira, e dobradiças","un",10,{"$f":"OFFSET(INDEX(Composições!A:J,MATCH(B346,Composições!B:B,0),10),2,0)","v":262.13},2621.3000000000002,{"$f":"BDI!$B$17","v":0.2034},315.45,3154.5,null,262.05,7.9999999999984084E-2,3.0528525090625484E-4,2620.5,0.8000000000001819,315.35000000000002,9.9999999999965894E-2,3153.5,1]
["SF-00362","Folha de porta em madeira 2,10x0,70m, com ou sem bandeira, e dobradiças","un",15,{"$f":"OFFSET(INDEX(Composições!A:J,MATCH(B347,Composições!B:B,0),10),2,0)","v":213.19},3197.85,{"$f":"BDI!$B$17","v":0.2034},256.55,3848.25,null,213.1,9.0000000000003411E-2,4.2233693101831728E-4,3196.5,1.3499999999999091,256.44,0.11000000000001364,3846.6,1.6500000000000909]
["SF-00363","Folha de porta em madeira 2,10x0,80m, com ou sem bandeira, e dobradiças","un",30,{"$f":"OFFSET(INDEX(Composições!A:J,MATCH(B348,Composições!B:B,0),10),2,0)","v":298.27000000000004},8948.1,{"$f":"BDI!$B$17","v":0.2034},358.94,10768.2,null,298.20999999999998,6.0000000000059117E-2,2.0120049629475579E-4,8946.2999999999993,1.8000000000010914,358.87,6.9999999999993179E-2,10766.1,2.1000000000003638]
["SF-00364","Folha de porta em madeira 2,10x0,90m, com ou sem bandeira, e dobradiças","un",25,{"$f":"OFFSET(INDEX(Composições!A:J,MATCH(B349,Composições!B:B,0),10),2,0)","v":285.68},7142,{"$f":"BDI!$B$17","v":0.2034},343.79,8594.75,null,285.62,6.0000000000002274E-2,2.1006932287655721E-4,7140.5,1.5,343.72,6.9999999999993179E-2,8593,1.75]
["SF-00365","Folha de porta em madeira 2,10x1,0m, com ou sem bandeira, e dobradiças","un",10,{"$f":"OFFSET(INDEX(Composições!A:J,MATCH(B350,Composições!B:B,0),10),2,0)","v":303.27000000000004},3032.7,{"$f":"BDI!$B$17","v":0.2034},364.96,3649.6,null,103.26,200.01000000000005,1.9369552585705989,1032.5999999999999,2000.1,124.26,240.7,1242.5999999999999,2407]
["SF-00366","Instalação de batentes de madeira reaproveitados","un",30,{"$f":"OFFSET(INDEX(Composições!A:J,MATCH(B351,Composições!B:B,0),10),2,0)","v":72.39},2171.6999999999998,{"$f":"BDI!$B$17","v":0.2034},87.11,2613.3000000000002,null,71.63,0.76000000000000512,1.0610079575596889E-2,2148.9,22.799999999999727,86.2,0.90999999999999659,2586,27.300000000000182]
["SF-00367","Instalação de folhas de portas e dobradiças reaproveitadas","un",30,{"$f":"OFFSET(INDEX(Composições!A:J,MATCH(B352,Composições!B:B,0),10),2,0)","v":73.540000000000006},2206.1999999999998,{"$f":"BDI!$B$17","v":0.2034},88.5,2655,null,73.540000000000006,"","",2206.1999999999998,"",88.5,"",2655,""]
["SF-00368","Dobradiça para porta","un",385,{"$f":"OFFSET(INDEX(Composições!A:J,MATCH(B353,Composições!B:B,0),10),2,0)","v":30.31},11669.35,{"$f":"BDI!$B$17","v":0.2034},36.479999999999997,14044.8,null,30.31,"","",11669.35,"",36.479999999999997,"",14044.8,""]
["SF-00369","Fechadura para banheiro maçaneta em barra","un",15,{"$f":"OFFSET(INDEX(Composições!A:J,MATCH(B354,Composições!B:B,0),10),2,0)","v":105.99999999999999},1590,{"$f":"BDI!$B$17","v":0.2034},127.56,1913.4,null,105.99,9.9999999999909051E-3,9.4348523445522277E-5,1589.85,0.15000000000009095,127.55,1.0000000000005116E-2,1913.25,0.15000000000009095]
["SF-00370","Fechadura para porta externa maçaneta em barra","un",16,{"$f":"OFFSET(INDEX(Composições!A:J,MATCH(B355,Composições!B:B,0),10),2,0)","v":120.89000000000001},1934.24,{"$f":"BDI!$B$17","v":0.2034},145.47999999999999,2327.6799999999998,null,120.88,1.0000000000019327E-2,8.2726671078915684E-5,1934.08,0.16000000000008185,145.47,9.9999999999909051E-3,2327.52,0.15999999999985448]
["SF-00371","Fechadura para porta interna maçaneta tubular","un",167,{"$f":"OFFSET(INDEX(Composições!A:J,MATCH(B356,Composições!B:B,0),10),2,0)","v":655.84},109525.28,{"$f":"BDI!$B$17","v":0.2034},789.24,131803.07999999999,null,655.83,9.9999999999909051E-3,1.5247853864554693E-5,109523.61,1.6699999999982538,789.23,9.9999999999909051E-3,131801.41,1.6699999999837019]
["SF-00372","Instalação de fechadura/puxador de porta reaproveitados","m",30,{"$f":"OFFSET(INDEX(Composições!A:J,MATCH(B357,Composições!B:B,0),10),2,0)","v":26.380000000000003},791.4,{"$f":"BDI!$B$17","v":0.2034},31.75,952.5,null,26.37,1.0000000000001563E-2,3.7921880925299823E-4,791.1,0.29999999999995453,31.73,1.9999999999999574E-2,951.9,0.60000000000002274]
["SF-00373","Mola hidráulica aérea","un",25,{"$f":"OFFSET(INDEX(Composições!A:J,MATCH(B358,Composições!B:B,0),10),2,0)","v":144.23000000000002},3605.75,{"$f":"BDI!$B$17","v":0.2034},173.57,4339.25,null,144.22999999999999,"","",3605.75,"",173.57,"",4339.25,""]
["SF-00374","Pivô em latão com acabamento cromado para portas pivotantes","un",25,{"$f":"OFFSET(INDEX(Composições!A:J,MATCH(B359,Composições!B:B,0),10),2,0)","v":71.900000000000006},1797.5,{"$f":"BDI!$B$17","v":0.2034},86.52,2163,null,71.900000000000006,"","",1797.5,"",86.52,"",2163,""]
["SF-00375","Cabo de dados tipo UTP, tipo LSZH, categoria 6","m",25000,{"$f":"OFFSET(INDEX(Composições!A:J,MATCH(B360,Composições!B:B,0),10),2,0)","v":4.84},{"$f":"IF(ISNUMBER(E360),ROUND(D360*E360,2),\"-\")","v":121000},{"$f":"BDI!$B$17","v":0.2034},{"$f":"IF(ISNUMBER(E360),ROUND(E360*(1+G360),2),0)","v":5.82},145500,null,4.8499999999999996,-9.9999999999997868E-3,-2.061855670103049E-3,121250,-250,5.84,-1.9999999999999574E-2,146000,-500]
["SF-00376","Módulo (tomada) de rede RJ45, categoria 6, com conectorização e certificação","un",1400,{"$f":"OFFSET(INDEX(Composições!A:J,MATCH(B361,Composições!B:B,0),10),2,0)","v":56.260000000000005},78764,{"$f":"BDI!$B$17","v":0.2034},67.7,94780,null,56.25,1.0000000000005116E-2,1.7777777777786872E-4,78750,14,67.69,1.0000000000005116E-2,94766,14]
["SF-00377","Painel de distribuição (patch panel) de 24 portas, categoria 6","un",30,{"$f":"OFFSET(INDEX(Composições!A:J,MATCH(B362,Composições!B:B,0),10),2,0)","v":1224.69},36740.699999999997,{"$f":"BDI!$B$17","v":0.2034},1473.79,44213.7,null,1224.68,9.9999999999909051E-3,8.1653983081220439E-6,36740.400000000001,0.29999999999563443,1473.78,9.9999999999909051E-3,44213.4,0.29999999999563443]
["SF-00378","Cabo de telefonia tipo CCI 50x2","m",10000,{"$f":"OFFSET(INDEX(Composições!A:J,MATCH(B363,Composições!B:B,0),10),2,0)","v":2.68},26800,{"$f":"BDI!$B$17","v":0.2034},3.23,32300,null,2.67,1.0000000000000231E-2,3.7453183520600119E-3,26700,100,3.21,2.0000000000000018E-2,32100,200]
["SF-00379","Módulo (tomada) de rede RJ45, para telefonia","un",1040,{"$f":"OFFSET(INDEX(Composições!A:J,MATCH(B364,Composições!B:B,0),10),2,0)","v":36.550000000000004},38012,{"$f":"BDI!$B$17","v":0.2034},43.98,45739.199999999997,null,36.549999999999997,"","",38012,"",43.98,"",45739.199999999997,""]
["SF-00380","Grelha para retorno para portas, divisórias e paredes 525x325 mm","un",100,{"$f":"OFFSET(INDEX(Composições!A:J,MATCH(B365,Composições!B:B,0),10),2,0)","v":309.99},30999,{"$f":"BDI!$B$17","v":0.2034},373.04,37304,null,309.99,"","",30999,"",373.04,"",37304,""]
["SF-00898","Armação de aço CA-50 bitolas de 5,0mm a 8,00mm","kg",5,{"$f":"OFFSET(INDEX(Composições!A:J,MATCH(B366,Composições!B:B,0),10),2,0)","v":9.27},46.35,{"$f":"BDI!$B$17","v":0.2034},11.16,55.8,null,9.27,"","",46.35,"",11.16,"",55.8,""]
["SF-00915","Graute industrializado, fck ≥ 25MPa","m3",1,{"$f":"OFFSET(INDEX(Composições!A:J,MATCH(B367,Composições!B:B,0),10),2,0)","v":2763.97},2763.97,{"$f":"BDI!$B$17","v":0.2034},3326.16,3326.16,null,2754.61,9.3599999999996726,3.3979401802794848E-3,2754.61,9.3599999999996726,3314.9,11.259999999999764,3314.9,11.259999999999764]
["SF-00916","Armação de aço CA-50 bitolas de 10,0mm a 12,50mm","kg",5,{"$f":"OFFSET(INDEX(Composições!A:J,MATCH(B368,Composições!B:B,0),10),2,0)","v":6.5600000000000005},32.799999999999997,{"$f":"BDI!$B$17","v":0.2034},7.89,39.450000000000003,null,6.55,1.0000000000000675E-2,1.5267175572520116E-3,32.75,4.9999999999997158E-2,7.88,9.9999999999997868E-3,39.4,5.0000000000004263E-2]
["SF-00917","Armação de aço CA-50 bitolas de 16,0mm a 25,0mm","kg",5,{"$f":"OFFSET(INDEX(Composições!A:J,MATCH(B369,Composições!B:B,0),10),2,0)","v":5.4},27,{"$f":"BDI!$B$17","v":0.2034},6.5,32.5,null,5.38,2.0000000000000462E-2,3.7174721189591939E-3,26.9,0.10000000000000142,6.47,3.0000000000000249E-2,32.35,0.14999999999999858]
["SF-00918","Remoção de mola hidráulica de piso","un",15,{"$f":"OFFSET(INDEX(Composições!A:J,MATCH(B370,Composições!B:B,0),10),2,0)","v":17.689999999999998},265.35000000000002,{"$f":"BDI!$B$17","v":0.2034},21.29,319.35000000000002,null,17.670000000000002,1.9999999999996021E-2,1.1318619128464075E-3,265.05,0.30000000000001137,21.26,2.9999999999997584E-2,318.89999999999998,0.45000000000004547]
["SF-00919","Escavação manual de valas","m3",15,{"$f":"OFFSET(INDEX(Composições!A:J,MATCH(B371,Composições!B:B,0),10),2,0)","v":56.21},843.15,{"$f":"BDI!$B$17","v":0.2034},67.64,1014.6,null,56.22,-9.9999999999980105E-3,-1.7787264318744239E-4,843.3,-0.14999999999997726,67.66,-1.9999999999996021E-2,1014.9,-0.29999999999995453]
["SF-00920","Reaterro de vala com compactação mecanizada","m3",15,{"$f":"OFFSET(INDEX(Composições!A:J,MATCH(B372,Composições!B:B,0),10),2,0)","v":19.639999999999997},294.60000000000002,{"$f":"BDI!$B$17","v":0.2034},23.63,354.45,null,19.63,9.9999999999980105E-3,5.0942435048385176E-4,294.45,0.15000000000003411,23.62,9.9999999999980105E-3,354.3,0.14999999999997726]
["SF-00921","Aterro de vala com compactação mecanizada","m3",15,{"$f":"OFFSET(INDEX(Composições!A:J,MATCH(B373,Composições!B:B,0),10),2,0)","v":65.710000000000008},985.65,{"$f":"BDI!$B$17","v":0.2034},79.08,1186.2,null,29.46,36.250000000000007,1.2304820095044129,441.9,543.75,35.450000000000003,43.629999999999995,531.75,654.45000000000005]
["SF-00922","Tubo de cobre classe \"E\" 22mm","m",10,{"$f":"OFFSET(INDEX(Composições!A:J,MATCH(B374,Composições!B:B,0),10),2,0)","v":32.919999999999995},329.2,{"$f":"BDI!$B$17","v":0.2034},39.619999999999997,396.2,null,32.9,1.9999999999996021E-2,6.0790273556218907E-4,329,0.19999999999998863,39.590000000000003,2.9999999999994031E-2,395.9,0.30000000000001137]
["SF-00923","Tubo de cobre classe \"E\" 28 mm","m",10,{"$f":"OFFSET(INDEX(Composições!A:J,MATCH(B375,Composições!B:B,0),10),2,0)","v":41.01},410.1,{"$f":"BDI!$B$17","v":0.2034},49.35,493.5,null,41.01,"","",410.1,"",49.35,"",493.5,""]
["SF-00924","Tubo de cobre classe \"E\" 42mm","m",10,{"$f":"OFFSET(INDEX(Composições!A:J,MATCH(B376,Composições!B:B,0),10),2,0)","v":72.39},723.9,{"$f":"BDI!$B$17","v":0.2034},87.11,{"$f":"ROUND(H376*D376,2)","v":871.1},null,72.400000000000006,-1.0000000000005116E-2,-1.3812154696139661E-4,724,-0.10000000000002274,87.13,-1.9999999999996021E-2,871.3,-0.19999999999993179]
["SF-00925","Bacia convencional - Linha Acessibilidade","un",5,{"$f":"OFFSET(INDEX(Composições!A:J,MATCH(B377,Composições!B:B,0),10),2,0)","v":599.53},2997.65,{"$f":"BDI!$B$17","v":0.2034},721.47,3607.35,null,599.55999999999995,-2.9999999999972715E-2,-5.0036693575243042E-5,2997.8,-0.15000000000009095,721.51,-3.999999999996362E-2,3607.55,-0.20000000000027285]
["SF-00926","Assento para bacia convencional - Linha Acessibilidade","un",5,{"$f":"OFFSET(INDEX(Composições!A:J,MATCH(B378,Composições!B:B,0),10),2,0)","v":731.42},3657.1,{"$f":"BDI!$B$17","v":0.2034},880.19,4400.95,null,731.42,"","",3657.1,"",880.19,"",4400.95,""]
["SF-00927","Base registro de gaveta 1 1/2”","un",10,{"$f":"OFFSET(INDEX(Composições!A:J,MATCH(B379,Composições!B:B,0),10),2,0)","v":93.699999999999989},937,{"$f":"BDI!$B$17","v":0.2034},112.76,1127.5999999999999,null,93.7,"","",937,"",112.76,"",1127.5999999999999,""]
["SF-00937","Montagem e desmontagem de andaime fachadeiro","m2",350,{"$f":"OFFSET(INDEX(Composições!A:J,MATCH(B380,Composições!B:B,0),10),2,0)","v":7.42},{"$f":"IF(ISNUMBER(E380),ROUND(D380*E380,2),\"-\")","v":2597},{"$f":"BDI!$B$17","v":0.2034},{"$f":"IF(ISNUMBER(E380),ROUND(E380*(1+G380),2),0)","v":8.93},3125.5,null,7.4,1.9999999999999574E-2,2.7027027027026452E-3,2590,7,8.91,1.9999999999999574E-2,3118.5,7]
["SF-00938","Montagem e desmontagem de andaime tubular","m",70,{"$f":"OFFSET(INDEX(Composições!A:J,MATCH(B381,Composições!B:B,0),10),2,0)","v":14.149999999999999},{"$f":"IF(ISNUMBER(E381),ROUND(D381*E381,2),\"-\")","v":990.5},{"$f":"BDI!$B$17","v":0.2034},{"$f":"IF(ISNUMBER(E381),ROUND(E381*(1+G381),2),0)","v":17.03},1192.0999999999999,null,14.1,4.9999999999998934E-2,3.5460992907800663E-3,987,3.5,16.97,6.0000000000002274E-2,1187.9000000000001,4.1999999999998181]
["SF-00939","Tensor com indicador de tensão para linha de vida","un",5,970,{"$f":"IF(ISNUMBER(E382),ROUND(D382*E382,2),\"-\")","v":4850},{"$f":"BDI!$B$17","v":0.2034},{"$f":"IF(ISNUMBER(E382),ROUND(E382*(1+G382),2),0)","v":1167.3},5836.5,null,970,"","",4850,"",1167.3,"",5836.5,""]
["SF-00940","Locação de fechamento para andaimes com tela 100% polietileno","m2 x mês",350,{"$f":"OFFSET(INDEX(Composições!A:J,MATCH(B383,Composições!B:B,0),10),2,0)","v":3.1099999999999994},{"$f":"IF(ISNUMBER(E383),ROUND(D383*E383,2),\"-\")","v":1088.5},{"$f":"BDI!$B$17","v":0.2034},{"$f":"IF(ISNUMBER(E383),ROUND(E383*(1+G383),2),0)","v":3.74},1309,null,3.1,9.9999999999993427E-3,3.2258064516126912E-3,1085,3.5,3.73,1.0000000000000231E-2,1305.5,3.5]
[null,"GRUPO 2 - SERVIÇOS DE MARCENARIA",null,null,null,{"$f":"SUBTOTAL(109,F385:F390)","v":421613.5},null,null,{"$f":"SUBTOTAL(109,I385:I390)","v":469719.54}]
["SF-00352","Armário em MDF laminado com porta e prateleiras","m2",500,671.88,{"$f":"IF(ISNUMBER(E385),ROUND(D385*E385,2),\"-\")","v":335940},{"$f":"BDI!$G$17","v":0.11},{"$f":"IF(ISNUMBER(E385),ROUND(E385*(1+G385),2),0)","v":745.79},{"$f":"ROUND(H385*D385,2)","v":372895},null,671.88,{"$f":"IF(E385=K385,\"\",E385-K385)","v":""},"",335940,{"$f":"IF(F385=N385,\"\",F385-N385)","v":""},745.79,{"$f":"IF(H385=P385,\"\",H385-P385)","v":""},372895,{"$f":"IF(I385=R385,\"\",I385-R385)","v":""}]
["SF-00353","Armários em MDF laminado com porta e gavetas","m2",100,671.88,67188,{"$f":"BDI!$G$17","v":0.11},745.79,74579,null,671.88,"","",67188,"",745.79,"",74579,""]
["SF-00355","Mesa/tampo de MDF, fixada em parede com mão-francesa","m2",20,{"$f":"OFFSET(INDEX(Composições!A:J,MATCH(B387,Composições!B:B,0),10),2,0)","v":169.23},3384.6,{"$f":"BDI!$B$17","v":0.2034},203.65,4073,null,169.23,"","",3384.6,"",203.65,"",4073,""]
["SF-00356","Painel para TV de 120 x 180 cm","un",16,{"$f":"OFFSET(INDEX(Composições!A:J,MATCH(B388,Composições!B:B,0),10),2,0)","v":234.7},3755.2,{"$f":"BDI!$B$17","v":0.2034},282.44,4519.04,null,234.7,"","",3755.2,"",282.44,"",4519.04,""]
["SF-00357","Painel para TV de 160 x 160 cm","un",20,{"$f":"OFFSET(INDEX(Composições!A:J,MATCH(B389,Composições!B:B,0),10),2,0)","v":501.81},10036.200000000001,{"$f":"BDI!$B$17","v":0.2034},603.88,12077.6,null,501.81,"","",10036.200000000001,"",603.88,"",12077.6,""]
["SF-00358","Painel para TV de 90 x 120 cm","un",10,{"$f":"OFFSET(INDEX(Composições!A:J,MATCH(B390,Composições!B:B,0),10),2,0)","v":130.94999999999999},1309.5,{"$f":"BDI!$B$17","v":0.2034},157.59,1575.9,null,130.94999999999999,"","",1309.5,"",157.59,"",1575.9,""]
[null,"GRUPO 3 - VIDROS COMUNS",null,null,null,{"$f":"SUBTOTAL(109,F392:F397)","v":45782.85},null,null,{"$f":"SUBTOTAL(109,I392:I397)","v":55096.25}]
["SF-00152","Baguetes metálicos","m",400,{"$f":"OFFSET(INDEX(Composições!A:J,MATCH(B392,Composições!B:B,0),10),2,0)","v":8.11},{"$f":"IF(ISNUMBER(E392),ROUND(D392*E392,2),\"-\")","v":3244},{"$f":"BDI!$B$17","v":0.2034},{"$f":"IF(ISNUMBER(E392),ROUND(E392*(1+G392),2),0)","v":9.76},{"$f":"ROUND(H392*D392,2)","v":3904},null,8.1,{"$f":"IF(E392=K392,\"\",E392-K392)","v":9.9999999999997868E-3},1.2345679012345416E-3,3240,{"$f":"IF(F392=N392,\"\",F392-N392)","v":4},9.75,{"$f":"IF(H392=P392,\"\",H392-P392)","v":9.9999999999997868E-3},3900,{"$f":"IF(I392=R392,\"\",I392-R392)","v":4}]
["SF-00153","Cordão de massa de vidraceiro","m",400,{"$f":"OFFSET(INDEX(Composições!A:J,MATCH(B393,Composições!B:B,0),10),2,0)","v":14.85},5940,{"$f":"BDI!$B$17","v":0.2034},17.87,7148,null,14.86,-9.9999999999997868E-3,{"$f":"IF(ISNUMBER(L393),L393/K393,\"\")","v":-6.7294751009419835E-4},5944,-4,17.88,-9.9999999999980105E-3,7152,-4]
["SF-00156","Substituição da calafetação com selante","m",400,{"$f":"OFFSET(INDEX(Composições!A:J,MATCH(B394,Composições!B:B,0),10),2,0)","v":15.809999999999999},6324,{"$f":"BDI!$B$17","v":0.2034},19.03,7612,null,15.82,-1.0000000000001563E-2,-6.3211125158037695E-4,6328,-4,19.04,-9.9999999999980105E-3,7616,-4]
["SF-00157","Vidro liso comum transparente 4mm","m2",75,{"$f":"OFFSET(INDEX(Composições!A:J,MATCH(B395,Composições!B:B,0),10),2,0)","v":81.87},6140.25,{"$f":"BDI!$B$17","v":0.2034},98.52,7389,null,81.88,-9.9999999999909051E-3,-1.2212994626271256E-4,6141,-0.75,98.53,-1.0000000000005116E-2,7389.75,-0.75]
["SF-00158","Vidro liso comum transparente 6mm","m2",60,{"$f":"OFFSET(INDEX(Composições!A:J,MATCH(B396,Composições!B:B,0),10),2,0)","v":115.26},6915.6,{"$f":"BDI!$B$17","v":0.2034},138.69999999999999,8322,null,115.26,"","",6915.6,"",138.69999999999999,"",8322,""]
["SF-00160","Mola hidráulica de piso","un",25,{"$f":"OFFSET(INDEX(Composições!A:J,MATCH(B397,Composições!B:B,0),10),2,0)","v":688.76},17219,{"$f":"BDI!$B$17","v":0.2034},828.85,20721.25,null,688.77,-9.9999999999909051E-3,-1.4518634667582654E-5,17219.25,-0.25,828.87,-1.999999999998181E-2,20721.75,-0.5]
[null,"GRUPO 4 - PERSIANA EM ALUMÍNIO",null,null,null,{"$f":"SUBTOTAL(109,F399)","v":139794},null,null,{"$f":"SUBTOTAL(109,I399)","v":155172}]
["SF-00162","Persiana vertical em alumínio 90 mm, cor verde claro","m2",600,232.99,{"$f":"IF(ISNUMBER(E399),ROUND(D399*E399,2),\"-\")","v":139794},{"$f":"BDI!$G$17","v":0.11},{"$f":"IF(ISNUMBER(E399),ROUND(E399*(1+G399),2),0)","v":258.62},{"$f":"ROUND(H399*D399,2)","v":155172},null,232.99,{"$f":"IF(E399=K399,\"\",E399-K399)","v":""},{"$f":"IF(ISNUMBER(L399),L399/K399,\"\")","v":""},139794,{"$f":"IF(F399=N399,\"\",F399-N399)","v":""},258.62,{"$f":"IF(H399=P399,\"\",H399-P399)","v":""},155172,{"$f":"IF(I399=R399,\"\",I399-R399)","v":""}]
[null,"GRUPO 5 - PERSIANA EM TECIDO JUTA",null,null,null,{"$f":"SUBTOTAL(109,F401)","v":29625},null,null,{"$f":"SUBTOTAL(109,I401)","v":32883}]
["SF-00163","Persiana vertical em tecido Juta Resinado sem blecaute de 90mm, cor bege","m2",300,98.75,{"$f":"IF(ISNUMBER(E401),ROUND(D401*E401,2),\"-\")","v":29625},{"$f":"BDI!$G$17","v":0.11},{"$f":"IF(ISNUMBER(E401),ROUND(E401*(1+G401),2),0)","v":109.61},{"$f":"ROUND(H401*D401,2)","v":32883},null,98.75,{"$f":"IF(E401=K401,\"\",E401-K401)","v":""},{"$f":"IF(ISNUMBER(L401),L401/K401,\"\")","v":""},29625,{"$f":"IF(F401=N401,\"\",F401-N401)","v":""},109.61,{"$f":"IF(H401=P401,\"\",H401-P401)","v":""},32883,{"$f":"IF(I401=R401,\"\",I401-R401)","v":""}]
[null,"GRUPO 6 - PERSIANA EM TECIDO SINTÉTICO",null,null,null,{"$f":"SUBTOTAL(109,F403)","v":30800},null,null,{"$f":"SUBTOTAL(109,I403)","v":34187.5}]
["SF-00164","Persiana vertical em tecido sintético sem blecaute de 90mm, cores verde escuro ou branca","m2",250,123.2,{"$f":"IF(ISNUMBER(E403),ROUND(D403*E403,2),\"-\")","v":30800},{"$f":"BDI!$G$17","v":0.11},{"$f":"IF(ISNUMBER(E403),ROUND(E403*(1+G403),2),0)","v":136.75},{"$f":"ROUND(H403*D403,2)","v":34187.5},null,123.2,{"$f":"IF(E403=K403,\"\",E403-K403)","v":""},{"$f":"IF(ISNUMBER(L403),L403/K403,\"\")","v":""},30800,{"$f":"IF(F403=N403,\"\",F403-N403)","v":""},136.75,{"$f":"IF(H403=P403,\"\",H403-P403)","v":""},34187.5,{"$f":"IF(I403=R403,\"\",I403-R403)","v":""}]
["CUSTO DIRETO",null,null,null,null,null,null,null,{"$f":"SUBTOTAL(109,F6:F403)","v":9878183.7099999897}]
["CUSTO TOTAL DA LICITAÇÃO",null,null,null,null,null,null,null,{"$f":"SUBTOTAL(109,I6:I403)","v":11509258.729999995},null,null,{"$f":"COUNT(L7:L403)","v":193}]

{"sheet":"Composições","index":1,"n_rows":2427,"n_cols":10,"rows_kept":2427,"cut":false,"hidden":false,"merged":[[2406,0,2411,0],[2406,1,2411,1],[2412,0,2417,0],[2412,1,2417,1],[2316,0,2321,0],[2316,1,2321,1],[2338,0,2342,0],[2338,1,2342,1],[2384,0,2393,0],[2384,1,2393,1],[2394,0,2398,0],[2394,1,2398,1],[2399,0,2405,0],[2399,1,2405,1],[2372,0,2377,0],[2372,1,2377,1],[2354,0,2365,0],[2354,1,2365,1],[2366,0,2371,0],[2366,1,2371,1],[2378,0,2383,0],[1194,0,1200,0],[1194,1,1200,1],[841,0,844,0],[841,1,844,1],[2105,1,2112,1],[2073,0,2080,0],[2073,1,2080,1],[0,2,0,9],[1,2,1,9],[2,2,2,9],[727,1,740,1],[651,0,658,0],[741,0,750,0],[741,1,750,1],[691,0,697,0],[691,1,697,1],[698,1,708,1],[727,0,740,0],[760,0,764,0],[575,1,581,1],[582,0,587,0],[582,1,587,1],[575,0,581,0],[1046,0,1053,0],[2263,0,2267,0],[2263,1,2267,1],[2289,1,2294,1],[2274,0,2281,0],[2274,1,2281,1],[2282,0,2288,0],[2295,0,2301,0],[2295,1,2301,1],[2191,0,2198,0],[2247,0,2252,0],[2247,1,2252,1],[2378,1,2383,1],[2308,0,2315,0],[2308,1,2315,1],[2322,0,2329,0],[2322,1,2329,1],[2330,0,2337,0],[2330,1,2337,1],[2343,0,2346,0],[2343,1,2346,1],[2347,0,2353,0],[2347,1,2353,1],[1979,1,1986,1],[2059,0,2064,0],[2047,0,2052,0],[2047,1,2052,1],[2041,0,2046,0],[2081,0,2088,0],[2097,1,2104,1],[2003,0,2010,0],[2035,0,2040,0],[2035,1,2040,1],[1046,1,1053,1],[0,0,2,0],[760,1,764,1],[765,0,769,0],[765,1,769,1],[651,1,658,1],[643,0,650,0],[643,1,650,1],[635,0,642,0],[635,1,642,1],[755,0,759,0],[755,1,759,1],[709,0,715,0],[679,1,686,1],[698,0,708,0],[596,1,603,1],[536,0,543,0],[604,1,610,1],[611,0,614,0],[611,1,614,1],[615,0,618,0],[615,1,618,1],[588,0,595,0],[588,1,595,1],[619,0,626,0],[619,1,626,1],[596,0,603,0],[449,1,459,1],[460,0,465,0],[424,0,431,0],[424,1,431,1],[466,0,471,0],[466,1,471,1],[492,1,498,1],[520,0,527,0],[520,1,527,1],[492,0,498,0],[552,0,558,0],[552,1,558,1],[528,0,535,0],[528,1,535,1],[544,1,551,1],[506,0,511,0],[506,1,511,1],[499,0,505,0],[499,1,505,1],[567,0,574,0],[2153,0,2158,0],[2153,1,2158,1],[2147,0,2152,0],[2147,1,2152,1],[2134,1,2140,1],[2169,0,2174,0],[2169,1,2174,1],[2241,0,2246,0],[2241,1,2246,1],[2207,0,2214,0],[2207,1,2214,1],[2235,0,2240,0],[2235,1,2240,1],[2215,0,2223,0],[2215,1,2223,1],[2229,0,2234,0],[2229,1,2234,1],[2199,0,2206,0],[2199,1,2206,1],[2134,0,2140,0],[2159,0,2168,0],[2159,1,2168,1],[627,0,634,0],[627,1,634,1],[2141,0,2146,0],[2065,0,2072,0],[2065,1,2072,1],[1963,0,1970,0],[1963,1,1970,1],[1955,0,1962,0],[1955,1,1962,1],[1987,0,1994,0],[1987,1,1994,1],[1971,0,1978,0],[1971,1,1978,1],[1995,0,2002,0],[2089,0,2096,0],[2089,1,2096,1],[2097,0,2104,0],[2053,1,2058,1],[2027,0,2034,0],[2027,1,2034,1],[2019,0,2026,0],[2019,1,2026,1],[2011,0,2018,0],[2011,1,2018,1],[177,0,183,0],[177,1,183,1],[777,0,782,0],[777,1,782,1],[659,0,665,0],[659,1,665,1],[673,0,678,0],[673,1,678,1],[666,0,672,0],[666,1,672,1],[687,0,690,0],[687,1,690,1],[679,0,686,0],[770,0,776,0],[770,1,776,1],[751,0,754,0],[751,1,754,1],[301,0,304,0],[301,1,304,1],[512,0,519,0],[536,1,543,1],[544,0,551,0],[512,1,519,1],[567,1,574,1],[2129,0,2133,0],[2129,1,2133,1],[2059,1,2064,1],[2053,0,2058,0],[1883,0,1889,0],[1883,1,1889,1],[1941,0,1946,0],[1941,1,1946,1],[1934,0,1940,0],[1934,1,1940,1],[1927,0,1933,0],[1927,1,1933,1],[1920,0,1926,0],[1920,1,1926,1],[1913,0,1919,0],[1913,1,1919,1],[1947,0,1954,0],[1947,1,1954,1],[2041,1,2046,1],[2003,1,2010,1],[2081,1,2088,1],[2105,0,2112,0],[1995,1,2002,1],[1979,0,1986,0],[1838,0,1843,0],[1838,1,1843,1],[1844,0,1849,0],[1844,1,1849,1],[1850,0,1854,0],[1850,1,1854,1],[1860,0,1864,0],[1860,1,1864,1],[1855,0,1859,0],[1855,1,1859,1],[1865,0,1870,0],[1865,1,1870,1],[1871,0,1876,0],[1871,1,1876,1],[1877,0,1882,0],[1877,1,1882,1],[1905,0,1912,0],[1905,1,1912,1],[1897,0,1904,0],[1897,1,1904,1],[1890,0,1896,0],[1890,1,1896,1],[1832,0,1837,0],[1832,1,1837,1],[1808,0,1813,0],[1808,1,1813,1],[1826,0,1831,0],[1826,1,1831,1],[1802,0,1807,0],[1802,1,1807,1],[1814,0,1819,0],[1814,1,1819,1],[1820,0,1825,0],[1820,1,1825,1],[1778,0,1783,0],[1778,1,1783,1],[1784,0,1789,0],[1784,1,1789,1],[1771,0,1777,0],[1771,1,1777,1],[1790,0,1795,0],[1790,1,1795,1],[1796,0,1801,0],[1796,1,1801,1],[1616,0,1621,0],[1616,1,1621,1],[1754,0,1758,0],[1754,1,1758,1],[1749,0,1753,0],[1749,1,1753,1],[1759,0,1764,0],[1759,1,1764,1],[1765,0,1770,0],[1765,1,1770,1],[1650,0,1660,0],[1650,1,1660,1],[1661,0,1671,0],[1661,1,1671,1],[1636,0,1641,0],[1636,1,1641,1],[1642,0,1649,0],[1642,1,1649,1],[1622,0,1628,0],[1622,1,1628,1],[1629,0,1635,0],[1629,1,1635,1],[1743,0,1748,0],[1743,1,1748,1],[1447,0,1454,0],[1447,1,1454,1],[1708,0,1714,0],[1708,1,1714,1],[1722,0,1728,0],[1722,1,1728,1],[1736,0,1742,0],[1736,1,1742,1],[1694,0,1700,0],[1694,1,1700,1],[1701,0,1707,0],[1701,1,1707,1],[1715,0,1721,0],[1715,1,1721,1],[1601,0,1605,0],[1601,1,1605,1],[1606,0,1610,0],[1606,1,1610,1],[1595,0,1600,0],[1595,1,1600,1],[1672,0,1682,0],[1672,1,1682,1],[1683,0,1693,0],[1683,1,1693,1],[1432,0,1446,0],[1432,1,1446,1],[1530,0,1535,0],[1530,1,1535,1],[1611,0,1615,0],[1611,1,1615,1],[1387,0,1401,0],[1387,1,1401,1],[1417,0,1431,0],[1417,1,1431,1],[1515,0,1529,0],[1515,1,1529,1],[1494,0,1500,0],[1494,1,1500,1],[1487,0,1493,0],[1487,1,1493,1],[1479,0,1486,0],[1479,1,1486,1],[1463,0,1470,0],[1463,1,1470,1],[1589,0,1594,0],[1589,1,1594,1],[1566,0,1571,0],[1566,1,1571,1],[1536,0,1541,0],[1536,1,1541,1],[1542,0,1547,0],[1542,1,1547,1],[1583,0,1588,0],[1583,1,1588,1],[1455,0,1462,0],[1455,1,1462,1],[1548,0,1554,0],[1548,1,1554,1],[1555,0,1559,0],[1555,1,1559,1],[1572,0,1576,0],[1572,1,1576,1],[1577,0,1582,0],[1577,1,1582,1],[1471,0,1478,0],[1471,1,1478,1],[1508,0,1514,0],[1508,1,1514,1],[1501,0,1507,0],[1501,1,1507,1],[1560,0,1565,0],[1560,1,1565,1],[1402,0,1416,0],[1402,1,1416,1],[1299,0,1304,0],[1299,1,1304,1],[1335,0,1341,0],[1335,1,1341,1],[1323,0,1328,0],[1323,1,1328,1],[1305,0,1310,0],[1305,1,1310,1],[1311,0,1316,0],[1311,1,1316,1],[1317,0,1322,0],[1317,1,1322,1],[1329,0,1334,0],[1329,1,1334,1],[1342,0,1356,0],[1342,1,1356,1],[1372,0,1386,0],[1372,1,1386,1],[1357,0,1371,0],[1357,1,1371,1],[1279,0,1285,0],[1279,1,1285,1],[1292,0,1298,0],[1292,1,1298,1],[1286,0,1291,0],[1286,1,1291,1],[1082,0,1088,0],[1082,1,1088,1],[1103,0,1109,0],[1103,1,1109,1],[1110,0,1116,0],[1110,1,1116,1],[1145,0,1151,0],[1145,1,1151,1],[1269,0,1273,0],[1269,1,1273,1],[1264,0,1268,0],[1264,1,1268,1],[1259,0,1263,0],[1259,1,1263,1],[1221,0,1227,0],[1221,1,1227,1],[1228,0,1234,0],[1228,1,1234,1],[1235,0,1241,0],[1235,1,1241,1],[1274,0,1278,0],[1274,1,1278,1],[1070,0,1074,0],[1070,1,1074,1],[1208,0,1213,0],[1208,1,1213,1],[1242,0,1249,0],[1242,1,1249,1],[1250,0,1258,0],[1250,1,1258,1],[1214,0,1220,0],[1214,1,1220,1],[1166,0,1172,0],[1166,1,1172,1],[1159,0,1165,0],[1159,1,1165,1],[1075,0,1081,0],[1075,1,1081,1],[1096,0,1102,0],[1096,1,1102,1],[1201,0,1207,0],[1201,1,1207,1],[1187,0,1193,0],[1187,1,1193,1],[1089,0,1095,0],[1089,1,1095,1],[1124,0,1130,0],[1124,1,1130,1],[1131,0,1137,0],[1131,1,1137,1],[1138,0,1144,0],[1138,1,1144,1],[1180,0,1186,0],[1180,1,1186,1],[1173,0,1179,0],[1173,1,1179,1],[1117,0,1123,0],[1117,1,1123,1],[1152,0,1158,0],[1152,1,1158,1],[983,1,989,1],[997,0,1003,0],[997,1,1003,1],[1028,0,1035,0],[1028,1,1035,1],[990,0,996,0],[990,1,996,1],[1004,0,1010,0],[1004,1,1010,1],[1020,0,1027,0],[1020,1,1027,1],[1011,0,1019,0],[1011,1,1019,1],[885,1,890,1],[911,0,917,0],[911,1,917,1],[918,0,928,0],[918,1,928,1],[929,0,939,0],[929,1,939,1],[1064,0,1069,0],[1064,1,1069,1],[950,0,958,0],[950,1,958,1],[940,0,944,0],[940,1,944,1],[945,0,949,0],[945,1,949,1],[1059,0,1063,0],[1059,1,1063,1],[1054,0,1058,0],[1054,1,1058,1],[959,0,963,0],[959,1,963,1],[1036,0,1045,0],[1036,1,1045,1],[983,0,989,0],[400,0,411,0],[400,1,411,1],[834,1,840,1],[783,0,787,0],[783,1,787,1],[788,0,793,0],[788,1,793,1],[807,0,814,0],[807,1,814,1],[834,0,840,0],[815,0,821,0],[815,1,821,1],[822,0,828,0],[822,1,828,1],[801,0,806,0],[801,1,806,1],[829,0,833,0],[829,1,833,1],[794,0,800,0],[794,1,800,1],[709,1,715,1],[559,0,566,0],[559,1,566,1],[604,0,610,0],[213,0,217,0],[256,1,263,1],[479,0,485,0],[479,1,485,1],[372,0,378,0],[372,1,378,1],[486,0,491,0],[486,1,491,1],[460,1,465,1],[418,0,423,0],[418,1,423,1],[412,0,417,0],[412,1,417,1],[432,0,441,0],[432,1,441,1],[379,0,392,0],[379,1,392,1],[393,0,399,0],[393,1,399,1],[472,0,478,0],[472,1,478,1],[442,0,448,0],[442,1,448,1],[449,0,459,0],[343,0,348,0],[343,1,348,1],[349,0,357,0],[349,1,357,1],[305,0,319,0],[305,1,319,1],[264,0,270,0],[264,1,270,1],[271,0,277,0],[271,1,277,1],[330,0,342,0],[278,0,289,0],[5,0,8,0],[5,1,8,1],[58,0,62,0],[58,1,62,1],[41,1,45,1],[159,0,163,0],[159,1,163,1],[86,0,90,0],[86,1,90,1],[9,0,12,0],[9,1,12,1],[76,0,80,0],[76,1,80,1],[51,0,57,0],[51,1,57,1],[32,0,35,0],[32,1,35,1],[27,0,31,0],[27,1,31,1],[96,0,100,0],[96,1,100,1],[36,1,40,1],[105,1,109,1],[152,1,158,1],[358,0,371,0],[213,1,217,1],[278,1,289,1],[13,0,16,0],[13,1,16,1],[230,0,238,0],[230,1,238,1],[199,0,203,0],[199,1,203,1],[101,0,104,0],[101,1,104,1],[17,1,21,1],[17,0,21,0],[218,0,221,0],[218,1,221,1],[142,1,146,1],[164,0,168,0],[164,1,168,1],[81,0,85,0],[81,1,85,1],[115,0,118,0],[115,1,118,1],[22,1,26,1],[22,0,26,0],[36,0,40,0],[173,1,176,1],[173,0,176,0],[124,0,128,0],[124,1,128,1],[204,0,207,0],[204,1,207,1],[110,0,114,0],[110,1,114,1],[119,0,123,0],[119,1,123,1],[195,0,198,0],[195,1,198,1],[184,1,190,1],[152,0,158,0],[147,0,151,0],[147,1,151,1],[169,0,172,0],[169,1,172,1],[142,0,146,0],[105,0,109,0],[41,0,45,0],[46,1,50,1],[184,0,190,0],[964,1,973,1],[974,0,982,0],[897,1,903,1],[891,0,896,0],[891,1,896,1],[885,0,890,0],[63,0,67,0],[63,1,67,1],[46,0,50,0],[974,1,982,1],[904,0,910,0],[904,1,910,1],[897,0,903,0],[208,0,212,0],[208,1,212,1],[239,0,249,0],[239,1,249,1],[222,0,225,0],[222,1,225,1],[226,0,229,0],[226,1,229,1],[250,0,255,0],[250,1,255,1],[964,0,973,0],[1729,0,1735,0],[1729,1,1735,1],[191,0,194,0],[191,1,194,1],[68,0,75,0],[68,1,75,1],[133,0,136,0],[133,1,136,1],[137,0,141,0],[137,1,141,1],[91,0,95,0],[91,1,95,1],[129,0,132,0],[129,1,132,1],[716,0,726,0],[716,1,726,1],[358,1,371,1],[330,1,342,1],[290,0,300,0],[290,1,300,1],[320,0,329,0],[320,1,329,1],[256,0,263,0],[845,0,850,0],[845,1,850,1],[851,0,859,0],[851,1,859,1],[876,0,884,0],[876,1,884,1],[867,0,875,0],[867,1,875,1],[860,0,866,0],[860,1,866,1],[2418,0,2426,0],[2418,1,2426,1],[2302,0,2307,0],[2302,1,2307,1],[2289,0,2294,0],[2113,0,2120,0],[2113,1,2120,1],[2121,0,2128,0],[2121,1,2128,1],[2282,1,2288,1],[2268,0,2273,0],[2268,1,2273,1],[2253,0,2257,0],[2253,1,2257,1],[2191,1,2198,1],[2141,1,2146,1],[2258,0,2262,0],[2258,1,2262,1],[2183,0,2190,0],[2183,1,2190,1],[2224,0,2228,0],[2224,1,2228,1],[2175,0,2182,0],[2175,1,2182,1]]}
[null,"SENADO FEDERAL",{"$f":"Orçamentária!A1","v":"Ata de Registro de Preços para Reformas no SF - 2019/2020"}]
[null,"SECRETARIA DE INFRAESTRUTURA","COMPOSIÇÕES"]
[null,"SERVIÇO DE ORÇAMENTOS",{"$f":"Orçamentária!A4","v":"Data: Julho de 2019 (data-base: Sinapi jun/2019, Pini jun/2019)"}]
[]
["Item","Discriminação","Especificação do Serviço","Unidade","Coeficiente","Fonte do Coeficiente","Preço unitário","Fonte do Preço","Preço","TOTAL"]
["SF-00001","Engenheiro(a) /Arquiteto(a) júnior",null,"hh",null,"Sinapi 90777","",null,{"$f":"IF(ISNUMBER(G6),ROUND(E6*G6,2),\"\")","v":""}]
[null,null,null,null,null,null,"",null,""]
[null,null,"Engenheiro civil de obra junior com encargos complementares","h",1,"Sinapi 90777",76.03,"Sinapi 90777",76.03,{"$f":"SUM(I8:I8)","v":76.03}]
[null,null,null,null,null,null,"",null,""]
["SF-00002","Mestre de obras",null,"hh",null,"Sinapi 90780","",null,""]
[null,null,null,null,null,null,"",null,""]
[null,null,"Mestre de obras com encargos complementares","h",1,"Sinapi 90780",23.08,"Sinapi 90780",23.08,{"$f":"SUM(I12:I12)","v":23.08}]
[null,null,null,null,null,null,"",null,""]
["SF-00003","Planejamento físico-financeiro",null,"un",null,"Senado Federal","",null,""]
[null,null,null,null,null,null,"",null,""]
[null,null,"Engenheiro Civil de Obra Pleno com encargos complementares","h",16,"Senado Federal",86.4,"Sinapi 90778",1382.4,{"$f":"SUM(I16:I16)","v":1382.4}]
[null,null,null,null,null,null,"",null,""]
["SF-00004","Projetos de segurança do trabalho",null,"un",null,"Senado Federal","",null,""]
[null,null,null,null,null,null,"",null,""]
[null,null,"Engenheiro Civil de Obra Pleno com encargos complementares","h",20,"Senado Federal",86.4,"Sinapi 90778",1728,{"$f":"SUM(I20:I21)","v":1954.5}]
[null,null,"Anotação de Responsabilidade Técnica","un",1,"Senado Federal",226.5,"Pesquisa de Preços",226.5]
[null,null,null,null,null,null,"",null,""]
["SF-00005","Demolição de alvenarias",null,"m3",null,"Sinapi 97622","",null,""]
[null,null,null,null,null,null,"",null,""]
[null,null,"Pedreiro com Encargos Complementares","h",0.22500000000000001,"Sinapi 97622",19.32,"Sinapi 88309",4.3499999999999996,{"$f":"SUM(I25:I26)","v":37.39}]
[null,null,"Servente com Encargos Complementares","h",2.3248000000000002,"Sinapi 97622",14.21,"Sinapi 88316",33.04]
[null,null,null,null,null,null,"",null,""]
["SF-00006","Demolição de concreto simples",null,"m3",null,"Pini 02.102.000007.SER Adaptada","",null,""]
[null,null,null,null,null,null,"",null,""]
[null,null,"Pedreiro com Encargos Complementares","h",1.3,"Pini 02.102.000007.SER",19.32,"Sinapi 88309",25.12,{"$f":"SUM(I30:I31)","v":209.85}]
[null,null,"Servente com Encargos Complementares","h",13,"Pini 02.102.000007.SER",14.21,"Sinapi 88316",184.73]
[null,null,null,null,null,null,"",null,""]
["SF-00007","Demolição de contrapiso",null,"m2",null,"SCO/RJ - SC 05.05.0800 Adaptada","",null,""]
[null,null,null,null,null,null,"",null,""]
[null,null,"Servente com Encargos Complementares","h",0.7,"SCO/RJ - SC 05.05.0800",14.21,"Sinapi 88316",9.9499999999999993,{"$f":"SUM(I35:I35)","v":9.9499999999999993}]
[null,null,null,null,null,null,"",null,""]
["SF-00008","Demolição de fechamento ou parede em gesso acartonado",null,"m2",null,"Sinapi 97638","",null,""]
[null,null,null,null,null,null,"",null,""]
[null,null,"Montador de estrutura metálica com encargos complementares","h",0.1186,"Sinapi 97638",14.73,"Sinapi 88278",1.75,{"$f":"SUM(I39:I40)","v":5.0600000000000005}]
[null,null,"Servente com Encargos Complementares","h",0.2329,"Sinapi 97638",14.21,"Sinapi 88316",3.31]
[null,null,null,null,null,null,"",null,""]
["SF-00009","Demolição de forro de gesso",null,"m2",null,"Sinapi 97640","",null,""]
[null,null,null,null,null,null,"",null,""]
[null,null,"Montador de estrutura metálica com encargos complementares","h",2.58E-2,"Sinapi 97640",14.73,"Sinapi 88278",0.38,{"$f":"SUM(I44:I45)","v":1.1000000000000001}]
[null,null,"Servente com Encargos Complementares","h",5.0700000000000002E-2,"Sinapi 97640",14.21,"Sinapi 88316",0.72]
[null,null,null,null,null,null,"",null,""]
["SF-00010","Demolição de infraestrutura elétrica (eletrodutos, eletrocalhas, cabos)",null,"m",null,"Sinapi 97661 Adaptada","",null,""]
[null,null,null,null,null,null,"",null,""]
[null,null,"Eletricista com encargos complementares","h",{"$f":"0.0096*5","v":4.7999999999999994E-2},"Sinapi 97661 Adaptada",19.55,"Sinapi 88264",0.94,{"$f":"SUM(I49:I50)","v":2.2800000000000002}]
[null,null,"Servente com Encargos Complementares","h",{"$f":"0.0188*5","v":9.4E-2},"Sinapi 97661 Adaptada",14.21,"Sinapi 88316",1.34]
[null,null,null,null,null,null,"",null,""]
["SF-00011","Demolição de revestimento cerâmico, granito, mármore ou granitina",null,"m2",null,"Sinapi 97634","",null,""]
[null,null,null,null,null,null,"",null,""]
[null,null,"Martelete ou rompedor pneumático manual, 28 kg, com silenciador - CHP diurno. AF_07/2016","chp",6.9900000000000004E-2,"Sinapi 97634",17.329999999999998,"Sinapi 5795",1.21,{"$f":"SUM(I54:I57)","v":8.25}]
[null,null,"Martelete ou rompedor pneumático manual, 28 kg, com silenciador - CHI diurno. AF_07/2016","chi",4.82E-2,"Sinapi 97634",16.329999999999998,"Sinapi 5952",0.79]
[null,null,"Azulejista ou ladrilhista com encargos complementares","h",0.1055,"Sinapi 97634",19.25,"Sinapi 88256",2.0299999999999998]
[null,null,"Servente com Encargos Complementares","h",0.29720000000000002,"Sinapi 97634",14.21,"Sinapi 88316",4.22]
[null,null,null,null,null,null,"",null,""]
["SF-00012","Demolição de revestimento em argamassa",null,"m2",null,"Sinapi 97631","",null,""]
[null,null,null,null,null,null,"",null,""]
[null,null,"Pedreiro com Encargos Complementares","h",3.7400000000000003E-2,"Sinapi 97631",19.32,"Sinapi 88309",0.72,{"$f":"SUM(I61:I62)","v":2.2199999999999998}]
[null,null,"Servente com Encargos Complementares","h",0.1053,"Sinapi 97631",14.21,"Sinapi 88316",1.5]
[null,null,null,null,null,null,"",null,""]
["SF-00013","Demolição de tubulação hidrossanitária embutida com conexões e acessórios",null,"m",null,"Sinapi 97662","",null,""]
[null,null,null,null,null,null,"",null,""]
[null,null,"Encanador ou Bombeiro Hidráulico com Encargos Complementares","h",7.1000000000000004E-3,"Sinapi 97662",18.95,"Sinapi 88267",0.13,{"$f":"SUM(I66:I67)","v":0.33}]
[null,null,"Servente com Encargos Complementares","h",1.4E-2,"Sinapi 97662",14.21,"Sinapi 88316",0.2]
[null,null,null,null,null,null,"",null,""]
["SF-00014","Demolição em concreto armado",null,"m3",null,"Sinapi 97627","",null,""]
[null,null,null,null,null,null,"",null,{"$f":"IF(ISNUMBER(G70),ROUND(E70*G70,2),\"\")","v":""}]
[null,null,"Martelete ou rompedor pneumático manual, 28 kg, com silenciador - CHP diurno. AF_07/2016","chp",3.2467999999999999,"Sinapi 97627",17.329999999999998,"Sinapi 5795",56.27,{"$f":"SUM(I71:I75)","v":179.72}]
[null,null,"Martelete ou rompedor pneumático manual, 28 kg, com silenciador - CHI diurno. AF_07/2016","chi",0.92020000000000002,"Sinapi 97627",16.329999999999998,"Sinapi 5952",15.03]
[null,null,"Cabo de aco galvanizado, diametro 9,53 mm (3/8\"), com alma de fibra 6 x 25 f  (coletado caixa)","kg",0.28349999999999997,"Sinapi 97627",9.31,"Sinapi 42655",2.64]
[null,null,"Pedreiro com Encargos Complementares","h",0.63660000000000005,"Sinapi 97627",19.32,"Sinapi 88309",12.3]
[null,null,"Servente com Encargos Complementares","h",6.5785,"Sinapi 97627",14.21,"Sinapi 88316",93.48]
[null,null,null,null,null,null,"",null,""]
["SF-00016","Remoção de armários",null,"m2",null,"SCO/RJ - SC 05.05.1750 Adaptada","",null,""]
[null,null,null,null,null,null,"",null,""]
[null,null,"Carpinteiro de esquadria com encargos complementares","h",0.35,"SCO/RJ - SC 05.05.1750",19.22,"Sinapi 88261",6.73,{"$f":"SUM(I79:I80)","v":11.7}]
[null,null,"Servente com Encargos Complementares","h",0.35,"SCO/RJ - SC 05.05.1750",14.21,"Sinapi 88316",4.97]
[null,null,null,null,null,null,"",null,""]
["SF-00017","Remoção de bancadas",null,"m2",null,"Orse 8387 Adaptada","",null,""]
[null,null,null,null,null,null,"",null,""]
[null,null,"Pedreiro com Encargos Complementares","h",0.15,"Orse 8387",19.32,"Sinapi 88309",2.9,{"$f":"SUM(I84:I85)","v":17.11}]
[null,null,"Servente com Encargos Complementares","h",1,"Orse 8387",14.21,"Sinapi 88316",14.21]
[null,null,null,null,null,null,"",null,""]
["SF-00018","Remoção de batentes de madeira",null,"un",null,"Pini 02.102.000032.SER Adaptada","",null,""]
[null,null,null,null,null,null,"",null,""]
[null,null,"Pedreiro com Encargos Complementares","h",{"$f":"0.08/2","v":0.04},"Pini 02.102.000032.SER Adaptada",19.32,"Sinapi 88309",0.77,{"$f":"SUM(I89:I90)","v":6.4499999999999993}]
[null,null,"Servente com Encargos Complementares","h",{"$f":"0.8/2","v":0.4},"Pini 02.102.000032.SER Adaptada",14.21,"Sinapi 88316",5.68]
[null,null,null,null,null,null,"",null,""]
["SF-00019","Remoção de canaleta em alumínio",null,"m",null,"Senado Federal","",null,""]
[null,null,null,null,null,null,"",null,""]
[null,null,"Eletricista com encargos complementares","h",{"$f":"0.75*0.1","v":7.5000000000000011E-2},"Senado Federal",19.55,"Sinapi 88264",1.47,{"$f":"SUM(I94:I95)","v":3.5999999999999996}]
[null,null,"Servente com Encargos Complementares","h",{"$f":"0.75*0.2","v":0.15000000000000002},"Senado Federal",14.21,"Sinapi 88316",2.13]
[null,null,null,null,null,null,"",null,""]
["SF-00020","Remoção de carpete",null,"m2",null,"Pini 02.102.000043.SER Adaptada","",null,""]
[null,null,null,null,null,null,"",null,""]
[null,null,"Pedreiro com Encargos Complementares","h",0.01,"Pini 02.102.000043.SER",19.32,"Sinapi 88309",0.19,{"$f":"SUM(I99:I100)","v":1.6099999999999999}]
[null,null,"Servente com Encargos Complementares","h",0.1,"Pini 02.102.000043.SER",14.21,"Sinapi 88316",1.42]
[null,null,null,null,null,null,"",null,""]
["SF-00021","Remoção de cortinas",null,"m",null,"Senado Federal","",null,""]
[null,null,null,null,null,null,"",null,""]
[null,null,"Ajudante especializado com encargos complementares","h",{"$f":"1/6","v":0.16666666666666666},"Senado Federal",16.899999999999999,"Sinapi 88243",2.82,{"$f":"SUM(I104:I104)","v":2.82}]
[null,null,null,null,null,null,"",null,""]
["SF-00022","Remoção de difusores, grelhas e acessórios de climatização",null,"un",null,"Orse 08857 Adaptada","",null,""]
[null,null,null,null,null,null,"",null,""]
[null,null,"Ajudante de operação em geral com encargos complementares","h",0.6,"Orse 08857",15.23,"Sinapi 88241",9.14,{"$f":"SUM(I108:I109)","v":17.670000000000002}]
[null,null,"Servente com Encargos Complementares","h",0.6,"Orse 08857",14.21,"Sinapi 88316",8.5299999999999994]
[null,null,null,null,null,null,"",null,""]
["SF-00023","Remoção de divisória de mármore ou granito",null,"m2",null,"Seinfra C1051 Adaptada","",null,""]
[null,null,null,null,null,null,"",null,""]
[null,null,"Marmorista/graniteiro com encargos complementares","h",0.6,"Seinfra C1051",16.09,"Sinapi 88274",9.65,{"$f":"SUM(I113:I114)","v":26.700000000000003}]
[null,null,"Servente com Encargos Complementares","h",1.2,"Seinfra C1051",14.21,"Sinapi 88316",17.05]
[null,null,null,null,null,null,"",null,""]
["SF-00024","Remoção de divisórias de MDF e gesso acartonado",null,"m2",null,"Sinapi 72178","",null,""]
[null,null,null,null,null,null,"",null,""]
[null,null,"Carpinteiro de esquadria com encargos complementares","h",1.2,"Sinapi 72178",19.22,"Sinapi 88261",23.06,{"$f":"SUM(I118:I118)","v":23.06}]
[null,null,null,null,null,null,"",null,""]
["SF-00025","Remoção de dutos/tubulações",null,"m",null,"Seinfra C3389 Adaptada","",null,""]
[null,null,null,null,null,null,"",null,""]
[null,null,"Encanador ou Bombeiro Hidráulico com Encargos Complementares","h",0.17499999999999999,"Seinfra C3389",18.95,"Sinapi 88267",3.32,{"$f":"SUM(I122:I123)","v":7.58}]
[null,null,"Servente com Encargos Complementares","h",0.3,"Seinfra C3389",14.21,"Sinapi 88316",4.26]
[null,null,null,null,null,null,"",null,""]
["SF-00026","Remoção de esquadrias metálicas",null,"m2",null,"Pini 02.102.000031.SER Adaptada","",null,""]
[null,null,null,null,null,null,"",null,""]
[null,null,"Pedreiro com Encargos Complementares","h",0.05,"Pini 02.102.000031.SER",19.32,"Sinapi 88309",0.97,{"$f":"SUM(I127:I128)","v":8.08}]
[null,null,"Servente com Encargos Complementares","h",0.5,"Pini 02.102.000031.SER",14.21,"Sinapi 88316",7.11]
[null,null,null,null,null,null,"",null,""]
["SF-00027","Remoção de exaustor",null,"un",null,"EMOP 17-60-92 Adaptada","",null,""]
[null,null,null,null,null,null,"",null,""]
[null,null,"Eletricista com encargos complementares","h",0.3,"EMOP 17-60-92",19.55,"Sinapi 88264",5.87,{"$f":"SUM(I132:I132)","v":5.87}]
[null,null,null,null,null,null,"",null,""]
["SF-00028","Remoção de fechadura/puxador de porta",null,"un",null,"Orse 04859 Adaptada","",null,{"$f":"IF(ISNUMBER(G134),ROUND(E134*G134,2),\"\")","v":""}]
[null,null,null,null,null,null,"",null,""]
[null,null,"Carpinteiro de esquadria com encargos complementares","h",{"$f":"0.25","v":0.25},"Orse 04859",19.22,"Sinapi 88261",4.8099999999999996,{"$f":"SUM(I136:I136)","v":4.8099999999999996}]
[null,null,null,null,null,null,"",null,""]
["SF-00029","Remoção de folha de porta e dobradiças",null,"un",null,"Sinapi 97644","",null,""]
[null,null,null,null,null,null,"",null,""]
[null,null,"Pedreiro com Encargos Complementares","h",0.13150000000000001,"Sinapi 97644",19.32,"Sinapi 88309",2.54,{"$f":"SUM(I140:I141)","v":6.21}]
[null,null,"Servente com Encargos Complementares","h",0.25819999999999999,"Sinapi 97644",14.21,"Sinapi 88316",3.67]
[null,null,null,null,null,null,"",null,""]
["SF-00030","Remoção de laminado melamínico (LDAP), em PVC ou vinílico",null,"m2",null,"Pini 02.102.000044.SER Adaptada","",null,""]
[null,null,null,null,null,null,"",null,""]
[null,null,"Pedreiro com Encargos Complementares","h",0.09,"Pini 02.102.000044.SER",19.32,"Sinapi 88309",1.74,{"$f":"SUM(I145:I146)","v":14.53}]
[null,null,"Servente com Encargos Complementares","h",0.9,"Pini 02.102.000044.SER",14.21,"Sinapi 88316",12.79]
[null,null,null,null,null,null,"",null,""]
["SF-00031","Remoção de louças",null,"un",null,"Sinapi 97663","",null,""]
[null,null,null,null,null,null,"",null,""]
[null,null,"Encanador ou Bombeiro Hidráulico com Encargos Complementares","h",0.17549999999999999,"Sinapi 97663",18.95,"Sinapi 88267",3.33,{"$f":"SUM(I150:I151)","v":8.23}]
[null,null,"Servente com Encargos Complementares","h",0.3448,"Sinapi 97663",14.21,"Sinapi 88316",4.9000000000000004]
[null,null,null,null,null,null,"",null,""]
["SF-00032","Remoção de luminária",null,"un",null,"Sinapi 97665 Adaptada","",null,""]
[null,null,null,null,null,null,"",null,""]
[null,null,"Eletricista com encargos complementares","h",{"$f":"0.0183*5","v":9.1499999999999998E-2},"Sinapi 97665 Adaptada",19.55,"Sinapi 88264",1.79,{"$f":"SUM(I155:I156)","v":4.34}]
[null,null,"Servente com Encargos Complementares","h",{"$f":"0.0359*5","v":0.17949999999999999},"Sinapi 97665 Adaptada",14.21,"Sinapi 88316",2.5499999999999998]
[null,null,null,null,null,null,"",null,""]
[null,null,"Obs.: Remoção com reaproveitamento",null,null,null,"",null,""]
[null,null,null,null,null,null,"",null,""]
["SF-00033","Remoção de metais e acessórios",null,"un",null,"Sinapi 97666","",null,""]
[null,null,null,null,null,null,"",null,""]
[null,null,"Encanador ou Bombeiro Hidráulico com Encargos Complementares","h",0.128,"Sinapi 97666",18.95,"Sinapi 88267",2.4300000000000002,{"$f":"SUM(I162:I163)","v":6}]
[null,null,"Servente com Encargos Complementares","h",0.25140000000000001,"Sinapi 97666",14.21,"Sinapi 88316",3.57]
[null,null,null,null,null,null,"",null,""]
["SF-00034","Remoção de painéis de vidro temperado",null,"m2",null,"Orse 4715 Adaptada","",null,""]
[null,null,null,null,null,null,"",null,""]
[null,null,"Servente com Encargos Complementares","h",0.35,"Orse 4715",14.21,"Sinapi 88316",4.97,{"$f":"SUM(I167:I168)","v":11.73}]
[null,null,"Pedreiro com Encargos Complementares","h",0.35,"Orse 4715",19.32,"Sinapi 88309",6.76]
[null,null,null,null,null,null,"",null,""]
["SF-00036","Remoção de persianas",null,"m",null,"Senado Federal","",null,""]
[null,null,null,null,null,null,"",null,""]
[null,null,"Ajudante especializado com encargos complementares","h",{"$f":"1/6","v":0.16666666666666666},"Senado Federal",16.899999999999999,"Sinapi 88243",2.82,{"$f":"SUM(I172:I172)","v":2.82}]
[null,null,null,null,null,null,"",null,""]
["SF-00037","Remoção de pintura ou textura",null,"m2",null,"ORSE 07725 Adaptada","",null,""]
[null,null,null,null,null,null,"",null,""]
[null,null,"Servente com Encargos Complementares","h",0.4,"ORSE 07725",14.21,"Sinapi 88316",5.68,{"$f":"SUM(I176:I176)","v":5.68}]
[null,null,null,null,null,null,"",null,""]
["SF-00038","Remoção de placas de forro",null,"m2",null,"Sinapi 97640 Adaptada","",null,""]
[null,null,null,null,null,null,"",null,""]
[null,null,"Montador de estrutura metálica com encargos complementares","h",{"$f":"0.0258*3","v":7.7399999999999997E-2},"Sinapi 97640 Adaptada",14.73,"Sinapi 88278",1.1399999999999999,{"$f":"SUM(I180:I181)","v":3.3}]
[null,null,"Servente com Encargos Complementares","h",{"$f":"0.0507*3","v":0.15210000000000001},"Sinapi 97640 Adaptada",14.21,"Sinapi 88316",2.16]
[null,null,null,null,null,null,"",null,""]
[null,null,"Obs.: remoção com reaproveitamento",null,null,null,"",null,""]
[null,null,null,null,null,null,"",null,""]
["SF-00039","Remoção de quadros de elétricos ou de telecomunicações",null,"un",null,"Senado Federal","",null,""]
[null,null,null,null,null,null,"",null,""]
[null,null,"Auxiliar de eletricista com encargos complementares","h",0.5,"Senado Federal",15.22,"Sinapi 88247",7.61,{"$f":"SUM(I187:I190)","v":50.92}]
[null,null,"Eletricista com encargos complementares","h",0.5,"Senado Federal",19.55,"Sinapi 88264",9.7799999999999994]
[null,null,"Pedreiro com Encargos Complementares","h",1,"Orse 07224",19.32,"Sinapi 88309",19.32]
[null,null,"Servente com Encargos Complementares","h",1,"Orse 07224",14.21,"Sinapi 88316",14.21]
[null,null,null,null,null,null,"",null,""]
["SF-00040","Remoção de revestimento acústico",null,"m2",null,"Senado Federal","",null,""]
[null,null,null,null,null,null,"",null,""]
[null,null,"Servente com Encargos Complementares","h",0.2,"Senado Federal",14.21,"Sinapi 88316",2.84,{"$f":"SUM(I194:I194)","v":2.84}]
[null,null,null,null,null,null,"",null,""]
["SF-00041","Remoção de rodapé/rodabanca de mármore ou granito",null,"m",null,"Orse 4858 Adaptada","",null,""]
[null,null,null,null,null,null,"",null,""]
[null,null,"Servente com Encargos Complementares","h",{"$f":"0.437*0.2","v":8.7400000000000005E-2},"Orse 4858",14.21,"Sinapi 88316",{"$f":"IF(ISNUMBER(G198),ROUND(E198*G198,2),\"\")","v":1.24},{"$f":"SUM(I198:I198)","v":1.24}]
[null,null,null,null,null,null,"",null,""]
["SF-00042","Remoção de rodapés de madeira",null,"m2",null,"Orse 10235 Adaptada","",null,""]
[null,null,null,null,null,null,"",null,""]
[null,null,"Carpinteiro de formas com encargos complementares","h",0.25,"Orse 10235",19.18,"Sinapi 88262",4.8,{"$f":"SUM(I202:I203)","v":5.16}]
[null,null,"Servente com Encargos Complementares","h",2.5000000000000001E-2,"Orse 10235",14.21,"Sinapi 88316",0.36]
[null,null,null,null,null,null,"",null,""]
["SF-00043","Remoção de soleira de mármore ou granito",null,"m",null,"Pini 02.102.000042.SER Adaptada","",null,""]
[null,null,null,null,null,null,"",null,""]
[null,null,"Servente com Encargos Complementares","h",0.55000000000000004,"Pini 02.102.000042.SER",14.21,"Sinapi 88316",7.82,{"$f":"SUM(I207:I207)","v":7.82}]
[null,null,null,null,null,null,"",null,""]
["SF-00044","Remoção de split/fancolete/ACJ (equipamento unitário)",null,"un",null,"Senado Federal","",null,""]
[null,null,null,null,null,null,"",null,""]
[null,null,"Montador eletromecãnico com encargos complementares","h",1,"Senado Federal",20.239999999999998,"Sinapi 88279",20.239999999999998,{"$f":"SUM(I211:I212)","v":35.47}]
[null,null,"Ajudante de operação em geral com encargos complementares","h",1,"Senado Federal",15.23,"Sinapi 88241",15.23]
[null,null,null,null,null,null,"",null,""]
["SF-00045","Remoção de vidro comum / espelho",null,"m2",null,"Sinapi 85421","",null,""]
[null,null,null,null,null,null,"",null,""]
[null,null,"Servente com Encargos Complementares","h",0.2,"Sinapi 85421",14.21,"Sinapi 88316",2.84,{"$f":"SUM(I216:I217)","v":11.81}]
[null,null,"Vidraceiro com encargos complementares","h",0.5,"Sinapi 85421",17.940000000000001,"Sinapi 88325",8.9700000000000006]
[null,null,null,null,null,null,"",null,""]
["SF-00046","Retirada de entulhos",null,"m3",null,"Orse 0026 Adaptada","",null,""]
[null,null,null,null,null,null,"",null,""]
[null,null,"Servente com Encargos Complementares","h",1,"Orse 0026",14.21,"Sinapi 88316",14.21,{"$f":"SUM(I221:I221)","v":14.21}]
[null,null,null,null,null,null,"",null,""]
["SF-00048","Andaime fachadeiro",null,"m2 x mês",null,{"$f":"F225","v":"Sinapi 20193"},"",null,""]
[null,null,null,null,null,null,"",null,""]
[null,null,"LOCACAO DE ANDAIME METALICO TIPO FACHADEIRO, LARGURA DE 1,20 M, ALTURA POR PECA DE 2,0 M, INCLUINDO SAPATAS E ITENS NECESSARIOS A INSTALACAO","m2 x mês",1,"Sinapi 20193",3.59,"Sinapi 20193",3.59,{"$f":"SUM(I225:I225)","v":3.59}]
[null,null,null,null,null,null,"",null,""]
["SF-00051","Corda de poliamida 12 mm tipo bombeiro, para trabalho em altura",null,"m",null,"Sinapi 38200 Adaptada","",null,""]
[null,null,null,null,null,null,"",null,""]
[null,null,"CORDA DE POLIAMIDA 12 MM TIPO BOMBEIRO, PARA TRABALHO EM ALTURA","100m",0.01,"Sinapi 38200",437.16,"Sinapi 38200",4.37,{"$f":"SUM(I229:I229)","v":4.37}]
[null,null,null,null,null,null,"",null,""]
["SF-00057","Isolamento de obra com tela plástica com malha de 5mm e estrutura de madeira pontaleteada",null,"m2",null,"Sinapi 85424","",null,""]
[null,null,null,null,null,null,"",null,""]
[null,null,"Ajudante de carpinteiro com encargos complementares","h",0.53,"Sinapi 85424",16.170000000000002,"Sinapi 88239",8.57,{"$f":"SUM(I233:I238)","v":19.639999999999997}]
[null,null,"Carpinteiro de formas com encargos complementares","h",0.44,"Sinapi 85424",19.18,"Sinapi 88262",8.44]
[null,null,"PONTALETE DE MADEIRA NAO APARELHADA *7,5 X 7,5* CM (3 X 3 \") PINUS, MISTA OU EQUIVALENTE DA REGIAO","m",0.06,"Sinapi 85424",3.29,"Sinapi 4491",0.2]
[null,null,"TABUA DE MADEIRA NAO APARELHADA *2,5 X 10 CM (1 X 4 \") PINUS, MISTA OU EQUIVALENTE DA REGIAO","m",0.2,"Sinapi 85424",1.8,"Sinapi 4509",0.36]
[null,null,"Prego de aco polido com cabeca 18 x 27 (2 1/2 x 10)","kg",0.01,"Sinapi 85424",8.9600000000000009,"Sinapi 5061",0.09]
[null,null,"Tela fachadeira em polietileno, rolo de 3 x 100 m (L x C), cor branca, sem logomarca - para protecao de obras","m2",1.1000000000000001,"Sinapi 85424",1.8,"Sinapi 7170",1.98]
[null,null,null,null,null,null,"",null,""]
["SF-00070","Tapume",null,"m2",null,"Sinapi 74220/1","",null,""]
[null,null,null,null,null,null,"",null,""]
[null,null,"Carpinteiro de formas com encargos complementares","h",0.8,"Sinapi 74220/1",19.18,"Sinapi 88262",15.34,{"$f":"SUM(I242:I249)","v":46.75}]
[null,null,"Pintor com encargos complementares","h",0.3,"Sinapi 74220/1",20.32,"Sinapi 88310",6.1]
[null,null,"Servente com Encargos Complementares","h",0.95,"Sinapi 74220/1",14.21,"Sinapi 88316",13.5]
[null,null,"Cal hidratada CH-I para argamassas","kg",0.6,"Sinapi 74220/1",0.62,"Sinapi 1106",0.37]
[null,null,"Chapa de madeira compensada resinada para forma de concreto, de *2,2 x 1,1* m, E = 6 mm","un",0.22727269999999999,"Sinapi 74220/1",20.16,"Sinapi 1351",4.58]
[null,null,"PONTALETE DE MADEIRA NAO APARELHADA *7,5 X 7,5* CM (3 X 3 \") PINUS, MISTA OU EQUIVALENTE DA REGIAO","m",1.58,"Sinapi 74220/1",3.29,"Sinapi 4491",5.2]
[null,null,"Prego de aco polido com cabeca 18 x 27 (2 1/2 x 10)","kg",0.15,"Sinapi 74220/1",8.9600000000000009,"Sinapi 5061",1.34]
[null,null,"Oleo de linhaca","l",2.1999999999999999E-2,"Sinapi 74220/1",14.66,"Sinapi 5333",0.32]
[null,null,null,null,null,null,"",null,""]
["SF-00073","Limpeza final de obra",null,"m2",null,"ORSE 02450 Adaptada","",null,""]
[null,null,null,null,null,null,"",null,""]
[null,null,"Servente com Encargos Complementares","h",0.1,"ORSE 02450",14.21,"Sinapi 88316",1.42,{"$f":"SUM(I253:I255)","v":2.13}]
[null,null,"Sabao em po","m",5.0000000000000001E-3,"ORSE 02450",5.41,"Sinapi 16",0.03]
[null,null,"Vassoura 40 cm com cabo","un",0.05,"ORSE 02450",13.61,"Sinapi 38400",0.68]
[null,null,null,null,null,null,"",null,""]
["SF-00074","Abertura/fechamento rasgo em alvenaria",null,"m",null,"Sinapi 90447 + Sinapi 90466","",null,""]
[null,null,null,null,null,null,"",null,""]
[null,null,"Auxiliar de eletricista com encargos complementares","h",3.4000000000000002E-2,"Sinapi 90447",15.22,"Sinapi 88247",0.52,{"$f":"SUM(I259:I263)","v":14.190000000000001}]
[null,null,"Eletricista com encargos complementares","h",0.216,"Sinapi 90447",19.55,"Sinapi 88264",4.22]
[null,null,"Auxiliar de encanador ou bombeiro hidráulico com encargos complementares","h",5.5E-2,"Sinapi 90466",14.78,"Sinapi 88248",0.81]
[null,null,"Encanador ou Bombeiro Hidráulico com Encargos Complementares","h",0.39100000000000001,"Sinapi 90466",18.95,"Sinapi 88267",{"$f":"IF(ISNUMBER(G262),ROUND(E262*G262,2),\"\")","v":7.41}]
[null,null,"Argamassa traço 1:3 (cimento e areia média), preparo manual. AF_08/2014","m3",3.0000000000000001E-3,"Sinapi 90466",409.51,"Sinapi 88629",1.23]
[null,null,null,null,null,null,"",null,""]
["SF-00075","Furo em concreto de até 75mm de diâmetro",null,"un",null,"Sinapi 90440","",null,""]
[null,null,null,null,null,null,"",null,""]
[null,null,"Martelete ou rompedor pneumático manual, 28 kg, com silenciador - CHP diurno. AF_07/2016","chp",0.58699999999999997,"Sinapi 90440",17.329999999999998,"Sinapi 5795",10.17,{"$f":"SUM(I267:I270)","v":71.14}]
[null,null,"Martelete ou rompedor pneumático manual, 28 kg, com silenciador - CHI diurno. AF_07/2016","chi",1.29,"Sinapi 90440",16.329999999999998,"Sinapi 5952",21.07]
[null,null,"Auxiliar de encanador ou bombeiro hidráulico com encargos complementares","h",0.29299999999999998,"Sinapi 90440",14.78,"Sinapi 88248",4.33]
[null,null,"Encanador ou Bombeiro Hidráulico com Encargos Complementares","h",1.877,"Sinapi 90440",18.95,"Sinapi 88267",35.57]
[null,null,null,null,null,null,"",null,""]
["SF-00076","Furo em concreto para diâmetros maiores que 75mm",null,"un",null,"Sinapi 90441","",null,""]
[null,null,null,null,null,null,"",null,""]
[null,null,"Martelete ou rompedor pneumático manual, 28 kg, com silenciador - CHP diurno. AF_07/2016","chp",0.75,"Sinapi 90441",17.329999999999998,"Sinapi 5795",13,{"$f":"SUM(I274:I277)","v":90.86}]
[null,null,"Martelete ou rompedor pneumático manual, 28 kg, com silenciador - CHI diurno. AF_07/2016","chi",1.647,"Sinapi 90441",16.329999999999998,"Sinapi 5952",26.9]
[null,null,"Auxiliar de encanador ou bombeiro hidráulico com encargos complementares","h",0.375,"Sinapi 90441",14.78,"Sinapi 88248",5.54]
[null,null,"Encanador ou Bombeiro Hidráulico com Encargos Complementares","h",2.3969999999999998,"Sinapi 90441",18.95,"Sinapi 88267",45.42]
[null,null,null,null,null,null,"",null,""]
["SF-00077","Concreto virado em betoneira, fck = 15 MPa",null,"m3",null,"Sinapi 92873 + Sinapi 94963","",null,""]
[null,null,null,null,null,null,"",null,""]
[null,null,"LANÇAMENTO COM USO DE BALDES, ADENSAMENTO E ACABAMENTO DE CONCRETO EM ESTRUTURAS. AF_12/2015","m3",1,"Sinapi 92873",150.87,"Sinapi 92873",150.87,{"$f":"SUM(I281:I288)","v":414.28000000000009}]
[null,null,"Areia media - posto jazida/fornecedor (retirado na jazida, sem transporte)","m3",0.80500000000000005,"Sinapi 94963",80.84,"Sinapi 370",65.08]
[null,null,"Cimento Portland composto CP II-32","kg",273.06,"Sinapi 94963",0.37,"Sinapi 1379",101.03]
[null,null,"Pedra britada n. 1 (9,5 a 19 mm) posto pedreira/fornecedor, sem frete","m3",0.57899999999999996,"Sinapi 94963",72.510000000000005,"Sinapi 4721",41.98]
[null,null,"Operador de betoneira estacionária/misturador com encargos complementares","h",1.47,"Sinapi 94963",14.41,"Sinapi 88377",21.18]
[null,null,"Servente com Encargos Complementares","h",2.33,"Sinapi 94963",14.21,"Sinapi 88316",33.11]
[null,null,"BETONEIRA CAPACIDADE NOMINAL DE 400 L, CAPACIDADE DE MISTURA 280 L, MOTOR ELÉTRICO TRIFÁSICO POTÊNCIA DE 2 CV, SEM CARREGADOR - CHP DIURNO. AF_10/2014","chp",0.76,"Sinapi 94963",1.1399999999999999,"Sinapi 88830",0.87]
[null,null,"BETONEIRA CAPACIDADE NOMINAL DE 400 L, CAPACIDADE DE MISTURA 280 L, MOTOR ELÉTRICO TRIFÁSICO POTÊNCIA DE 2 CV, SEM CARREGADOR - CHI DIURNO. AF_10/2014","chi",0.71,"Sinapi 94963",0.23,"Sinapi 88831",0.16]
[null,null,null,null,null,null,"",null,""]
[null,null,null,null,null,null,"",null,""]
["SF-00078","Concreto virado em betoneira, fck = 25MPa",null,"m3",null,"Sinapi 92873 + Sinapi 94965","",null,""]
[null,null,null,null,null,null,"",null,""]
[null,null,"LANÇAMENTO COM USO DE BALDES, ADENSAMENTO E ACABAMENTO DE CONCRETO EM ESTRUTURAS. AF_12/2015","m3",1,"Sinapi 92873",150.87,"Sinapi 92873",150.87,{"$f":"SUM(I293:I300)","v":441.39000000000004}]
[null,null,"Areia media - posto jazida/fornecedor (retirado na jazida, sem transporte)","m3",0.72299999999999998,"Sinapi 94965",80.84,"Sinapi 370",58.45]
[null,null,"Cimento Portland composto CP II-32","kg",362.66,"Sinapi 94965",0.37,"Sinapi 1379",134.18]
[null,null,"Pedra britada n. 1 (9,5 a 19 mm) posto pedreira/fornecedor, sem frete","m3",0.59299999999999997,"Sinapi 94965",72.510000000000005,"Sinapi 4721",43]
[null,null,"Servente com Encargos Complementares","h",{"$f":"2.31","v":2.31},"Sinapi 94965",14.21,"Sinapi 88316",32.83]
[null,null,"Operador de betoneira estacionária/misturador com encargos complementares","h",1.46,"Sinapi 94965",14.41,"Sinapi 88377",21.04]
[null,null,"BETONEIRA CAPACIDADE NOMINAL DE 400 L, CAPACIDADE DE MISTURA 280 L, MOTOR ELÉTRICO TRIFÁSICO POTÊNCIA DE 2 CV, SEM CARREGADOR - CHP DIURNO. AF_10/2014","chp",0.75,"Sinapi 94965",1.1399999999999999,"Sinapi 88830",0.86]
[null,null,"BETONEIRA CAPACIDADE NOMINAL DE 400 L, CAPACIDADE DE MISTURA 280 L, MOTOR ELÉTRICO TRIFÁSICO POTÊNCIA DE 2 CV, SEM CARREGADOR - CHI DIURNO. AF_10/2014","chi",0.71,"Sinapi 94965",0.23,"Sinapi 88831",0.16]
[null,null,null,null,null,null,"",null,""]
["SF-00079","Escoramento metálico",null,"m2 x mês",null,"Pini 05.103.000060.SER","",null,""]
[null,null,null,null,null,null,"",null,""]
[null,null,"Escora metálica comprimento regulável 2 a 3,2m","loc/un/mês",0.85,"Pini 05.103.000060.SER",8.31,"Pini 05.103.000060.EQL",7.06,{"$f":"SUM(I304:I305)","v":7.06}]
[null,null,null,null,null,null,"",null,""]
["SF-00080","Estrutura metálica em aço",null,"kg",null,"SCO/RJ ET 25.05.0180 (B) Adaptada","",null,""]
[null,null,null,null,null,null,"",null,""]
[null,null,"Acetileno, em garrafas de 9Kg","kg",0.01,"SCO/RJ ET 25.05.0180 (B)",31.39,"SCO/RJ ET 25.05.0180 (B)",0.31,{"$f":"SUM(I308:I319)","v":14.109999999999998}]
[null,null,"Cantoneira de aco, com abas iguais, de: (2\"x3/8\")","kg",0.27,"SCO/RJ ET 25.05.0180 (B)",3.93,"SCO/RJ ET 25.05.0180 (B)",1.06]
[null,null,"Chapa de aco USI-SAC 350, de (2,44x6)m, com espessura de 1/2\"","kg",0.33,"SCO/RJ ET 25.05.0180 (B)",4.6900000000000004,"SCO/RJ ET 25.05.0180 (B)",1.55]
[null,null,"Eletrodo com diametro de 5mm (3/16\"), E-7018-6 G","kg",2.5000000000000001E-2,"SCO/RJ ET 25.05.0180 (B)",15.15,"SCO/RJ ET 25.05.0180 (B)",0.38]
[null,null,"Oxigenio, em garrafas de 9,3 m3","m3",0.05,"SCO/RJ ET 25.05.0180 (B)",6.3,"SCO/RJ ET 25.05.0180 (B)",0.32]
[null,null,"Perfil \"H\" de aco carbono, padrao americano, de (6\"x6\")","kg",0.4,"SCO/RJ ET 25.05.0180 (B)",4.68,"SCO/RJ ET 25.05.0180 (B)",1.87]
[null,null,"Montador de estrutura metálica com encargos complementares","h",{"$f":"0.2+0.2","v":0.4},"SCO/RJ ET 25.05.0180 (B)",14.73,"Sinapi 88278",5.89]
[null,null,"Servente com Encargos Complementares","h",0.1,"SCO/RJ ET 25.05.0180 (B)",14.21,"Sinapi 88316",1.42]
[null,null,"Perda em perfil de aco carbono tipo \"H\", de 6\"x6\" - 5% - equivalente ao elementar MAT095450","kg",0.05,"SCO/RJ ET 25.05.0180 (B)",4.68,"SCO/RJ ET 25.05.0180 (B)",0.23]
[null,null,"Repintura interna ou externa sobre ferro, inclusive lixamento, limpeza, demao de tinta anti oxido Ferroloide ou equivalente e outra de tinta alquidica esmaltada Condor ou equivalente.","m2",0.05,"SCO/RJ ET 25.05.0180 (B)",13.39,"SCO/RJ ET 25.05.0180 (B)",0.67]
[null,null,"Retificador de solda, eletrico, de 430A. Custo horario corrido.","h",2.5000000000000001E-2,"SCO/RJ ET 25.05.0180 (B)",14.76,"SCO/RJ ET 25.05.0180 (B)",0.37]
[null,null,"Talha Guincho manual de 10Kg, sem operador, com as seguintes especificacoes minimas: capacidade de icamento de 1500Kg e de tracao de 1800Kg, cabo de aco com curso ilimitado, alavanca, gancho e carretel. Custo horario corrido.","h",0.5,"SCO/RJ ET 25.05.0180 (B)",0.08,"SCO/RJ ET 25.05.0180 (B)",0.04]
[null,null,null,null,null,null,"",null,""]
["SF-00081","Forma para estruturas de concreto",null,"m2",null,"Sinapi 92451","",null,""]
[null,null,null,null,null,null,"",null,""]
[null,null,"Desmoldante protetor para formas de madeira, de base oleosa emulsionada em agua","l",0.01,"Sinapi 92451",5.41,"Sinapi 2692",0.05,{"$f":"SUM(I323:I329)","v":99.97}]
[null,null,"TABUA DE MADEIRA NAO APARELHADA *2,5 X 20* CM, CEDRINHO OU EQUIVALENTE DA REGIAO","m",0.47399999999999998,"Sinapi 92451",9.56,"Sinapi 6193",4.53]
[null,null,"Prego de aco polido com cabeca dupla 17 x 27 (2 1/2 x 11)","kg",4.9000000000000002E-2,"Sinapi 92451",11.24,"Sinapi 40304",0.55000000000000004]
[null,null,"Ajudante de carpinteiro com encargos complementares","h",0.20499999999999999,"Sinapi 92451",16.170000000000002,"Sinapi 88239",{"$f":"IF(ISNUMBER(G326),ROUND(E326*G326,2),\"\")","v":3.31}]
[null,null,"Carpinteiro de formas com encargos complementares","h",1.1200000000000001,"Sinapi 92451",19.18,"Sinapi 88262",21.48]
[null,null,"Fabricação de fôrma para vigas, em chapa de madeira compensada resinada, E = 17 mm. AF_12/2015","m2",0.621,"Sinapi 92451",65.13,"Sinapi 92265",40.450000000000003]
[null,null,"Fabricação de escoras de viga do tipo garfo, em madeira. af_12/2015","m",1.8160000000000001,"Sinapi 92451",16.3,"Sinapi 92272",29.6]
[null,null,null,null,null,null,"",null,""]
["SF-00082","Verga/contraverga/cinta em bloco de concreto canaleta 11,5 x 19 x 39 cm",null,"m",null,"Pini 06.103.000505.SER + Sinapi 97914 Adaptada","",null,""]
[null,null,null,null,null,null,"",null,""]
[null,null,"Servente com Encargos Complementares","h",0.4,"Pini 06.103.000505.SER",14.21,"Sinapi 88316",5.68,{"$f":"SUM(I333:I340)","v":22.25}]
[null,null,"Pedreiro Com Encargos Complementares","h",0.3,"Pini 06.103.000505.SER",19.32,"Sinapi 88309",5.8]
[null,null,"Areia media - posto jazida/fornecedor (retirado na jazida, sem transporte)","m3",0.01,"Pini 06.103.000505.SER",80.84,"Sinapi 370",0.81]
[null,null,"Pedra britada n. 2 (19 a 38 mm) posto pedreira/fornecedor, sem frete","m3",0.01,"Pini 06.103.000505.SER",72.510000000000005,"Sinapi 4718",0.73]
[null,null,"Cimento Portland composto CP II-32","kg",2.0099999999999998,"Pini 06.103.000505.SER",0.37,"Sinapi 1379",0.74]
[null,null,"Bloco de concreto tipo canaleta 11,5 x 19 x 39 cm","un ",2.5,"Pini 06.103.000505.SER",2.29,"Pini 06.103.000505.MAT",5.73]
[null,null,"Aco CA-50, 10,0 mm, vergalhao","kg",0.5,"Pini 06.103.000505.SER",4.3600000000000003,"Sinapi 34",2.1800000000000002]
[null,null,"TRANSPORTE COM CAMINHÃO BASCULANTE DE 6 M3, EM VIA URBANA PAVIMENTADA, DMT ATÉ 30 KM (UNIDADE: M3XKM). AF_01/2018","m3xkm",{"$f":"0.01*2*20","v":0.4},"Sinapi 97914",1.45,"Sinapi 97914",0.57999999999999996]
[null,null,null,null,null,null,"",null,""]
[null,null,"Obs.: Considerando fornecedor de areia e brita a 20 km do Senado Federal.",null,null,null,"",null,""]
[null,null,null,null,null,null,"",null,""]
["SF-00083","Impermeabilização de superfície com revestimento bicomponente semi flexível",null,"m2",null,"Sinapi 98555","",null,""]
[null,null,null,null,null,null,"",null,""]
[null,null,"Argamassa polimerica impermeabilizante semiflexivel, bicomponente (membrana impermeabilizante acrilica)","kg",3.2,"Sinapi 98555",4.53,"Sinapi 135",14.5,{"$f":"SUM(I346:I348)","v":26.61}]
[null,null,"Ajudante especializado com encargos complementares","h",0.108,"Sinapi 98555",16.899999999999999,"Sinapi 88243",1.83]
[null,null,"Impermeabilizador com encargos complementares","h",0.53200000000000003,"Sinapi 98555",19.32,"Sinapi 88270",10.28]
[null,null,null,null,null,null,"",null,""]
["SF-00084","Alvenaria de vedação",null,"m2",null,"Sinapi 87503","",null,""]
[null,null,null,null,null,null,"",null,""]
[null,null,"Bloco ceramico (alvenaria de vedacao), de 9 x 19 x 19 cm","mil",2.793E-2,"Sinapi 87503",441,"Sinapi 7266",12.32,{"$f":"SUM(I352:I357)","v":53.150000000000006}]
[null,null,"Tela de aco soldada galvanizada/zincada para alvenaria, fio D = *1,20 a 1,70* mm, malha 15 x 15 mm, (C x L) *50 x 7,5* cm","m",0.42,"Sinapi 87503",1.38,"Sinapi 34557",0.57999999999999996]
[null,null,"Pino de aco com furo, haste = 27 mm (acao direta)","cento",5.0000000000000001E-3,"Sinapi 87503",23.91,"Sinapi 37395",0.12]
[null,null,"Argamassa Traço 1:2:8 (Cimento, Cal E Areia Média) Para Emboço/Massa Única/Assentamento De Alvenaria De Vedação, Preparo Mecânico Com Betoneira 400 L. Af_06/2014","m3",9.7999999999999997E-3,"Sinapi 87503",400.79,"Sinapi 87292",3.93]
[null,null,"Pedreiro com Encargos Complementares","h",1.37,"Sinapi 87503",19.32,"Sinapi 88309",26.47]
[null,null,"Servente com Encargos Complementares","h",0.68500000000000005,"Sinapi 87503",14.21,"Sinapi 88316",9.73]
[null,null,null,null,null,null,"",null,""]
["SF-00085","Fechamento ou shaft em gesso acartonado tipo drywall",null,"m2",null,"Sinapi 96370","",null,""]
[null,null,null,null,null,null,"",null,""]
[null,null,"Pino de aco com arruela conica, diametro arruela = *23* mm e Comp haste = *27* mm (acao indireta)","cento",2.4299999999999999E-2,"Sinapi 96370",27.81,"Sinapi 37586",0.68,{"$f":"SUM(I361:I371)","v":47.159999999999989}]
[null,null,"Chapa de gesso acartonado, Standard (ST), cor branca, E = 12,5 mm, 1200 x 2400 mm (L x C)","m2",1.0529999999999999,"Sinapi 96370",21.66,"Sinapi 39413",22.81]
[null,null,"Perfil guia, formato U, em aco zincado, para estrutura parede drywall, E = 0,5 mm, 70 x 3000 mm (L x C)","m",0.76039999999999996,"Sinapi 96370",3.77,"Sinapi 39419",2.87]
[null,null,"Perfil montante, formato C, em aco zincado, para estrutura parede drywall, E = 0,5 mm, 70 x 3000 mm (L x C)","m",1.9910000000000001,"Sinapi 96370",4.28,"Sinapi 39422",8.52]
[null,null,"Fita de papel microperfurado, 50 x 150 mm, para tratamento de juntas de chapa de gesso para drywall","m",1.2513000000000001,"Sinapi 96370",0.24,"Sinapi 39431",0.3]
[null,null,"Fita de papel reforcada com lamina de metal para reforco de cantos de chapa de gesso para drywall","m",0.74070000000000003,"Sinapi 96370",3.2,"Sinapi 39432",2.37]
[null,null,"Massa de rejunte em po para drywall, a base de gesso, secagem rapida, para tratamento de juntas de chapa de gesso (com adicao de agua)","kg",0.51639999999999997,"Sinapi 96370",4.3099999999999996,"Sinapi 39434",2.23]
[null,null,"Parafuso dry wall, em aco fosfatizado, cabeca trombeta e ponta agulha (TA), comprimento 25 mm","un",10.0039,"Sinapi 96370",0.06,"Sinapi 39435",0.6]
[null,null,"Parafuso dry wall, em aco zincado, cabeca lentilha e ponta broca (LB), largura 4,2 mm, comprimento 13 mm","un",0.80759999999999998,"Sinapi 96370",0.16,"Sinapi 39443",0.13]
[null,null,"Montador de estrutura metálica com encargos complementares","h",0.36359999999999998,"Sinapi 96370",14.73,"Sinapi 88278",5.36]
[null,null,"Servente com Encargos Complementares","h",9.0899999999999995E-2,"Sinapi 96370",14.21,"Sinapi 88316",1.29]
[null,null,null,null,null,null,"",null,""]
["SF-00086","Fixação (encunhamento) de Alvenaria de Vedação",null,"m",null,"Sinapi 93202","",null,""]
[null,null,null,null,null,null,"",null,""]
[null,null,"Tijolo ceramico macico *5 x 10 x 20* cm","un",11.2,"Sinapi 93202",0.28000000000000003,"Sinapi 7258",3.14,{"$f":"SUM(I375:I378)","v":16.880000000000003}]
[null,null,"Argamassa traço 1:2:9 (cimento, cal e areia média) para emboço/massa única/assentamento de alvenaria de vedação, preparo mecânico com betoneira 600 L. af_06/2014","m3",5.1999999999999998E-3,"Sinapi 93202",386.38,"Sinapi 87294",2.0099999999999998]
[null,null,"Pedreiro com Encargos Complementares","h",0.52900000000000003,"Sinapi 93202",19.32,"Sinapi 88309",10.220000000000001]
[null,null,"Servente com Encargos Complementares","h",0.106,"Sinapi 93202",14.21,"Sinapi 88316",1.51]
[null,null,null,null,null,null,"",null,""]
["SF-00087","Parede em gesso acartonado (drywall)",null,"m2",null,"Sinapi 96358","",null,""]
[null,null,null,null,null,null,"",null,""]
[null,null,"Pino De Aco Com Arruela Conica, Diametro Arruela = *23* Mm E Comp Haste = *27* Mm (Acao Indireta)","cento",2.4299999999999999E-2,"Sinapi 96358",27.81,"Sinapi 37586",0.68,{"$f":"SUM(I382:I392)","v":76.41}]
[null,null,"Chapa De Gesso Acartonado, Standard (St), Cor Branca, E = 12,5 Mm, 1200 X 2400 Mm (L X C)","m2",2.1059999999999999,"Sinapi 96358",21.66,"Sinapi 39413",45.62]
[null,null,"Perfil Guia, Formato U, Em Aco Zincado, Para Estrutura Parede Drywall, E = 0,5 Mm, 70 X 3000 Mm (L X C)","m",0.76039999999999996,"Sinapi 96358",3.77,"Sinapi 39419",2.87]
[null,null,"Perfil Montante, Formato C, Em Aco Zincado, Para Estrutura Parede Drywall, E = 0,5 Mm, 70 X 3000 Mm (L X C)","m",1.9910000000000001,"Sinapi 96358",4.28,"Sinapi 39422",8.52]
[null,null,"Fita De Papel Microperfurado, 50 X 150 Mm, Para Tratamento De Juntas De Chapa De Gesso Para Drywall","m",2.5026999999999999,"Sinapi 96358",0.24,"Sinapi 39431",0.6]
[null,null,"Fita De Papel Reforcada Com Lamina De Metal Para Reforco De Cantos De Chapa De Gesso Para Drywall","m",0.74070000000000003,"Sinapi 96358",3.2,"Sinapi 39432",2.37]
[null,null,"Massa De Rejunte Em Po Para Drywall, A Base De Gesso, Secagem Rapida, Para Tratamento De Juntas De Chapa De Gesso (Com Adicao De Agua)","kg",1.0327,"Sinapi 96358",4.3099999999999996,"Sinapi 39434",4.45]
[null,null,"Parafuso Dry Wall, Em Aco Fosfatizado, Cabeca Trombeta E Ponta Agulha (Ta), Comprimento 25 Mm","un",20.0077,"Sinapi 96358",0.06,"Sinapi 39435",1.2]
[null,null,"Parafuso Dry Wall, Em Aco Zincado, Cabeca Lentilha E Ponta Broca (Lb), Largura 4,2 Mm, Comprimento 13 Mm","un",0.80759999999999998,"Sinapi 96358",0.16,"Sinapi 39443",{"$f":"IF(ISNUMBER(G390),ROUND(E390*G390,2),\"\")","v":0.13}]
[null,null,"Montador de estrutura metálica com encargos complementares","h",0.54490000000000005,"Sinapi 96358",14.73,"Sinapi 88278",8.0299999999999994]
[null,null,"Servente com Encargos Complementares","h",0.13619999999999999,"Sinapi 96358",14.21,"Sinapi 88316",1.94]
[null,null,null,null,null,null,"",null,""]
["SF-00088","Reparos superficiais em painéis de gesso acartonado",null,"m2",null,"Sinapi 96370 Adaptada","",null,""]
[null,null,null,null,null,null,"",null,""]
[null,null,"Fita De Papel Microperfurado, 50 X 150 Mm, Para Tratamento De Juntas De Chapa De Gesso Para Drywall","m",1.2513000000000001,"Sinapi 96370",0.24,"Sinapi 39431",0.3,{"$f":"SUM(I396:I399)","v":5.2200000000000006}]
[null,null,"Massa De Rejunte Em Po Para Drywall, A Base De Gesso, Secagem Rapida, Para Tratamento De Juntas De Chapa De Gesso (Com Adicao De Agua)","kg",0.51639999999999997,"Sinapi 96370",4.3099999999999996,"Sinapi 39434",2.23]
[null,null,"Montador de estrutura metálica com encargos complementares","h",{"$f":"0.3636/3","v":0.12119999999999999},"Sinapi 96370 Adaptada",14.73,"Sinapi 88278",1.79]
[null,null,"Servente com Encargos Complementares","h",{"$f":"0.0909*0.7","v":6.3629999999999992E-2},"Sinapi 96370 Adaptada",14.21,"Sinapi 88316",0.9]
[null,null,null,null,null,null,"",null,""]
["SF-00089","Sóculo h=10 cm",null,"m2",null,"Sinapi 87471 + Sinapi 87545","",null,""]
[null,null,null,null,null,null,"",null,""]
[null,null,"Tela de aco soldada galvanizada/zincada para alvenaria, fio D = *1,20 a 1,70* mm, malha 15 x 15 mm, (C x L) *50 x 7,5* cm","m",0.78500000000000003,"Sinapi 87471",1.38,"Sinapi 34557",1.08,{"$f":"SUM(I403:I411)","v":55.139999999999993}]
[null,null,"Pino de aco com furo, haste = 27 mm (acao direta)","cento",9.4000000000000004E-3,"Sinapi 87471",23.91,"Sinapi 37395",0.22]
[null,null,"Bloco ceramico de vedacao com furos na vertical, 9 x 19 x 39 cm - 4,5 MPa (NBR 15270)","un",13.35,"Sinapi 87471",1.07,"Sinapi 37592",14.28]
[null,null,"Argamassa traço 1:2:8 (cimento, cal e areia média) para emboço/massa única/assentamento de alvenaria de vedação, preparo mecânico com betoneira 400 L. af_06/2014","m3",1.04E-2,"Sinapi 87471",400.79,"Sinapi 87292",4.17]
[null,null,"Pedreiro com Encargos Complementares","h",0.59,"Sinapi 87471",19.32,"Sinapi 88309",11.4]
[null,null,"Servente com Encargos Complementares","h",0.29499999999999998,"Sinapi 87471",14.21,"Sinapi 88316",4.1900000000000004]
[null,null,"Argamassa traço 1:2:8 (cimento, cal e areia média) para emboço/massa única/assentamento de alvenaria de vedação, preparo mecânico com betoneira 400 L. af_06/2014","m3",2.1299999999999999E-2,"Sinapi 87545",400.79,"Sinapi 87292",8.5399999999999991]
[null,null,"Pedreiro com Encargos Complementares","h",0.46,"Sinapi 87545",19.32,"Sinapi 88309",8.89]
[null,null,"Servente com Encargos Complementares","h",0.16700000000000001,"Sinapi 87545",14.21,"Sinapi 88316",2.37]
[null,null,null,null,null,null,"",null,""]
["SF-00090","Chapisco colante industrializado em vigas e pilares",null,"m2",null,"Sinapi 87872","",null,""]
[null,null,null,null,null,null,"",null,""]
[null,null,"Argamassa industrializada para chapisco colante, preparo com misturador de eixo horizontal de 300 kg. AF_06/2014","m3",3.2000000000000002E-3,"Sinapi 87872",2394.29,"Sinapi 87396",7.66,{"$f":"SUM(I415:I417)","v":10.58}]
[null,null,"Pedreiro com Encargos Complementares","h",0.14099999999999999,"Sinapi 87872",19.32,"Sinapi 88309",2.72]
[null,null,"Servente com Encargos Complementares","h",1.41E-2,"Sinapi 87872",14.21,"Sinapi 88316",0.2]
[null,null,null,null,null,null,"",null,""]
["SF-00091","Chapisco com argamassa traço 1:3",null,"m2",null,"Sinapi 87878","",null,""]
[null,null,null,null,null,null,"",null,""]
[null,null,"Argamassa traço 1:3 (cimento e areia grossa) para chapisco convencional, preparo manual. AF_06/2014","m3",4.1999999999999997E-3,"Sinapi 87878",442.95,"Sinapi 87377",1.86,{"$f":"SUM(I421:I423)","v":3.31}]
[null,null,"Pedreiro com Encargos Complementares","h",7.0000000000000007E-2,"Sinapi 87878",19.32,"Sinapi 88309",1.35]
[null,null,"Servente com Encargos Complementares","h",7.0000000000000001E-3,"Sinapi 87878",14.21,"Sinapi 88316",0.1]
[null,null,null,null,null,null,"",null,""]
["SF-00092","Gesso cola",null,"m2",null,"Sinapi 87419 Adaptada","",null,""]
[null,null,null,null,null,null,"",null,""]
[null,null,"Gesseiro com encargos complementares","h",0.4,"Sinapi 87419",19.22,"Sinapi 88269",7.69,{"$f":"SUM(I427:I429)","v":12.09}]
[null,null,"Servente com Encargos Complementares","h",0.08,"Sinapi 87419",14.21,"Sinapi 88316",1.1399999999999999]
[null,null,"Gesso cola. Ref: Juntalider","kg",0.75,"Senado Federal",4.34,"Pesquisa de Preços",3.26]
[null,null,null,null,null,null,"",null,""]
[null,null,"Obs.: Fonte para o coeficiente do gesso (0,75 kg/m2) : http://www.gessotrevo.com.br/gesso_cola.php - acesso em 16/08/18",null,null,null,"",null,""]
[null,null,null,null,null,null,"",null,""]
["SF-00093","Reboco com argamassa industrializada e=2,0 cm",null,"m2",null,"Sinapi 87398 + Sinapi 87531 Adaptada","",null,""]
[null,null,null,null,null,null,"",null,""]
[null,null,"Argamassa industrializada multiuso, para revestimento interno e externo e assentamento de blocos diversos","kg",{"$f":"1890*0.02","v":37.800000000000004},"Sinapi 87398 Adaptada",0.31,"Sinapi 371",11.72,{"$f":"SUM(I435:I438)","v":26.160000000000004}]
[null,null,"Servente com Encargos Complementares","h",{"$f":"13.64*0.02","v":0.27280000000000004},"Sinapi 87398 Adaptada",14.21,"Sinapi 88316",3.88]
[null,null,"Pedreiro com Encargos Complementares","h",0.43,"Sinapi 87531",19.32,"Sinapi 88309",8.31]
[null,null,"Servente com Encargos Complementares","h",{"$f":"0.158","v":0.158},"Sinapi 87531",14.21,"Sinapi 88316",2.25]
[null,null,null,null,null,null,"",null,""]
[null,null,"Obs.: Rendimento de argamassa obtido como referência no SINAPI e no link abaixo. Extrato: \"Revestimento: Em média 17,0 a 19,5 Kg/m2  para cada 1,0 cm de espessura, variando em função da aplicação\".",null,null,null,"",null,""]
[null,null,"https://s3.amazonaws.com/mapa-da-obra-producao/wp-content/uploads/2015/12/2101-matrix-revestimento-interno.pdf",null,null,null,"",null,""]
[null,null,null,null,null,null,"",null,""]
["SF-00094","Regularização com argamassa industrializada e=0,5 cm",null,"m2",null,"Sinapi 87398 + Sinapi 87549 Adaptada","",null,""]
[null,null,null,null,null,null,"",null,""]
[null,null,"Argamassa industrializada multiuso, para revestimento interno e externo e assentamento de blocos diversos","kg",{"$f":"1890*0.005","v":9.4500000000000011},"Sinapi 87398 Adaptada",0.31,"Sinapi 371",2.93,{"$f":"SUM(I445:I448)","v":9.36}]
[null,null,"Servente com Encargos Complementares","h",{"$f":"13.64*0.005","v":6.8200000000000011E-2},"Sinapi 87398 Adaptada",14.21,"Sinapi 88316",0.97]
[null,null,"Pedreiro com Encargos Complementares","h",{"$f":"0.31*0.7","v":0.217},"Sinapi 87549 Adaptada",19.32,"Sinapi 88309",4.1900000000000004]
[null,null,"Servente com Encargos Complementares","h",{"$f":"0.128*0.7","v":8.9599999999999999E-2},"Sinapi 87549 Adaptada",14.21,"Sinapi 88316",1.27]
[null,null,null,null,null,null,"",null,""]
["SF-00095","Tratamento de trincas superficiais",null,"m",null,"Pini 06.103.000460.SER Adaptada","",null,""]
[null,null,null,null,null,null,"",null,""]
[null,null,"Servente com Encargos Complementares","h",0.6,"Pini 06.103.000460.SER",14.21,"Sinapi 88316",8.5299999999999994,{"$f":"SUM(I452:I455)","v":16.09}]
[null,null,"Pedreiro com Encargos Complementares","h",0.155,"Pini 06.103.000460.SER",19.32,"Sinapi 88309",2.99]
[null,null,"Tela de poliéster adesiva largura 150mm e reforço central de 50mm","m",1.05,"Pini 06.103.000460.SER",4.17,"Pini 06.103.000460.MAT",{"$f":"IF(ISNUMBER(G454),ROUND(E454*G454,2),\"\")","v":4.38}]
[null,null,"Primer a base de poliuretano","l",{"$f":"0.15*0.01","v":1.5E-3},"Senado Federal",124.53,"Pesquisa de Preços",0.19]
[null,null,null,null,null,null,"",null,""]
[null,null,"Obs.: Rendimento do primer obtido de acordo com recomendação do fabricante. Consumo médio. ",null,null,null,"",null,""]
[null,null,"https://www.reisereis.com.br/produto/rrprimer-primer-pu-para-concreto",null,null,null,"",null,""]
[null,null,"http://www.viapol.com.br/produtos/viapol/selantes/primers/viapol-primer-pu/",null,null,null,"",null,""]
[null,null,null,null,null,null,"",null,""]
["SF-00096","Aplicação de fundo selador base água",null,"m2",null,"Sinapi 88414","",null,""]
[null,null,null,null,null,null,"",null,""]
[null,null,"Pintor com encargos complementares","h",0.106,"Sinapi 88414",20.32,"Sinapi 88310",2.15,{"$f":"SUM(I463:I465)","v":3.6399999999999997}]
[null,null,"Servente com Encargos Complementares","h",2.7E-2,"Sinapi 8841487418",14.21,"Sinapi 88316",0.38]
[null,null,"Fundo selador a base d'água","l",0.16,"Sinapi 88414",6.96,"Pesquisa de Preços",1.1100000000000001]
[null,null,null,null,null,null,"",null,""]
["SF-00097","Fundo anticorrosivo e de aderência (base água)",null,"m2",null,"Sinapi 74064/1 Adaptada","",null,""]
[null,null,null,null,null,null,"",null,""]
[null,null,"Pintor com encargos complementares","h",0.4,"Sinapi 74064/1",20.32,"Sinapi 88310",8.1300000000000008,{"$f":"SUM(I469:I471)","v":18.29}]
[null,null,"Servente com Encargos Complementares","h",0.3,"Sinapi 74064/1",14.21,"Sinapi 88316",4.26]
[null,null,"Fundo anticorrosivo e de aderência a base de água","l",0.24,"Sinapi 74064/1",24.59,"Pesquisa de Preços",5.9]
[null,null,null,null,null,null,"",null,""]
["SF-00098","Massa acrílica",null,"m2",null,"Sinapi 96132","",null,""]
[null,null,null,null,null,null,"",null,""]
[null,null,"Lixa em folha para parede ou madeira, numero 120 (cor vermelha)","un",0.1,"Sinapi 96132",0.63,"Sinapi 3767",0.06,{"$f":"SUM(I475:I478)","v":15.059999999999999}]
[null,null,"Massa acrilica para paredes interior/exterior","gl",0.24399999999999999,"Sinapi 96132",28.81,"Sinapi 4056",7.03]
[null,null,"Pintor com encargos complementares","h",0.33400000000000002,"Sinapi 96132",20.32,"Sinapi 88310",6.79]
[null,null,"Servente com Encargos Complementares","h",8.3000000000000004E-2,"Sinapi 96132",14.21,"Sinapi 88316",1.18]
[null,null,null,null,null,null,"",null,""]
["SF-00099","Massa corrida",null,"m2",null,"Sinapi 88497","",null,""]
[null,null,null,null,null,null,"",null,""]
[null,null,"Lixa em folha para parede ou madeira, numero 120 (cor vermelha)","un",0.1,"Sinapi 88497",0.63,"Sinapi 3767",0.06,{"$f":"SUM(I482:I485)","v":11.54}]
[null,null,"Massa corrida PVA para paredes internas","18L",4.8899999999999999E-2,"Sinapi 88497",71.91,"Sinapi 4051",3.52]
[null,null,"Pintor com encargos complementares","h",0.312,"Sinapi 88497",20.32,"Sinapi 88310",6.34]
[null,null,"Servente com Encargos Complementares","h",0.114,"Sinapi 88497",14.21,"Sinapi 88316",1.62]
[null,null,null,null,null,null,"",null,""]
["SF-00100","Pintura com tinta látex acrílica Premium (paredes)",null,"m2",null,"Sinapi 88489","",null,""]
[null,null,null,null,null,null,"",null,""]
[null,null,"Pintor com encargos complementares","h",0.187,"Sinapi 88489",20.32,"Sinapi 88310",3.8,{"$f":"SUM(I489:I491)","v":10.98}]
[null,null,"Servente com Encargos Complementares","h",6.9000000000000006E-2,"Sinapi 88489",14.21,"Sinapi 88316",0.98]
[null,null,"Tinta acrilica premium, cor branco fosco","l",0.33,"Sinapi 88489",18.79,"Sinapi 7356",6.2]
[null,null,null,null,null,null,"",null,""]
["SF-00101","Pintura em verniz sintético",null,"m2",null,"Sinapi 6082 Adaptada","",null,""]
[null,null,null,null,null,null,"",null,""]
[null,null,"Lixa em folha para parede ou madeira, numero 120 (cor vermelha)","un",1,"Sinapi 6082",0.63,"Sinapi 3767",0.63,{"$f":"SUM(I495:I498)","v":17.600000000000001}]
[null,null,"Verniz a base de água para madeira","l",7.4999999999999997E-2,"Sinapi 6082",61.11,"Pesquisa de Preços",4.58]
[null,null,"Pintor com encargos complementares","h",0.4,"Sinapi 6082",20.32,"Sinapi 88310",8.1300000000000008]
[null,null,"Servente com Encargos Complementares","h",0.3,"Sinapi 6082",14.21,"Sinapi 88316",4.26]
[null,null,null,null,null,null,"",null,""]
["SF-00102","Pintura esmalte acetinado (metais e madeiras)",null,"m2",null,"Sinapi 73924/2 Adaptada","",null,""]
[null,null,null,null,null,null,"",null,""]
[null,null,"Pintor com encargos complementares","h",0.5,"Sinapi 73924/2",20.32,"Sinapi 88310",10.16,{"$f":"SUM(I502:I505)","v":23.26}]
[null,null,"Servente com Encargos Complementares","h",0.5,"Sinapi 73924/2",14.21,"Sinapi 88316",7.11]
[null,null,"Lixa em folha para ferro, numero 150","un",0.6,"Sinapi 73924/2",2.64,"Sinapi 3768",1.58]
[null,null,"Tinta esmalte sintetico a base de água","l",0.16,"Sinapi 73924/2",27.58,"Pesquisa de Preços",4.41]
[null,null,null,null,null,null,"",null,""]
["SF-00103","Pintura tinta látex acrílica standard (tetos)",null,"m2",null,"Sinapi 88488","",null,""]
[null,null,null,null,null,null,"",null,""]
[null,null,"Pintor com encargos complementares","h",0.24399999999999999,"Sinapi 88488",20.32,"Sinapi 88310",4.96,{"$f":"SUM(I509:I511)","v":12.42}]
[null,null,"Servente com Encargos Complementares","h",8.8999999999999996E-2,"Sinapi 88488",14.21,"Sinapi 88316",1.26]
[null,null,"Tinta acrilica premium, cor branco fosco","l",0.33,"Sinapi 88488",18.79,"Sinapi 7356",6.2]
[null,null,null,null,null,null,"",null,""]
["SF-00104","Cerâmica para revestimento de superfícies internas ou externas – Linha Administrativa",null,"m2",null,"Sinapi 87273 Adaptada","",null,""]
[null,null,null,null,null,null,"",null,""]
[null,null,"REVESTIMENTO EM CERAMICA ESMALTADA EXTRA, PEI MAIOR OU IGUAL 4, FORMATO MAIOR A 2025 CM2","m2",1.08,"Sinapi 87273",47.56,"Sinapi 10515",51.36,{"$f":"SUM(I515:I519)","v":73.849999999999994}]
[null,null,"Argamassa colante AC-II","kg",6.14,"Sinapi 87273",0.68,"Sinapi 34353",4.18]
[null,null,"Rejunte colorido, cimenticio","kg",0.22,"Sinapi 87273",2.17,"Sinapi 34357",0.48]
[null,null,"Azulejista ou ladrilhista com encargos complementares","h",0.66,"Sinapi 87273",19.25,"Sinapi 88256",{"$f":"IF(ISNUMBER(G518),ROUND(E518*G518,2),\"\")","v":12.71}]
[null,null,"Servente com Encargos Complementares","h",0.36,"Sinapi 87273",14.21,"Sinapi 88316",5.12]
[null,null,null,null,null,null,"",null,""]
["SF-00105","Contrapiso em argamassa",null,"m2",null,"Sinapi 87642","",null,""]
[null,null,null,null,null,null,"",null,""]
[null,null,"Argamassa traço 1:4 (cimento e areia média) para contrapiso, preparo manual. AF_06/2014","m3",5.2999999999999999E-2,"Sinapi 87642",489.37,"Sinapi 87373",25.94,{"$f":"SUM(I523:I527)","v":39.96}]
[null,null,"Pedreiro com Encargos Complementares","h",0.36,"Sinapi 87642",19.32,"Sinapi 88309",6.96]
[null,null,"Servente com Encargos Complementares","h",0.18,"Sinapi 87642",14.21,"Sinapi 88316",2.56]
[null,null,"Cimento Portland composto CP II-32","kg",0.5,"Sinapi 87642",0.37,"Sinapi 1379",0.19]
[null,null,"Aditivo adesivo liquido para argamassas de revestimentos cimenticios","l",0.435,"Sinapi 87642",9.9,"Sinapi 7334",4.3099999999999996]
[null,null,null,null,null,null,"",null,""]
["SF-00106","Contrapiso em argamassa (e=2cm) ou Regularização de contrapiso existente",null,"m2",null,"Sinapi 87622","",null,""]
[null,null,null,null,null,null,"",null,""]
[null,null,"Cimento Portland composto CP II-32","kg",0.5,"Sinapi 87622",0.37,"Sinapi 1379",0.19,{"$f":"SUM(I531:I535)","v":27.330000000000002}]
[null,null,"Aditivo adesivo liquido para argamassas de revestimentos cimenticios","l",0.435,"Sinapi 87622",9.9,"Sinapi 7334",4.3099999999999996]
[null,null,"Argamassa traço 1:4 (cimento e areia média) para contrapiso, preparo manual. AF_06/2014","m3",3.1E-2,"Sinapi 87622",489.37,"Sinapi 87373",15.17]
[null,null,"Pedreiro com Encargos Complementares","h",0.28999999999999998,"Sinapi 87622",19.32,"Sinapi 88309",5.6]
[null,null,"Servente com Encargos Complementares","h",0.14499999999999999,"Sinapi 87622",14.21,"Sinapi 88316",2.06]
[null,null,null,null,null,null,"",null,""]
["SF-00107","Granito cinza andorinha para piso",null,"m2",null,"Sinapi 98671 Adaptada","",null,""]
[null,null,null,null,null,null,"",null,""]
[null,null,"Argamassa colante tipo ACIII","kg",8.6199999999999992,"Sinapi 98671",1.04,"Sinapi 37595",8.9600000000000009,{"$f":"SUM(I539:I543)","v":164.38}]
[null,null,"Marmorista/graniteiro com encargos complementares","h",1.1879999999999999,"Sinapi 98671",16.09,"Sinapi 88274",19.11]
[null,null,"Servente com Encargos Complementares","h",0.59399999999999997,"Sinapi 98671",14.21,"Sinapi 88316",8.44]
[null,null,"Rejunte branco, cimenticio","kg",0.14000000000000001,"Sinapi 98671",1.95,"Sinapi 34356",0.27]
[null,null,"Granito Cinza Andorinha, com 20 mm de espessura, para piso","m2",1.1599999999999999,"Sinapi 98671",110,"Pesquisa de Preços",127.6]
[null,null,null,null,null,null,"",null,""]
["SF-00108","Granito Cinza Andorinha para rodapé",null,"m2",null,"Sinapi 98685 Adaptada","",null,""]
[null,null,null,null,null,null,"",null,""]
[null,null,"Granito Cinza Andorinha, com 20 mm de espessura e 70 mm de altura, para rodapé","m",{"$f":"1.04/0.07","v":14.857142857142856},"Sinapi 98685 Adaptada",11.8,"Pesquisa de Preços",175.31,{"$f":"SUM(I547:I551)","v":256.03999999999996}]
[null,null,"Argamassa colante tipo ACIII","kg",{"$f":"0.8614/0.1","v":8.6140000000000008},"Sinapi 98685 Adaptada",1.04,"Sinapi 37595",8.9600000000000009]
[null,null,"Marmorista/graniteiro com encargos complementares","h",{"$f":"0.299/0.1","v":2.9899999999999998},"Sinapi 98685 Adaptada",16.09,"Sinapi 88274",48.11]
[null,null,"Servente com Encargos Complementares","h",{"$f":"0.15/0.1","v":1.4999999999999998},"Sinapi 98685 Adaptada",14.21,"Sinapi 88316",21.32]
[null,null,"Rejunte branco, cimenticio","kg",{"$f":"0.12/0.1","v":1.2},"Sinapi 98685 Adaptada",1.95,"Sinapi 34356",2.34]
[null,null,null,null,null,null,"",null,""]
["SF-00109","Granito Cinza Andorinha para soleira e peitoril",null,"m2",null,"Sinapi 98689 Adaptada","",null,""]
[null,null,null,null,null,null,"",null,""]
[null,null,"Granito Cinza Andorinha, com 20 mm de espessura e 150 mm de altura, para soleira e peitoril","m",{"$f":"1/0.15","v":6.666666666666667},"Sinapi 98689 Adaptada",18,"Pesquisa de Preços",120,{"$f":"SUM(I555:I558)","v":213.47000000000003}]
[null,null,"Argamassa colante tipo ACIII","kg",{"$f":"1.29/0.15","v":8.6000000000000014},"Sinapi 98689 Adaptada",1.04,"Sinapi 37595",8.94]
[null,null,"Marmorista/graniteiro com encargos complementares","h",{"$f":"0.547/0.15","v":3.6466666666666669},"Sinapi 98689 Adaptada",16.09,"Sinapi 88274",58.67]
[null,null,"Servente com Encargos Complementares","h",{"$f":"0.273/0.15","v":1.8200000000000003},"Sinapi 98689 Adaptada",14.21,"Sinapi 88316",25.86]
[null,null,null,null,null,null,"",null,""]
["SF-00110","Granito Preto São Gabriel para piso",null,"m2",null,"Sinapi 98671 Adaptada","",null,""]
[null,null,null,null,null,null,"",null,""]
[null,null,"Argamassa colante tipo ACIII","kg",8.6199999999999992,"Sinapi 98671",1.04,"Sinapi 37595",8.9600000000000009,{"$f":"SUM(I562:I566)","v":222.38}]
[null,null,"Marmorista/graniteiro com encargos complementares","h",1.1879999999999999,"Sinapi 98671",16.09,"Sinapi 88274",19.11]
[null,null,"Servente com Encargos Complementares","h",0.59399999999999997,"Sinapi 98671",14.21,"Sinapi 88316",8.44]
[null,null,"Rejunte branco, cimenticio","kg",0.14000000000000001,"Sinapi 98671",1.95,"Sinapi 34356",0.27]
[null,null,"Granito Preto São Gabriel, com 20 mm de espessura, para piso","m2",1.1599999999999999,"Sinapi 98671",160,"Pesquisa de Preços",185.6]
[null,null,null,null,null,null,"",null,""]
["SF-00111","Granito Preto São Gabriel para rodapé",null,"m2",null,"Sinapi 98685 Adaptada","",null,""]
[null,null,null,null,null,null,"",null,""]
[null,null,"Granito Preto São Gabriel, com 20 mm de espessura e 70 mm de altura, para rodapé","m",{"$f":"1.04/0.07","v":14.857142857142856},"Sinapi 98685 Adaptada",19.82,"Pesquisa de Preços",294.47000000000003,{"$f":"SUM(I570:I574)","v":375.2}]
[null,null,"Argamassa colante tipo ACIII","kg",{"$f":"0.8614/0.1","v":8.6140000000000008},"Sinapi 98685 Adaptada",1.04,"Sinapi 37595",8.9600000000000009]
[null,null,"Marmorista/graniteiro com encargos complementares","h",{"$f":"0.299/0.1","v":2.9899999999999998},"Sinapi 98685 Adaptada",16.09,"Sinapi 88274",48.11]
[null,null,"Servente com Encargos Complementares","h",{"$f":"0.15/0.1","v":1.4999999999999998},"Sinapi 98685 Adaptada",14.21,"Sinapi 88316",21.32]
[null,null,"Rejunte branco, cimenticio","kg",{"$f":"0.12/0.1","v":1.2},"Sinapi 98685 Adaptada",1.95,"Sinapi 34356",2.34]
[null,null,null,null,null,null,"",null,""]
["SF-00112","Granito Preto São Gabriel para soleira e peitoril",null,"m2",null,"Sinapi 98689 Adaptada","",null,""]
[null,null,null,null,null,null,"",null,""]
[null,null,"Granito Preto São Gabriel, com 20 mm de espessura e 150 mm de altura, para soleira e peitoril","m",{"$f":"1/0.15","v":6.666666666666667},"Sinapi 98689 Adaptada",29.25,"Pesquisa de Preços",195,{"$f":"SUM(I578:I581)","v":288.47000000000003}]
[null,null,"Argamassa colante tipo ACIII","kg",{"$f":"1.29/0.15","v":8.6000000000000014},"Sinapi 98689 Adaptada",1.04,"Sinapi 37595",8.94]
[null,null,"Marmorista/graniteiro com encargos complementares","h",{"$f":"0.547/0.15","v":3.6466666666666669},"Sinapi 98689 Adaptada",16.09,"Sinapi 88274",58.67]
[null,null,"Servente com Encargos Complementares","h",{"$f":"0.273/0.15","v":1.8200000000000003},"Sinapi 98689 Adaptada",14.21,"Sinapi 88316",25.86]
[null,null,null,null,null,null,"",null,{"$f":"IF(ISNUMBER(G582),ROUND(E582*G582,2),\"\")","v":""}]
["SF-00113","Instalação de rodapé de madeira reaproveitado",null,"m",null,"Sinapi 84162 Adaptada","",null,""]
[null,null,null,null,null,null,"",null,""]
[null,null,"Cola A Base De Resina Sintetica Para Chapa De Laminado Melaminico","kg",0.04,"Sinapi 84162",23.47,"Sinapi 1339",0.94,{"$f":"SUM(I585:I587)","v":6.3599999999999994}]
[null,null,"Ajudante especializado com encargos complementares","h",0.15,"Sinapi 84162",16.899999999999999,"Sinapi 88243",2.54]
[null,null,"Carpinteiro de esquadria com encargos complementares","h",0.15,"Sinapi 84162",19.22,"Sinapi 88261",2.88]
[null,null,null,null,null,null,"",null,""]
["SF-00114","Mármore Bege Bahia para piso e parede",null,"m2",null,"Sinapi 98671 Adaptada","",null,""]
[null,null,null,null,null,null,"",null,""]
[null,null,"Argamassa colante tipo ACIII","kg",8.6199999999999992,"Sinapi 98671",1.04,"Sinapi 37595",8.9600000000000009,{"$f":"SUM(I591:I595)","v":222.38}]
[null,null,"Marmorista/graniteiro com encargos complementares","h",1.1879999999999999,"Sinapi 98671",16.09,"Sinapi 88274",19.11]
[null,null,"Servente com Encargos Complementares","h",0.59399999999999997,"Sinapi 98671",14.21,"Sinapi 88316",8.44]
[null,null,"Rejunte branco, cimenticio","kg",0.14000000000000001,"Sinapi 98671",1.95,"Sinapi 34356",0.27]
[null,null,"Mármore Bege Bahia, com 20 mm de espessura, para piso e parede","m2",1.1599999999999999,"Sinapi 98671",160,"Pesquisa de Preços",185.6]
[null,null,null,null,null,null,"",null,""]
["SF-00115","Mármore Branco Especial para piso e parede",null,"m2",null,"Sinapi 98672 Adaptada","",null,""]
[null,null,null,null,null,null,"",null,""]
[null,null,"Argamassa colante tipo ACIII","kg",8.6199999999999992,"Sinapi 98672",1.04,"Sinapi 37595",8.9600000000000009,{"$f":"SUM(I599:I603)","v":373.17999999999995}]
[null,null,"Marmorista/graniteiro com encargos complementares","h",1.1879999999999999,"Sinapi 98672",16.09,"Sinapi 88274",19.11]
[null,null,"Servente com Encargos Complementares","h",0.59399999999999997,"Sinapi 98672",14.21,"Sinapi 88316",8.44]
[null,null,"Rejunte branco, cimenticio","kg",0.14000000000000001,"Sinapi 98672",1.95,"Sinapi 34356",0.27]
[null,null,"Mármore Branco Especial, com 20 mm de espessura, para piso e parede","m2",1.1599999999999999,"Sinapi 98672",290,"Pesquisa de Preços",336.4]
[null,null,null,null,null,null,"",null,""]
["SF-00116","Rodapé de madeira",null,"m",null,"Sinapi 84162","",null,""]
[null,null,null,null,null,null,"",null,""]
[null,null,"Ajudante especializado com encargos complementares","h",0.15,"Sinapi 84162",16.899999999999999,"Sinapi 88243",2.54,{"$f":"SUM(I607:I610)","v":15.629999999999999}]
[null,null,"Carpinteiro de esquadria com encargos complementares","h",0.15,"Sinapi 84162",19.22,"Sinapi 88261",2.88]
[null,null,"Cola a base de resina sintetica para chapa de laminado melaminico","kg",0.04,"Sinapi 84162",23.47,"Sinapi 1339",0.94]
[null,null,"Rodape de madeira macica cumaru/ipe champanhe ou equivalente da regiao, *1,5 x 7 cm","m",1.03,"Sinapi 84162",9,"Sinapi 6186",9.27]
[null,null,null,null,null,null,"",null,""]
["SF-00121","Corte em placas de granito ou mármore reaproveitadas, para instalação de cubas",null,"un",null,{"$f":"F614","v":"Sinapi 38605"},"",null,""]
[null,null,null,null,null,null,"",null,""]
[null,null,"ABERTURA PARA ENCAIXE DE CUBA OU LAVATORIO EM BANCADA DE MARMORE/ GRANITO OU OUTRO TIPO DE PEDRA NATURAL","un",1,"Sinapi 38605",61.25,"Sinapi 38605",61.25,{"$f":"SUM(I614:I614)","v":61.25}]
[null,null,null,null,null,null,"",null,""]
["SF-00122","Furo em placas de granito ou mármore reaproveitadas, para instalação de torneira ou misturador",null,"un",null,{"$f":"F618","v":"Sinapi 38633"},"",null,""]
[null,null,null,null,null,null,"",null,""]
[null,null,"FURO PARA TORNEIRA OU OUTROS ACESSORIOS  EM BANCADA DE MARMORE/ GRANITO OU OUTRO TIPO DE PEDRA NATURAL","un",1,"Sinapi 38633",9.18,"Sinapi 38633",9.18,{"$f":"SUM(I618:I618)","v":9.18}]
[null,null,null,null,null,null,"",null,""]
["SF-00123","Granito Cinza Andorinha 20mm para rodabancada",null,"m2",null,"Sinapi 98685 Adaptada","",null,""]
[null,null,null,null,null,null,"",null,""]
[null,null,"Granito Cinza Andorinha ou equivalente, com 20 mm de espessura e 150 mm de altura, polido, para rodabancada","m",{"$f":"1.04/0.15","v":6.9333333333333336},"Sinapi 98685 Adaptada",18,"Pesquisa de Preços",124.8,{"$f":"SUM(I622:I626)","v":178.61}]
[null,null,"Argamassa colante tipo ACIII","kg",{"$f":"0.8614/0.15","v":5.7426666666666675},"Sinapi 98685 Adaptada",1.04,"Sinapi 37595",5.97]
[null,null,"Marmorista/graniteiro com encargos complementares","h",{"$f":"0.299/0.15","v":1.9933333333333334},"Sinapi 98685 Adaptada",16.09,"Sinapi 88274",32.07]
[null,null,"Servente com Encargos Complementares","h",{"$f":"0.15/0.15","v":1},"Sinapi 98685 Adaptada",14.21,"Sinapi 88316",14.21]
[null,null,"Rejunte branco, cimenticio","kg",{"$f":"0.12/0.15","v":0.8},"Sinapi 98685 Adaptada",1.95,"Sinapi 34356",1.56]
[null,null,null,null,null,null,"",null,""]
["SF-00124","Granito Cinza Andorinha 20mm para bancadas",null,"m2",null,"Sinapi 86889 Adaptada","",null,""]
[null,null,null,null,null,null,"",null,""]
[null,null,"Granito Cinza Andorinha, com 20 mm de espessura, polido, com testeira para acabamento em meia esquadria, para bancadas","m2",1,"Sinapi 86889 Adaptada",145,"Pesquisa de Preços",145,{"$f":"SUM(I630:I634)","v":191.88000000000002}]
[null,null,"Cantoneira ferro galvanizado de abas iguais, 1\" x 1/8\" (L x E) , 1,20kg/m","m",0.6,"Orse 10759",5.99,"Sinapi 567",3.59]
[null,null,"Rejunte epoxi branco","kg",{"$f":"0.0351/1.5/0.6","v":3.9E-2},"Sinapi 86889 Adaptada",30.3,"Sinapi 37329",1.18]
[null,null,"Marmorista/graniteiro com encargos complementares","h",{"$f":"1.49/1.5/0.6","v":1.6555555555555554},"Sinapi 86889 Adaptada",16.09,"Sinapi 88274",26.64]
[null,null,"Servente com Encargos Complementares","h",{"$f":"0.98/1.5/0.6","v":1.088888888888889},"Sinapi 86889 Adaptada",14.21,"Sinapi 88316",15.47]
[null,null,null,null,null,null,"",null,""]
["SF-00125","Granito Cinza Andorinha 30mm para divisória",null,"m2",null,"Sinapi 79627 Adaptada","",null,""]
[null,null,null,null,null,null,"",null,""]
[null,null,"Cimento branco","kg",0.7,"Sinapi 79627",2.21,"Sinapi 1380",1.55,{"$f":"SUM(I638:I642)","v":307.77000000000004}]
[null,null,"Granito Cinza Andorinha ou equivalente, com 30 mm de espessura, polido em todas as faces aparentes, para divisórias","m2",1,"Sinapi 79627",195,"Pesquisa de Preços",195]
[null,null,"Marmorista/graniteiro com encargos complementares","h",4.8,"Sinapi 79627",16.09,"Sinapi 88274",77.23]
[null,null,"Servente com Encargos Complementares","h",2.2999999999999998,"Sinapi 79627",14.21,"Sinapi 88316",32.68]
[null,null,"Argamassa traço 1:4 (cimento e areia média), preparo manual. AF_08/2014","m3",3.3E-3,"Sinapi 79627",396.01,"Sinapi 88631",1.31]
[null,null,null,null,null,null,"",null,""]
["SF-00126","Granito Preto São Gabriel 20mm para rodabancada",null,"m2",null,"Sinapi 98685 Adaptada","",null,""]
[null,null,null,null,null,null,"",null,""]
[null,null,"Granito Preto São Gabriel ou equivalente, com 20 mm de espessura e 150 mm de altura, polido, para rodabancada","m",{"$f":"1.04/0.15","v":6.9333333333333336},"Sinapi 98685 Adaptada",29.25,"Pesquisa de Preços",{"$f":"IF(ISNUMBER(G646),ROUND(E646*G646,2),\"\")","v":202.8},{"$f":"SUM(I646:I650)","v":256.61}]
[null,null,"Argamassa colante tipo ACIII","kg",{"$f":"0.8614/0.15","v":5.7426666666666675},"Sinapi 98685 Adaptada",1.04,"Sinapi 37595",5.97]
[null,null,"Marmorista/graniteiro com encargos complementares","h",{"$f":"0.299/0.15","v":1.9933333333333334},"Sinapi 98685 Adaptada",16.09,"Sinapi 88274",32.07]
[null,null,"Servente com Encargos Complementares","h",{"$f":"0.15/0.15","v":1},"Sinapi 98685 Adaptada",14.21,"Sinapi 88316",14.21]
[null,null,"Rejunte branco, cimenticio","kg",{"$f":"0.12/0.15","v":0.8},"Sinapi 98685 Adaptada",1.95,"Sinapi 34356",1.56]
[null,null,null,null,null,null,"",null,""]
["SF-00127","Granito Preto São Gabriel 20mm para bancadas",null,"m2",null,"Sinapi 86889 Adaptada","",null,""]
[null,null,null,null,null,null,"",null,""]
[null,null,"Granito Preto São Gabriel ou equivalente, com 20 mm de espessura, polido, com testeira para acabamento em meia esquadria, para bancadas","m2",1.0049999999999999,"Sinapi 86889 Adaptada",264.8,"Pesquisa de Preços",266.12,{"$f":"SUM(I654:I658)","v":313}]
[null,null,"Cantoneira ferro galvanizado de abas iguais, 1\" x 1/8\" (L x E) , 1,20kg/m","m",0.6,"Orse 10759",5.99,"Sinapi 567",3.59]
[null,null,"Rejunte epoxi branco","kg",{"$f":"0.0351/1.5/0.6","v":3.9E-2},"Sinapi 86889 Adaptada",30.3,"Sinapi 37329",1.18]
[null,null,"Marmorista/graniteiro com encargos complementares","h",{"$f":"1.49/1.5/0.6","v":1.6555555555555554},"Sinapi 86889 Adaptada",16.09,"Sinapi 88274",26.64]
[null,null,"Servente com Encargos Complementares","h",{"$f":"0.98/1.5/0.6","v":1.088888888888889},"Sinapi 86889 Adaptada",14.21,"Sinapi 88316",15.47]
[null,null,null,null,null,null,"",null,""]
["SF-00128","Instalação de bancada de granito ou mármore reaproveitada",null,"m2",null,"Sinapi 86889 Adaptada","",null,""]
[null,null,null,null,null,null,"",null,""]
[null,null,"Cantoneira ferro galvanizado de abas iguais, 1\" x 1/8\" (L x E) , 1,20kg/m","m",0.6,"Orse 10759",5.99,"Sinapi 567",3.59,{"$f":"SUM(I662:I665)","v":46.88}]
[null,null,"Rejunte epoxi branco","kg",{"$f":"0.0351/1.5/0.6","v":3.9E-2},"Sinapi 86889 Adaptada",30.3,"Sinapi 37329",1.18]
[null,null,"Marmorista/graniteiro com encargos complementares","h",{"$f":"1.49/1.5/0.6","v":1.6555555555555554},"Sinapi 86889 Adaptada",16.09,"Sinapi 88274",26.64]
[null,null,"Servente com Encargos Complementares","h",{"$f":"0.98/1.5/0.6","v":1.088888888888889},"Sinapi 86889 Adaptada",14.21,"Sinapi 88316",15.47]
[null,null,null,null,null,null,"",null,""]
["SF-00129","Instalação de rodapé reaproveitado, de mármore ou granito",null,"m2",null,"Sinapi 98685 Adaptada","",null,""]
[null,null,null,null,null,null,"",null,""]
[null,null,"Argamassa colante tipo ACIII","kg",{"$f":"0.8614","v":0.86140000000000005},"Sinapi 98685",1.04,"Sinapi 37595",0.9,{"$f":"SUM(I669:I672)","v":8.07}]
[null,null,"Marmorista/graniteiro com encargos complementares","h",{"$f":"0.299","v":0.29899999999999999},"Sinapi 98685",16.09,"Sinapi 88274",4.8099999999999996]
[null,null,"Servente com Encargos Complementares","h",{"$f":"0.15","v":0.15},"Sinapi 98685",14.21,"Sinapi 88316",2.13]
[null,null,"Rejunte branco, cimenticio","kg",{"$f":"0.12","v":0.12},"Sinapi 98685",1.95,"Sinapi 34356",0.23]
[null,null,null,null,null,null,"",null,""]
["SF-00130","Instalação de soleira ou peitoril, de mármore ou granito, reaproveitados",null,"m2",null,"Sinapi 98689 Adaptada","",null,""]
[null,null,null,null,null,null,"",null,""]
[null,null,"Marmorista/graniteiro com encargos complementares","h",1.1879999999999999,"Sinapi 98689",16.09,"Sinapi 88274",19.11,{"$f":"SUM(I676:I678)","v":36.51}]
[null,null,"Servente com Encargos Complementares","h",0.59399999999999997,"Sinapi 98689",14.21,"Sinapi 88316",8.44]
[null,null,"Argamassa colante tipo ACIII","kg",8.6199999999999992,"Sinapi 98689",1.04,"Sinapi 37595",8.9600000000000009]
[null,null,null,null,null,null,"",null,""]
["SF-00131","Mármore Branco Especial 20mm para rodabancada",null,"m2",null,"Sinapi 98685 Adaptada","",null,""]
[null,null,null,null,null,null,"",null,""]
[null,null,"Mármore Branco Especial, com 20 mm de espessura e 150 mm de altura, polido, para rodabancada","m",{"$f":"1.04/0.15","v":6.9333333333333336},"Sinapi 98685 Adaptada",43.5,"Pesquisa de Preços",301.60000000000002,{"$f":"SUM(I682:I686)","v":338.38}]
[null,null,"Argamassa colante tipo ACIII","kg",8.6199999999999992,"Sinapi 98671 Adaptada",1.04,"Sinapi 37595",8.9600000000000009]
[null,null,"Marmorista/graniteiro com encargos complementares","h",1.1879999999999999,"Sinapi 98671 Adaptada",16.09,"Sinapi 88274",19.11]
[null,null,"Servente com Encargos Complementares","h",0.59399999999999997,"Sinapi 98671 Adaptada",14.21,"Sinapi 88316",8.44]
[null,null,"Rejunte branco, cimenticio","kg",0.14000000000000001,"Sinapi 98671 Adaptada",1.95,"Sinapi 34356",0.27]
[null,null,null,null,null,null,"",null,""]
["SF-00138","Instalação de divisória e porta de divisória com dobradiça reaproveitadas",null,"m2",null,"Pini 06.102.000005.SER Adaptada","",null,""]
[null,null,null,null,null,null,"",null,""]
[null,null,"Instalação de divisórias # 35 mm estruturadas em perfis de alumínio, mão de obra para execução","h",1,"Pini 06.102.000005.SER",12.56,"Pini 06.102.000005.MOE",12.56,{"$f":"SUM(I690:I690)","v":12.56}]
[null,null,null,null,null,null,"",null,""]
["SF-00139","Alçapão em forro de gesso acartonado",null,"m2",null,"Sinapi 74073/1 Adaptada","",null,""]
[null,null,null,null,null,null,"",null,""]
[null,null,"Perfil tipo cantoneira em L, em aco galvanizado, branco, para forro removivel, *23* x 3000 mm (L x C)","m",{"$f":"2*(1.5+0.67)","v":4.34},"Senado Federal",2.33,"Sinapi 39572",10.11,{"$f":"SUM(I694:I697)","v":92.52}]
[null,null,"Placa de PVC com espessura mínima de 5 mm na cor branca","m2",{"$f":"0.36/0.6/0.6","v":1},"Senado Federal",41.27,"Pesquisa de Preços",41.27]
[null,null,"Gesseiro com encargos complementares","h",{"$f":"0.29/0.6/0.6","v":0.80555555555555558},"Sinapi 74073/1 Adaptada",19.22,"Sinapi 88269",15.48]
[null,null,"Servente com Encargos Complementares","h",{"$f":"0.65/0.6/0.6","v":1.8055555555555558},"Sinapi 74073/1 Adaptada",14.21,"Sinapi 88316",25.66]
[null,null,null,null,null,null,"",null,""]
["SF-00140","Forro de PVC em réguas de 100 x 6000mm",null,"m2",null,"Sinapi 96486 Adaptada","",null,""]
[null,null,null,null,null,null,"",null,""]
[null,null,"Arame galvanizado 10 BWG, 3,40 mm (0,0713 kg/m)","kg",4.2599999999999999E-2,"Sinapi 96486",10.77,"Sinapi 335",0.46,{"$f":"SUM(I701:I708)","v":33.32}]
[null,null,"Forro de PVC, frisado, branco, regua de 10 cm, espessura de 8 mm a 10 mm e comprimento 6 m (sem colocacao)","m2",1.0955999999999999,"Sinapi 96486",10.8,"Sinapi 36230",11.83]
[null,null,"Perfil canaleta, formato C, em aco zincado, para estrutura forro drywall, E = 0,5 mm, *46 x 18* (L x H), comprimento 3 m","m",3.8498999999999999,"Sinapi 96486",2.77,"Sinapi 39427",10.66]
[null,null,"Pendural ou presilha reguladora, em aco galvanizado, com corpo, mola e rebite, para perfil tipo canaleta de estrutura em forros drywall","un",1.3265,"Sinapi 96486",1.04,"Sinapi 39430",1.38]
[null,null,"Parafuso dry wall, em aco zincado, cabeca lentilha e ponta broca (LB), largura 4,2 mm, comprimento 13 mm","un",2.1911999999999998,"Sinapi 96486",0.16,"Sinapi 39443",0.35]
[null,null,"Parafuso zincado, autobrocante, flangeado, 4,2 x 19\"","cento",1.32E-2,"Sinapi 96486",18.18,"Sinapi 40547",0.24]
[null,null,"PARAFUSO, AUTO ATARRACHANTE, CABECA CHATA, FENDA SIMPLES, 1/4\u0094 (6,35 MM) X 25 MM","cento",3.3300000000000003E-2,"Sinapi 96486",31.17,"Sinapi 40552",1.04]
[null,null,"Montador de estrutura metálica com encargos complementares","h",0.49940000000000001,"Sinapi 96486",14.73,"Sinapi 88278",7.36]
[null,null,null,null,null,null,"",null,""]
["SF-00141","Forro de PVC em réguas de 100 x 6000mm, sem estrutura",null,"m2",null,"Sinapi 72201 Adaptada","",null,{"$f":"IF(ISNUMBER(G710),ROUND(E710*G710,2),\"\")","v":""}]
[null,null,null,null,null,null,"",null,""]
[null,null,"Forro de PVC, frisado, branco, regua de 10 cm, espessura de 8 mm a 10 mm e comprimento 6 m (sem colocacao)","m2",1.0955999999999999,"Sinapi 96486",10.8,"Sinapi 36230",11.83,{"$f":"SUM(I712:I715)","v":22.21}]
[null,null,"Parafuso dry wall, em aco zincado, cabeca lentilha e ponta broca (LB), largura 4,2 mm, comprimento 13 mm","un",2.1911999999999998,"Sinapi 96486",0.16,"Sinapi 39443",0.35]
[null,null,"Carpinteiro de esquadria com encargos complementares","h",0.3,"Sinapi 72201",19.22,"Sinapi 88261",5.77]
[null,null,"Servente com Encargos Complementares","h",0.3,"Sinapi 72201",14.21,"Sinapi 88316",4.26]
[null,null,null,null,null,null,"",null,""]
["SF-00142","Forro de PVC modular em placas",null,"m2",null,"Sinapi 96486 Adaptada","",null,""]
[null,null,null,null,null,null,"",null,""]
[null,null,"Arame galvanizado 10 BWG, 3,40 mm (0,0713 kg/m)","kg",4.2599999999999999E-2,"Sinapi 96486",10.77,"Sinapi 335",0.46,{"$f":"SUM(I719:I726)","v":62.02000000000001}]
[null,null,"Forro de PVC modular em placas de 625 mm x 1250 mm","m2",1.0955999999999999,"Sinapi 96486",36.99,"Pesquisa de Preços",40.53]
[null,null,"Perfil canaleta, formato C, em aco zincado, para estrutura forro drywall, E = 0,5 mm, *46 x 18* (L x H), comprimento 3 m","m",3.8498999999999999,"Sinapi 96486",2.77,"Sinapi 39427",10.66]
[null,null,"Pendural ou presilha reguladora, em aco galvanizado, com corpo, mola e rebite, para perfil tipo canaleta de estrutura em forros drywall","un",1.3265,"Sinapi 96486",1.04,"Sinapi 39430",1.38]
[null,null,"Parafuso dry wall, em aco zincado, cabeca lentilha e ponta broca (LB), largura 4,2 mm, comprimento 13 mm","un",2.1911999999999998,"Sinapi 96486",0.16,"Sinapi 39443",0.35]
[null,null,"Parafuso zincado, autobrocante, flangeado, 4,2 x 19\"","cento",1.32E-2,"Sinapi 96486",18.18,"Sinapi 40547",0.24]
[null,null,"PARAFUSO, AUTO ATARRACHANTE, CABECA CHATA, FENDA SIMPLES, 1/4\u0094 (6,35 MM) X 25 MM","cento",3.3300000000000003E-2,"Sinapi 96486",31.17,"Sinapi 40552",1.04]
[null,null,"Montador de estrutura metálica com encargos complementares","h",0.49940000000000001,"Sinapi 96486",14.73,"Sinapi 88278",7.36]
[null,null,null,null,null,null,"",null,""]
["SF-00144","Forro em gesso acartonado monolítico",null,"m2",null,"Sinapi 96114","",null,""]
[null,null,null,null,null,null,"",null,""]
[null,null,"Arame galvanizado 10 BWG, 3,40 mm (0,0713 kg/m)","kg",4.2599999999999999E-2,"Sinapi 96114",10.77,"Sinapi 335",0.46,{"$f":"SUM(I730:I740)","v":54.680000000000007}]
[null,null,"Chapa de gesso acartonado, Standard (ST), cor branca, E = 12,5 mm, 1200 x 2400 mm (L x C)","m2",1.0966,"Sinapi 96114",21.66,"Sinapi 39413",23.75]
[null,null,"Perfil canaleta, formato C, em aco zincado, para estrutura forro drywall, E = 0,5 mm, *46 x 18* (L x H), comprimento 3 m","m",3.851,"Sinapi 96114",2.77,"Sinapi 39427",10.67]
[null,null,"Pendural ou presilha reguladora, em aco galvanizado, com corpo, mola e rebite, para perfil tipo canaleta de estrutura em forros drywall","un",1.3265,"Sinapi 96114",1.04,"Sinapi 39430",1.38]
[null,null,"Fita de papel reforcada com lamina de metal para reforco de cantos de chapa de gesso para drywall","m",1.4395,"Sinapi 96114",3.2,"Sinapi 39432",4.6100000000000003]
[null,null,"Massa de rejunte em po para drywall, a base de gesso, secagem rapida, para tratamento de juntas de chapa de gesso (com adicao de agua)","kg",0.5202,"Sinapi 96114",4.3099999999999996,"Sinapi 39434",2.2400000000000002]
[null,null,"Parafuso dry wall, em aco fosfatizado, cabeca trombeta e ponta agulha (TA), comprimento 25 mm","un",7.9740000000000002,"Sinapi 96114",0.06,"Sinapi 39435",0.48]
[null,null,"Parafuso dry wall, em aco zincado, cabeca lentilha e ponta broca (LB), largura 4,2 mm, comprimento 13 mm","un",2.1911999999999998,"Sinapi 96114",0.16,"Sinapi 39443",0.35]
[null,null,"Parafuso zincado, autobrocante, flangeado, 4,2 x 19\"","cento",1.32E-2,"Sinapi 96114",18.18,"Sinapi 40547",0.24]
[null,null,"Montador de estrutura metálica com encargos complementares","h",0.36280000000000001,"Sinapi 96114",14.73,"Sinapi 88278",5.34]
[null,null,"Servente com Encargos Complementares","h",0.36280000000000001,"Sinapi 96114",14.21,"Sinapi 88316",5.16]
[null,null,null,null,null,null,"",null,""]
["SF-00145","Forro em gesso acartonado monolítico, sem estrutura",null,"m2",null,"Sinapi 96114 Adaptada","",null,""]
[null,null,null,null,null,null,"",null,""]
[null,null,"Chapa de gesso acartonado, Standard (ST), cor branca, E = 12,5 mm, 1200 x 2400 mm (L x C)","m2",1.0966,"Sinapi 96114",21.66,"Sinapi 39413",23.75,{"$f":"SUM(I744:I750)","v":41.930000000000007}]
[null,null,"Fita de papel reforcada com lamina de metal para reforco de cantos de chapa de gesso para drywall","m",1.4395,"Sinapi 96114",3.2,"Sinapi 39432",4.6100000000000003]
[null,null,"Massa de rejunte em po para drywall, a base de gesso, secagem rapida, para tratamento de juntas de chapa de gesso (com adicao de agua)","kg",0.5202,"Sinapi 96114",4.3099999999999996,"Sinapi 39434",2.2400000000000002]
[null,null,"Parafuso dry wall, em aco fosfatizado, cabeca trombeta e ponta agulha (TA), comprimento 25 mm","un",7.9740000000000002,"Sinapi 96114",0.06,"Sinapi 39435",0.48]
[null,null,"Parafuso dry wall, em aco zincado, cabeca lentilha e ponta broca (LB), largura 4,2 mm, comprimento 13 mm","un",2.1911999999999998,"Sinapi 96114",0.16,"Sinapi 39443",0.35]
[null,null,"Montador de estrutura metálica com encargos complementares","h",0.36280000000000001,"Sinapi 96114",14.73,"Sinapi 88278",5.34]
[null,null,"Servente com Encargos Complementares","h",0.36280000000000001,"Sinapi 96114",14.21,"Sinapi 88316",5.16]
[null,null,null,null,null,null,"",null,""]
["SF-00146","Forro mineral modulado",null,"m2",null,"Sinapi 39511","",null,""]
[null,null,null,null,null,null,"",null,""]
[null,null,"FORRO DE FIBRA MINERAL EM PLACAS DE 625 X 625 MM, E = 15 MM, BORDA RETA, COM PINTURA ANTIMOFO, APOIADO EM PERFIL DE ACO GALVANIZADO COM 24 MM DE BASE - INSTALADO","m2",1,"Sinapi 39511",65.040000000000006,"Sinapi 39511",65.040000000000006,{"$f":"SUM(I754:I754)","v":65.040000000000006}]
[null,null,null,null,null,null,"",null,""]
["SF-00147","Forro mineral modulado, sem estrutura",null,"m2",null,"Pini 21.101.000010.SER Adaptada","",null,""]
[null,null,null,null,null,null,"",null,""]
[null,null,"Ajudante especializado com encargos complementares","h",{"$f":"1.2/4","v":0.3},"Pini 21.101.000010.SER Adaptada",16.899999999999999,"Sinapi 88243",5.07,{"$f":"SUM(I758:I759)","v":19.560000000000002}]
[null,null,"Placa de fibra mineral para forro, de 625 x 625 mm, E = 15 mm, borda reta, com pintura antimofo (nao inclui perfis)","m2",1,"Pini 21.101.000010.SER",14.49,"Sinapi 39514",14.49]
[null,null,null,null,null,null,"",null,""]
["SF-00148","Instalação de forro de PVC reaproveitado",null,"m2",null,"Sinapi 72201","",null,""]
[null,null,null,null,null,null,"",null,""]
[null,null,"Carpinteiro de esquadria com encargos complementares","h",0.3,"Sinapi 72201",19.22,"Sinapi 88261",5.77,{"$f":"SUM(I763:I764)","v":10.029999999999999}]
[null,null,"Servente com Encargos Complementares","h",0.3,"Sinapi 72201",14.21,"Sinapi 88316",4.26]
[null,null,null,null,null,null,"",null,""]
["SF-00149","Instalação de forro mineral reaproveitado",null,"m2",null,"Pini 21.101.000010.SER Adaptada","",null,""]
[null,null,null,null,null,null,"",null,{"$f":"IF(ISNUMBER(G767),ROUND(E767*G767,2),\"\")","v":""}]
[null,null,"Ajudante especializado com encargos complementares","h",1.2,"Pini 21.101.000010.SER",16.899999999999999,"Sinapi 88243",20.28,{"$f":"SUM(I768:I769)","v":37.96}]
[null,null,"Montador de estrutura metálica com encargos complementares","h",1.2,"Pini 21.101.000010.SER",14.73,"Sinapi 88278",17.68]
[null,null,null,null,null,null,"",null,""]
["SF-00150","Tabica metálica em forro de gesso acartonado",null,"m",null,"Sinapi 96121 Adaptada","",null,""]
[null,null,null,null,null,null,"",null,""]
[null,null,"Perfil tabica fechada, lisa, formato Z, em aco galvanizado natural, largura total na horizontal *40* mm, para estrutura forro drywall","m",1.1512,"Sinapi 96121",2.69,"Sinapi 39428",3.1,{"$f":"SUM(I773:I776)","v":7.68}]
[null,null,"Parafuso dry wall, em aco zincado, cabeca lentilha e ponta broca (LB), largura 4,2 mm, comprimento 13 mm","un",0.58330000000000004,"Sinapi 96121",0.16,"Sinapi 39443",0.09]
[null,null,"PARAFUSO, AUTO ATARRACHANTE, CABECA CHATA, FENDA SIMPLES, 1/4\u0094 (6,35 MM) X 25 MM","cento",7.4899999999999994E-2,"Sinapi 96121",31.17,"Sinapi 40552",2.33]
[null,null,"Montador de estrutura metálica com encargos complementares","h",0.14680000000000001,"Sinapi 96121",14.73,"Sinapi 88278",2.16]
[null,null,null,null,null,null,"",null,""]
["SF-00151","Instalação de revestimento de piso têxtil (carpete) reaproveitado",null,"m2",null,"Seinfra C1914 Adaptada","",null,""]
[null,null,null,null,null,null,"",null,""]
[null,null,"Servente com Encargos Complementares","h",0.1,"Seinfra C1914",14.21,"Sinapi 88316",1.42,{"$f":"SUM(I780:I782)","v":5.55}]
[null,null,"Pedreiro com Encargos Complementares","h",0.1,"Seinfra C1914",19.32,"Sinapi 88309",1.93]
[null,null,"ADESIVO ACRILICO/COLA DE CONTATO","kg",0.1,"Seinfra C1914",22,"Sinapi 4791",2.2000000000000002]
[null,null,null,null,null,null,"",null,""]
["SF-00152","Baguetes metálicos",null,"m",null,"Senado Federal","",null,""]
[null,null,null,null,null,null,"",null,""]
[null,null,"Vidraceiro com encargos complementares","h",0.25,"Senado Federal",17.940000000000001,"Sinapi 88325",4.49,{"$f":"SUM(I786:I787)","v":8.11}]
[null,null,"Baguetes metálicos","m",1.05,"Senado Federal",3.45,"Pesquisa de Preços",3.62]
[null,null,null,null,null,null,"",null,""]
["SF-00153","Cordão de massa de vidraceiro",null,"m",null,"Sedop 270629 Adaptada","",null,""]
[null,null,null,null,null,null,"",null,""]
[null,null,"Vidraceiro com encargos complementares","h",0.5,"Sedop 270629",17.940000000000001,"Sinapi 88325",8.9700000000000006,{"$f":"SUM(I791:I793)","v":14.85}]
[null,null,"Servente com Encargos Complementares","h",{"$f":"E791/2","v":0.25},"Senado Federal",14.21,"Sinapi 88316",3.55]
[null,null,"Massa para vidro","kg",0.6,"Sedop 270629",3.89,"Sinapi 10498",2.33]
[null,null,null,null,null,null,"",null,""]
["SF-00154","Espelho cristal, e=5 mm",null,"m2",null,"Sinapi 85005 Adaptada","",null,""]
[null,null,null,null,null,null,"",null,""]
[null,null,"Parafuso frances M16 em aco galvanizado, comprimento = 45 mm, diametro = 16 mm, cabeca abaulada","un",4,"Sinapi 85005",3.28,"Sinapi 442",13.12,{"$f":"SUM(I797:I800)","v":409.21}]
[null,null,"Espelho cristal comum #5mm","m2",1,"Sinapi 85005",354.53,"Pini 27.107.000100.MAT",354.53]
[null,null,"Servente com Encargos Complementares","h",0.4,"Sinapi 85005",14.21,"Sinapi 88316",5.68]
[null,null,"Vidraceiro com encargos complementares","h",2,"Sinapi 85005",17.940000000000001,"Sinapi 88325",35.880000000000003]
[null,null,null,null,null,null,"",null,""]
["SF-00155","Instalação de vidro reaproveitado",null,"m2",null,"Sinapi 72117 Adaptada","",null,""]
[null,null,null,null,null,null,"",null,""]
[null,null,"Servente com Encargos Complementares","h",0.45,"Sinapi 72117",14.21,"Sinapi 88316",6.39,{"$f":"SUM(I804:I806)","v":20.68}]
[null,null,"Vidraceiro com encargos complementares","h",0.45,"Sinapi 72117",17.940000000000001,"Sinapi 88325",8.07]
[null,null,"Massa para vidro","kg",1.6,"Sinapi 72117",3.89,"Sinapi 10498",6.22]
[null,null,null,null,null,null,"",null,""]
["SF-00156","Substituição da calafetação com selante",null,"m",null,"Senado Federal","",null,""]
[null,null,null,null,null,null,"",null,""]
[null,null,"Vidraceiro com encargos complementares","h",0.5,"Sedop 270629 Adaptada",17.940000000000001,"Sinapi 88325",8.9700000000000006,{"$f":"SUM(I810:I812)","v":15.809999999999999}]
[null,null,"Servente com Encargos Complementares","h",{"$f":"E810/2","v":0.25},"Senado Federal",14.21,"Sinapi 88316",3.55]
[null,null,"Silicone acetico uso geral incolor 280 g","un",{"$f":"1/3","v":0.33333333333333331},"Senado Federal",9.86,"Sinapi 39961",3.29]
[null,null,null,null,null,null,"",null,""]
[null,null,"Obs.: considerando que cada bisnaga rende no mínimo 3m de aplicação.",null,null,null,"",null,""]
[null,null,null,null,null,null,"",null,""]
["SF-00157","Vidro liso comum transparente 4mm",null,"m2",null,"Sinapi 72117","",null,""]
[null,null,null,null,null,null,"",null,""]
[null,null,"Servente com Encargos Complementares","h",0.45,"Sinapi 72117",14.21,"Sinapi 88316",6.39,{"$f":"SUM(I818:I821)","v":81.87}]
[null,null,"Vidraceiro com encargos complementares","h",0.45,"Sinapi 72117",17.940000000000001,"Sinapi 88325",8.07]
[null,null,"Vidro liso incolor 4mm - sem colocacao","m2",1,"Sinapi 72117",61.19,"Sinapi 10492",61.19]
[null,null,"Massa para vidro","kg",1.6,"Sinapi 72117",3.89,"Sinapi 10498",6.22]
[null,null,null,null,null,null,"",null,""]
["SF-00158","Vidro liso comum transparente 6mm",null,"m2",null,"Sinapi 84959","",null,""]
[null,null,null,null,null,null,"",null,""]
[null,null,"Servente com Encargos Complementares","h",0.2,"Sinapi 84959",14.21,"Sinapi 88316",2.84,{"$f":"SUM(I825:I828)","v":115.26}]
[null,null,"Vidraceiro com encargos complementares","h",1,"Sinapi 84959",17.940000000000001,"Sinapi 88325",17.940000000000001]
[null,null,"VIDRO LISO INCOLOR 6 MM - SEM COLOCACAO","m2",1,"Sinapi 84959",86.7,"Sinapi 10491",86.7]
[null,null,"Massa para vidro","kg",2,"Sinapi 84959",3.89,"Sinapi 10498",7.78]
[null,null,null,null,null,null,"",null,""]
["SF-00159","Instalação de painéis de vidro temperado reaproveitados",null,"m2",null,"Orse 05041 Adaptada","",null,""]
[null,null,null,null,null,null,"",null,{"$f":"IF(ISNUMBER(G831),ROUND(E831*G831,2),\"\")","v":""}]
[null,null,"Vidraceiro com encargos complementares","h",{"$f":"2.2/2","v":1.1000000000000001},"Orse 05041 Adaptada",17.940000000000001,"Sinapi 88325",19.73,{"$f":"SUM(I832:I833)","v":35.36}]
[null,null,"Servente com Encargos Complementares","h",{"$f":"2.2/2","v":1.1000000000000001},"Orse 05041 Adaptada",14.21,"Sinapi 88316",15.63]
[null,null,null,null,null,null,"",null,""]
["SF-00160","Mola hidráulica de piso",null,"un",null,"Sinapi 84886 Adaptada","",null,""]
[null,null,null,null,null,null,"",null,""]
[null,null,"Vidraceiro com encargos complementares","h",0.75,"Sinapi 84886",17.940000000000001,"Sinapi 88325",13.46,{"$f":"SUM(I837:I840)","v":688.76}]
[null,null,"Servente com Encargos Complementares","h",0.3,"Sinapi 84886",14.21,"Sinapi 88316",4.26]
[null,null,"Mola hidráulica. Ref.:\nMola: Dorma BTS 75 V/R; Soprano P330.","un",1,"Sinapi 84886",541.04,"Pesquisa de Preços",541.04]
[null,null,"Impermeabilizante Dorma SealProtect","un",1,"Senado Federal",130,"Pesquisa de Preços",130]
[null,null,null,null,null,null,"",null,""]
["SF-00161","Instalação de persianas reaproveitadas",null,"m",null,"Senado Federal","",null,""]
[null,null,null,null,null,null,"",null,""]
[null,null,"Ajudante especializado com encargos complementares","h",0.33333333333333331,"Senado Federal",16.899999999999999,"Sinapi 88243",5.63,{"$f":"SUM(I844:I844)","v":5.63}]
[null,null,null,null,null,null,"",null,""]
["SF-00166","Tubo de ligação para bacia sanitária",null,"un",null,"Orse 03707 Adaptada","",null,""]
[null,null,null,null,null,null,"",null,""]
[null,null,"Encanador ou Bombeiro Hidráulico com Encargos Complementares","h",0.2,"Orse 03707",18.95,"Sinapi 88267",3.79,{"$f":"SUM(I848:I850)","v":59.89}]
[null,null,"Vedacao PVC, 100 mm, para saida vaso sanitario","un",1,"Sinapi 95469",1.7,"Sinapi 6138",1.7]
[null,null,"Tubo de ligação para bacia sanitária em PVC, com acabamento cromado, ajustável ou não. Ref.: DECA 1968C ou equivalente","un",1,"Orse 03707",54.4,"Pesquisa de Preços",54.4]
[null,null,null,null,null,null,"",null,""]
["SF-00167","Tubo PVC esgoto ou aguas pluviais predial DN 100mm",null,"m",null,"Sinapi 89512","",null,""]
[null,null,null,null,null,null,"",null,""]
[null,null,"Adesivo plastico para PVC, frasco com 850 gr","un",4.2900000000000001E-2,89512,50.24,"Sinapi 122",2.16,{"$f":"SUM(I854:I859)","v":40.659999999999997}]
[null,null,"Tubo PVC, serie R, DN 100 mm, para esgoto ou aguas pluviais predial (NBR 5688)","m",1.04,89512,19.43,"Sinapi 9841",20.21]
[null,null,"Solucao limpadora para PVC, frasco com 1000 cm3","un",7.0099999999999996E-2,89512,43.63,"Sinapi 20083",3.06]
[null,null,"Lixa d'agua em folha, grao 100","un",0.14849999999999999,89512,1.49,"Sinapi 38383",0.22]
[null,null,"Auxiliar de encanador ou bombeiro hidráulico com encargos complementares","h",0.44500000000000001,89512,14.78,"Sinapi 88248",6.58]
[null,null,"Encanador ou Bombeiro Hidráulico com Encargos Complementares","h",0.44500000000000001,89512,18.95,"Sinapi 88267",8.43]
[null,null,null,null,null,null,"",null,""]
["SF-00168","Tubo PVC esgoto ou aguas pluviais predial DN 40mm",null,"m",null,"Sinapi 89508","",null,""]
[null,null,null,null,null,null,"",null,""]
[null,null,"Tubo PVC, serie R, DN 40 mm, para esgoto ou aguas pluviais predial (NBR 5688)","m",1.04,"Sinapi 89508",6.79,"Sinapi 20067",7.06,{"$f":"SUM(I863:I866)","v":12.689999999999998}]
[null,null,"Lixa d'agua em folha, grao 100","un",3.6999999999999998E-2,"Sinapi 89508",1.49,"Sinapi 38383",0.06]
[null,null,"Auxiliar de encanador ou bombeiro hidráulico com encargos complementares","h",0.16500000000000001,"Sinapi 89508",14.78,"Sinapi 88248",2.44]
[null,null,"Encanador ou Bombeiro Hidráulico com Encargos Complementares","h",0.16500000000000001,"Sinapi 89508",18.95,"Sinapi 88267",3.13]
[null,null,null,null,null,null,"",null,""]
["SF-00169","Tubo PVC esgoto ou aguas pluviais predial DN 50mm",null,"m",null,"Sinapi 89509","",null,""]
[null,null,null,null,null,null,"",null,""]
[null,null,"Adesivo plastico para PVC, frasco com 850 gr","un",1.2800000000000001E-2,"Sinapi 89509",50.24,"Sinapi 122",0.64,{"$f":"SUM(I870:I875)","v":17.420000000000002}]
[null,null,"Tubo PVC, serie R, DN 50 mm, para esgoto ou aguas pluviais predial (NBR 5688)","m",1.04,"Sinapi 89509",8.4600000000000009,"Sinapi 20068",8.8000000000000007]
[null,null,"Solucao limpadora para PVC, frasco com 1000 cm3","un",1.9300000000000001E-2,"Sinapi 89509",43.63,"Sinapi 20083",0.84]
[null,null,"Lixa d'agua em folha, grao 100","un",3.6999999999999998E-2,"Sinapi 89509",1.49,"Sinapi 38383",0.06]
[null,null,"Auxiliar de encanador ou bombeiro hidráulico com encargos complementares","h",0.21,"Sinapi 89509",14.78,"Sinapi 88248",3.1]
[null,null,"Encanador ou Bombeiro Hidráulico com Encargos Complementares","h",0.21,"Sinapi 89509",18.95,"Sinapi 88267",3.98]
[null,null,null,null,null,null,"",null,""]
["SF-00170","Tubo PVC esgoto ou aguas pluviais predial DN 75mm",null,"m",null,"Sinapi 89511","",null,""]
[null,null,null,null,null,null,"",null,""]
[null,null,"Adesivo plastico para PVC, frasco com 850 gr","un",2.93E-2,"Sinapi 89511",50.24,"Sinapi 122",1.47,{"$f":"SUM(I879:I884)","v":26.11}]
[null,null,"Tubo PVC, serie R, DN 75 mm, para esgoto ou aguas pluviais predial (NBR 5688)","m",1.04,"Sinapi 89511",11.09,"Sinapi 9839",11.53]
[null,null,"Solucao limpadora para PVC, frasco com 1000 cm3","un",4.5499999999999999E-2,"Sinapi 89511",43.63,"Sinapi 20083",1.99]
[null,null,"Lixa d'agua em folha, grao 100","un",0.1085,"Sinapi 89511",1.49,"Sinapi 38383",0.16]
[null,null,"Auxiliar de encanador ou bombeiro hidráulico com encargos complementares","h",0.32500000000000001,"Sinapi 89511",14.78,"Sinapi 88248",4.8]
[null,null,"Encanador ou Bombeiro Hidráulico com Encargos Complementares","h",0.32500000000000001,"Sinapi 89511",18.95,"Sinapi 88267",6.16]
[null,null,null,null,null,null,"",null,""]
["SF-00171","Tubo PVC soldavel agua fria DN 25mm",null,"m",null,"Sinapi 89446","",null,""]
[null,null,null,null,null,null,"",null,""]
[null,null,"Tubo PVC, soldavel, DN 25 mm, agua fria (NBR-5648)","m",1.0609999999999999,"Sinapi 89446",2.21,"Sinapi 9868",2.34,{"$f":"SUM(I888:I890)","v":2.88}]
[null,null,"Auxiliar de encanador ou bombeiro hidráulico com encargos complementares","h",1.6E-2,"Sinapi 89446",14.78,"Sinapi 88248",0.24]
[null,null,"Encanador ou Bombeiro Hidráulico com Encargos Complementares","h",1.6E-2,"Sinapi 89446",18.95,"Sinapi 88267",0.3]
[null,null,null,null,null,null,"",null,""]
["SF-00172","Tubo PVC soldavel agua fria DN 32mm",null,"m",null,"Sinapi 89447","",null,""]
[null,null,null,null,null,null,"",null,""]
[null,null,"Tubo PVC, soldavel, DN 32 mm, agua fria (NBR-5648)","m",1.0609999999999999,"Sinapi 89447",4.95,"Sinapi 9869",5.25,{"$f":"SUM(I894:I896)","v":5.93}]
[null,null,"Auxiliar de encanador ou bombeiro hidráulico com encargos complementares","h",0.02,"Sinapi 89447",14.78,"Sinapi 88248",{"$f":"IF(ISNUMBER(G895),ROUND(E895*G895,2),\"\")","v":0.3}]
[null,null,"Encanador ou Bombeiro Hidráulico com Encargos Complementares","h",0.02,"Sinapi 89447",18.95,"Sinapi 88267",0.38]
[null,null,null,null,null,null,"",null,""]
["SF-00173","Tubo PVC soldavel agua fria DN 40mm",null,"m",null,"Sinapi 89448","",null,""]
[null,null,null,null,null,null,"",null,""]
[null,null,"Tubo PVC, soldavel, DN 40 mm, agua fria (NBR-5648)","m",1.0609999999999999,"Sinapi 89448",7.21,"Sinapi 9874",7.65,{"$f":"SUM(I900:I903)","v":8.4599999999999991}]
[null,null,"Lixa d'agua em folha, grao 100","un",8.0000000000000002E-3,"Sinapi 89448",1.49,"Sinapi 38383",0.01]
[null,null,"Auxiliar de encanador ou bombeiro hidráulico com encargos complementares","h",2.4E-2,"Sinapi 89448",14.78,"Sinapi 88248",0.35]
[null,null,"Encanador ou Bombeiro Hidráulico com Encargos Complementares","h",2.4E-2,"Sinapi 89448",18.95,"Sinapi 88267",0.45]
[null,null,null,null,null,null,"",null,""]
["SF-00174","Tubo PVC soldavel agua fria DN 50mm",null,"m",null,"Sinapi 89449","",null,""]
[null,null,null,null,null,null,"",null,""]
[null,null,"TUBO PVC, SOLDAVEL, DN 50 MM, PARA AGUA FRIA (NBR-5648)","m",1.0609999999999999,"Sinapi 89449",8.25,"Sinapi 9875",8.75,{"$f":"SUM(I907:I910)","v":9.74}]
[null,null,"Lixa d'agua em folha, grao 100","un",0.01,"Sinapi 89449",1.49,"Sinapi 38383",0.01]
[null,null,"Auxiliar de encanador ou bombeiro hidráulico com encargos complementares","h",2.9000000000000001E-2,"Sinapi 89449",14.78,"Sinapi 88248",0.43]
[null,null,"Encanador ou Bombeiro Hidráulico com Encargos Complementares","h",2.9000000000000001E-2,"Sinapi 89449",18.95,"Sinapi 88267",0.55000000000000004]
[null,null,null,null,null,null,"",null,""]
["SF-00175","Base registro gaveta 3/4\"",null,"un",null,"Sinapi 89987 Adaptada","",null,""]
[null,null,null,null,null,null,"",null,""]
[null,null,"Base registro gaveta 3/4\" em liga de cobre, mod 4509.202 ref: DECA ou equivalente","un ",1,"Sinapi 89987",29.7,"Pesquisa de preços",29.7,{"$f":"SUM(I914:I917)","v":38.949999999999996}]
[null,null,"FITA VEDA ROSCA EM ROLOS DE 18 MM X 50 M (L X C)","un ",1.2999999999999999E-2,"Sinapi 89987",12.38,"Sinapi 3148",0.16]
[null,null,"Encanador ou Bombeiro Hidráulico com Encargos Complementares","h",0.3,"Sinapi 89987",18.95,"Sinapi 88267",5.69]
[null,null,"Auxiliar de encanador ou bombeiro hidráulico com encargos complementares","h",0.23,"Sinapi 89987",14.78,"Sinapi 88248",3.4]
[null,null,null,null,null,null,"",null,""]
["SF-00176","Caixa sifonada de PVC DN 150mm",null,"un",null,"Sinapi 89708","",null,""]
[null,null,null,null,null,null,"",null,""]
[null,null,"Auxiliar de encanador ou bombeiro hidráulico com encargos complementares","h",0.38,"Sinapi 89708",14.78,"Sinapi 88248",5.62,{"$f":"SUM(I921:I928)","v":50.86}]
[null,null,"Encanador ou Bombeiro Hidráulico com Encargos Complementares","h",0.38,"Sinapi 89708",18.95,"Sinapi 88267",7.2]
[null,null,"Adesivo plastico para PVC, frasco com 850 gr","un",1.4800000000000001E-2,"Sinapi 89708",50.24,"Sinapi 122",0.74]
[null,null,"Anel borracha para tubo esgoto predial DN 75 mm (NBR 5688)","un",1,"Sinapi 89708",1.74,"Sinapi 297",1.74]
[null,null,"Lixa d'agua em folha, grao 100","un",5.7000000000000002E-2,"Sinapi 89708",1.49,"Sinapi 38383",0.08]
[null,null,"Caixa sifonada PVC, 150 x 185 x 75 mm, com grelha quadrada branca","un",1,"Sinapi 89708",33.950000000000003,"Sinapi 11714",33.950000000000003]
[null,null,"Pasta lubrificante para tubos e conexoes com junta elastica (uso em PVC, aco, polietileno e outros) ( de *400* g)","un",0.03,"Sinapi 89708",18.399999999999999,"Sinapi 20078",0.55000000000000004]
[null,null,"Solucao limpadora para PVC, frasco com 1000 cm3","un",2.2499999999999999E-2,"Sinapi 89708",43.63,"Sinapi 20083",0.98]
[null,null,null,null,null,null,"",null,""]
["SF-00177","Caixa sifonada de PVC DN 250mm",null,"un",null,"Sinapi 89708 Adaptada","",null,""]
[null,null,null,null,null,null,"",null,""]
[null,null,"Auxiliar de encanador ou bombeiro hidráulico com encargos complementares","h",0.38,"Sinapi 89708",14.78,"Sinapi 88248",5.62,{"$f":"SUM(I932:I939)","v":87.11999999999999}]
[null,null,"Encanador ou Bombeiro Hidráulico com Encargos Complementares","h",0.38,"Sinapi 89708",18.95,"Sinapi 88267",7.2]
[null,null,"Adesivo plastico para PVC, frasco com 850 gr","un",1.4800000000000001E-2,"Sinapi 89708",50.24,"Sinapi 122",0.74]
[null,null,"Anel borracha para tubo esgoto predial DN 75 mm (NBR 5688)","un",1,"Sinapi 89708",1.74,"Sinapi 297",1.74]
[null,null,"Lixa d'agua em folha, grao 100","un",5.7000000000000002E-2,"Sinapi 89708",1.49,"Sinapi 38383",0.08]
[null,null,"CAIXA SIFONADA PVC, 250 X 230 X 75 MM, COM TAMPA E PORTA TAMPA QUADRADA BRANCA","un",1,"Sinapi 89708",70.209999999999994,"Sinapi 11880",70.209999999999994]
[null,null,"Pasta lubrificante para tubos e conexoes com junta elastica (uso em PVC, aco, polietileno e outros) ( de *400* g)","un",0.03,"Sinapi 89708",18.399999999999999,"Sinapi 20078",0.55000000000000004]
[null,null,"Solucao limpadora para PVC, frasco com 1000 cm3","un",2.2499999999999999E-2,"Sinapi 89708",43.63,"Sinapi 20083",0.98]
[null,null,null,null,null,null,"",null,""]
["SF-00178","Grelha quadrada para ralo 10x10cm",null,"un",null,"Orse 09419 Adaptada","",null,""]
[null,null,null,null,null,null,"",null,""]
[null,null,"Grelha quadrada para ralo, com caixilho, dimensões 10x10cm, em Aço polido, ref.: Moldenox ou equivalente","un ",1,"Orse 09419",45,"Pesquisa de Preços",45,{"$f":"SUM(I943:I944)","v":47.13}]
[null,null,"Servente com Encargos Complementares","h",0.15,"Orse 09419",14.21,"Sinapi 88316",2.13]
[null,null,null,null,null,null,"",null,""]
["SF-00179","Grelha quadrada para ralo 15x15cm",null,"un",null,"Orse 09419 Adaptada","",null,""]
[null,null,null,null,null,null,"",null,""]
[null,null,"Grelha quadrada para ralo, com caixilho, dimensões 15x15cm, em Aço polido, ref.: Moldenox ou equivalente","un ",1,"Orse 09419",47.28,"Pesquisa de Preços",47.28,{"$f":"SUM(I948:I949)","v":49.410000000000004}]
[null,null,"Servente com Encargos Complementares","h",0.15,"Orse 09419",14.21,"Sinapi 88316",2.13]
[null,null,null,null,null,null,"",null,""]
["SF-00180","Ralo seco PVC DN 100x40mm",null,"un",null,"Sinapi 89710","",null,""]
[null,null,null,null,null,null,"",null,""]
[null,null,"Auxiliar de encanador ou bombeiro hidráulico com encargos complementares","h",7.0000000000000007E-2,"Sinapi 89710",14.78,"Sinapi 88248",1.03,{"$f":"SUM(I953:I958)","v":8.36}]
[null,null,"Encanador ou Bombeiro Hidráulico com Encargos Complementares","h",7.0000000000000007E-2,"Sinapi 89710",18.95,"Sinapi 88267",1.33]
[null,null,"Adesivo plastico para PVC, frasco com 850 gr","un",4.8999999999999998E-3,"Sinapi 89710",50.24,"Sinapi 122",0.25]
[null,null,"Lixa d'agua em folha, grao 100","un",1.7000000000000001E-2,"Sinapi 89710",1.49,"Sinapi 38383",0.03]
[null,null,"Ralo seco PVC conico, 100 x 40 mm,  com grelha redonda branca","un",1,"Sinapi 89710",5.39,"Sinapi 11739",5.39]
[null,null,"Solucao limpadora para PVC, frasco com 1000 cm3","un",7.4999999999999997E-3,"Sinapi 89710",43.63,"Sinapi 20083",0.33]
[null,null,null,null,null,null,"",null,{"$f":"IF(ISNUMBER(G959),ROUND(E959*G959,2),\"\")","v":""}]
["SF-00181","Assento para bacia convencional – Linha Administrativa",null,"un",null,"Orse 02056 Adaptada","",null,""]
[null,null,null,null,null,null,"",null,""]
[null,null,"Assento poliéster com fixação cromada na cor branco gelo, ref: AP.75.17 – Linha Fast/Aspen – Deca ou equivalente","un ",1,"Orse 02056",49.9,"Pesquisa de preços",49.9,{"$f":"SUM(I962:I963)","v":51.32}]
[null,null,"Servente com Encargos Complementares","h",0.1,"Orse 02056",14.21,"Sinapi 88316",1.42]
[null,null,null,null,null,null,"",null,""]
["SF-00182","Bacia convencional – Linha Administrativa",null,"un",null,"Sinapi 95470 Adaptada","",null,""]
[null,null,null,null,null,null,"",null,""]
[null,null,"Bacia sanitaria (vaso) convencional de louca branca","un ",1,"Sinapi 95470",97.96,"Sinapi 10420",97.96,{"$f":"SUM(I967:I973)","v":209.45999999999995}]
[null,null,"Tubo de ligação para bacia sanitária em PVC, com acabamento cromado, ajustável ou não. Ref.: DECA 1968C ou equivalente","un",1,"Sinapi 95470",54.4,"Pesquisa de Preços",54.4]
[null,null,"Parafuso niquelado com acabamento cromado para fixar peca sanitaria, inclui porca cega, arruela e bucha de nylon tamanho S-10","un ",2,"Sinapi 95470",14.96,"Sinapi 4384",29.92]
[null,null,"Vedacao PVC, 100 mm, para saida vaso sanitario","un",1,"Sinapi 95470",1.7,"Sinapi 6138",1.7]
[null,null,"Rejunte epoxi branco","kg",0.1469,"Sinapi 95470",30.3,"Sinapi 37329",4.45]
[null,null,"Encanador ou Bombeiro Hidráulico com Encargos Complementares","h",0.78,"Sinapi 95470",18.95,"Sinapi 88267",14.78]
[null,null,"Servente com Encargos Complementares","h",0.44,"Sinapi 95470",14.21,"Sinapi 88316",6.25]
[null,null,null,null,null,null,"",null,""]
["SF-00183","Bacia convencional com saída horizontal",null,"un",null,"Sinapi 95471 Adaptada","",null,""]
[null,null,null,null,null,null,"",null,""]
[null,null,"Bacia convencional com saída horizontal (Modelo P.90.17 – Linha Ravena – Deca)","un ",1,"Sinapi 95471",185.42,"Pesquisa de Preços",185.42,{"$f":"SUM(I977:I982)","v":242.51999999999995}]
[null,null,"Parafuso niquelado com acabamento cromado para fixar peca sanitaria, inclui porca cega, arruela e bucha de nylon tamanho S-10","un ",2,"Sinapi 95471",14.96,"Sinapi 4384",29.92]
[null,null,"Vedacao PVC, 100 mm, para saida vaso sanitario","un",1,"Sinapi 95471",1.7,"Sinapi 6138",1.7]
[null,null,"Rejunte epoxi branco","kg",0.1469,"Sinapi 95471",30.3,"Sinapi 37329",4.45]
[null,null,"Encanador ou Bombeiro Hidráulico com Encargos Complementares","h",0.78,"Sinapi 95471",18.95,"Sinapi 88267",14.78]
[null,null,"Servente com Encargos Complementares","h",0.44,"Sinapi 95471",14.21,"Sinapi 88316",6.25]
[null,null,null,null,null,null,"",null,""]
["SF-00184","Cuba oval de embutir",null,"un",null,"Sinapi 86901 Adaptada","",null,""]
[null,null,null,null,null,null,"",null,""]
[null,null,"Cuba oval de embutir, mod.: L37, cor branca ref: DECA ou equivalente","un ",1,"Sinapi 86901",56.41,"Pesquisa de Preços",56.41,{"$f":"SUM(I986:I989)","v":86.949999999999989}]
[null,null,"Massa plastica para marmore/granito","kg",0.52710000000000001,"Sinapi 86901",24.71,"Sinapi 4823",13.02]
[null,null,"Servente com Encargos Complementares","h",0.27,"Sinapi 86901",14.21,"Sinapi 88316",3.84]
[null,null,"Marmorista/graniteiro com encargos complementares","h",0.85,"Sinapi 86901",16.09,"Sinapi 88274",13.68]
[null,null,null,null,null,null,"",null,""]
["SF-00185","Cuba retangular em aço inox – Linha Administrativa",null,"un",null,"Sinapi 86900 Adaptada","",null,""]
[null,null,null,null,null,null,"",null,""]
[null,null,"Cuba retangular com as dimensões 0,34x0,40x0,18m, em aço Inox AISI 304 com acabamento em alto brilho, com válvula de escoamento, ref: Franke 12646 ou equivalente","un ",1,"Sinapi 86900",195.39,"Pesquisa de Preços",195.39,{"$f":"SUM(I993:I996)","v":212.58999999999997}]
[null,null,"Massa plastica para marmore/granito","kg",0.2974,"Sinapi 86900",24.71,"Sinapi 4823",7.35]
[null,null,"Marmorista/graniteiro com encargos complementares","h",0.48,"Sinapi 86900",16.09,"Sinapi 88274",7.72]
[null,null,"Servente com Encargos Complementares","h",0.15,"Sinapi 86900",14.21,"Sinapi 88316",2.13]
[null,null,null,null,null,null,"",null,""]
["SF-00186","Cuba semiencaixe quadrada com mesa",null,"un",null,"Sinapi 86901 Adaptada","",null,""]
[null,null,null,null,null,null,"",null,""]
[null,null,"Cuba semi-encaixe com mesa, mod.: L830 ref: DECA ou equivalente","un ",1,"Sinapi 86901",629.9,"Pesquisa de Preços",629.9,{"$f":"SUM(I1000:I1003)","v":660.43999999999994}]
[null,null,"Massa plastica para marmore/granito","kg",0.52710000000000001,"Sinapi 86901",24.71,"Sinapi 4823",13.02]
[null,null,"Servente com Encargos Complementares","h",0.27,"Sinapi 86901",14.21,"Sinapi 88316",3.84]
[null,null,"Marmorista/graniteiro com encargos complementares","h",0.85,"Sinapi 86901",16.09,"Sinapi 88274",13.68]
[null,null,null,null,null,null,"",null,""]
["SF-00187","Instalação de lavatório reaproveitado",null,"un",null,"Sinapi 86904 Adaptada","",null,""]
[null,null,null,null,null,null,"",null,""]
[null,null,"Parafuso niquelado 3 1/2\" com acabamento cromado para fixar peca sanitaria, inclui porca cega, arruela e bucha de nylon tamanho S-8","un ",2,"Sinapi 86904",11.09,"Sinapi 4351",22.18,{"$f":"SUM(I1007:I1010)","v":33.81}]
[null,null,"Rejunte epoxi branco","kg",5.0700000000000002E-2,"Sinapi 86904",30.3,"Sinapi 37329",1.54]
[null,null,"Encanador ou Bombeiro Hidráulico com Encargos Complementares","h",0.39,"Sinapi 86904",18.95,"Sinapi 88267",7.39]
[null,null,"Servente com Encargos Complementares","h",0.19,"Sinapi 86904",14.21,"Sinapi 88316",2.7]
[null,null,null,null,null,null,"",null,""]
["SF-00188","Instalação de mictório reaproveitado",null,"un",null,"Sinapi 74234/1 Adaptada","",null,""]
[null,null,null,null,null,null,"",null,""]
[null,null,"Parafuso niquelado 3 1/2\" com acabamento cromado para fixar peca sanitaria, inclui porca cega, arruela e bucha de nylon tamanho S-8","un ",2,"Sinapi 74234/1",11.09,"Sinapi 4351",22.18,{"$f":"SUM(I1014:I1017)","v":117.6}]
[null,null,"Fita veda rosca em rolos de 18 mm x 10 m (L x C)","un ",{"$f":"0.076-0.0175-0.013","v":4.5499999999999999E-2},"Sinapi 74234/1 Adaptada",3.36,"Sinapi 3146",0.15]
[null,null,"Auxiliar de encanador ou bombeiro hidráulico com encargos complementares","h",{"$f":"3.2-0.05-0.23","v":2.9200000000000004},"Sinapi 74234/1 Adaptada",14.78,"Sinapi 88248",43.16]
[null,null,"Encanador ou Bombeiro Hidráulico com Encargos Complementares","h",{"$f":"3.2-0.15-0.3","v":2.7500000000000004},"Sinapi 74234/1 Adaptada",18.95,"Sinapi 88267",52.11]
[null,null,null,null,null,null,"",null,""]
[null,null,"Obs.: Considerando a redução de MO indicada nas composições SINAPI 86887 e SINAPI 89985, já que não consta engate flexível e registro de pressão.",null,null,null,"",null,""]
[null,null,null,null,null,null,"",null,""]
["SF-00189","Instalação de vaso sanitário reaproveitado",null,"un",null,"Sinapi 95469 Adaptada","",null,""]
[null,null,null,null,null,null,"",null,""]
[null,null,"Parafuso niquelado com acabamento cromado para fixar peca sanitaria, inclui porca cega, arruela e bucha de nylon tamanho S-10","un ",2,"Sinapi 95469",14.96,"Sinapi 4384",{"$f":"IF(ISNUMBER(G1023),ROUND(E1023*G1023,2),\"\")","v":29.92},{"$f":"SUM(I1023:I1027)","v":57.1}]
[null,null,"Vedacao PVC, 100 mm, para saida vaso sanitario","un",1,"Sinapi 95469",1.7,"Sinapi 6138",1.7]
[null,null,"Rejunte epoxi branco","kg",0.1469,"Sinapi 95469",30.3,"Sinapi 37329",4.45]
[null,null,"Encanador ou Bombeiro Hidráulico com Encargos Complementares","h",0.78,"Sinapi 95469",18.95,"Sinapi 88267",14.78]
[null,null,"Servente com Encargos Complementares","h",0.44,"Sinapi 95469",14.21,"Sinapi 88316",6.25]
[null,null,null,null,null,null,"",null,""]
["SF-00190","Lavatório suspenso",null,"un",null,"Sinapi 86904","",null,""]
[null,null,null,null,null,null,"",null,""]
[null,null,"Lavatorio louca branca suspenso *40 x 30* cm","un ",1,"Sinapi 86904",63.93,"Sinapi 10425",63.93,{"$f":"SUM(I1031:I1035)","v":97.740000000000009}]
[null,null,"Parafuso niquelado 3 1/2\" com acabamento cromado para fixar peca sanitaria, inclui porca cega, arruela e bucha de nylon tamanho S-8","un ",2,"Sinapi 86904",11.09,"Sinapi 4351",22.18]
[null,null,"Rejunte epoxi branco","kg",5.0700000000000002E-2,"Sinapi 86904",30.3,"Sinapi 37329",1.54]
[null,null,"Encanador ou Bombeiro Hidráulico com Encargos Complementares","h",0.39,"Sinapi 86904",18.95,"Sinapi 88267",7.39]
[null,null,"Servente com Encargos Complementares","h",0.19,"Sinapi 86904",14.21,"Sinapi 88316",2.7]
[null,null,null,null,null,null,"",null,""]
["SF-00191","Mictório – Linha Administrativa",null,"un",null,"Sinapi 74234/1 Adaptada","",null,""]
[null,null,null,null,null,null,"",null,""]
[null,null,"Mictorio sifonado louca branca sem complementos","un ",1,"Sinapi 74234/1",222.69,"Sinapi 10432",222.69,{"$f":"SUM(I1039:I1043)","v":340.29}]
[null,null,"Parafuso niquelado 3 1/2\" com acabamento cromado para fixar peca sanitaria, inclui porca cega, arruela e bucha de nylon tamanho S-8","un ",2,"Sinapi 74234/1",11.09,"Sinapi 4351",22.18]
[null,null,"Fita veda rosca em rolos de 18 mm x 10 m (L x C)","un ",{"$f":"0.076-0.0175-0.013","v":4.5499999999999999E-2},"Sinapi 74234/1 Adaptada",3.36,"Sinapi 3146",0.15]
[null,null,"Auxiliar de encanador ou bombeiro hidráulico com encargos complementares","h",{"$f":"3.2-0.05-0.23","v":2.9200000000000004},"Sinapi 74234/1 Adaptada",14.78,"Sinapi 88248",43.16]
[null,null,"Encanador ou Bombeiro Hidráulico com Encargos Complementares","h",{"$f":"3.2-0.15-0.3","v":2.7500000000000004},"Sinapi 74234/1 Adaptada",18.95,"Sinapi 88267",52.11]
[null,null,null,null,null,null,"",null,""]
[null,null,"Obs.: Considerando a redução de MO indicada nas composições SINAPI 86887 e SINAPI 89985, já que não consta engate flexível e registro de pressão.",null,null,null,"",null,""]
[null,null,null,null,null,null,"",null,""]
["SF-00192","Tanque 38 litros – Linha Administrativa",null,"un",null,"Sinapi 86874 Adaptada","",null,""]
[null,null,null,null,null,null,"",null,""]
[null,null,"Tanque de louça com capacidade de 38 litros na cor branca, suspenso, sem coluna","un ",1,"Sinapi 86874",351.14,"Pesquisa de Preços",351.14,{"$f":"SUM(I1049:I1053)","v":417.84000000000003}]
[null,null,"Parafuso niquelado 3 1/2\" com acabamento cromado para fixar peca sanitaria, inclui porca cega, arruela e bucha de nylon tamanho S-8","un ",4,"Sinapi 86874",11.09,"Sinapi 4351",44.36]
[null,null,"Rejunte epoxi branco","kg",6.5000000000000002E-2,"Sinapi 86874",30.3,"Sinapi 37329",1.97]
[null,null,"Encanador ou Bombeiro Hidráulico com Encargos Complementares","h",0.82,"Sinapi 86874",18.95,"Sinapi 88267",15.54]
[null,null,"Servente com Encargos Complementares","h",0.34,"Sinapi 86874",14.21,"Sinapi 88316",4.83]
[null,null,null,null,null,null,"",null,""]
["SF-00193","Acabamento para registro GD – Linha Administrativa",null,"un",null,"Orse 8436 Adaptada","",null,""]
[null,null,null,null,null,null,"",null,""]
[null,null,"Acabamento para registro de gaveta de 1 ¼” a 1 ½” (GD), cromado. Ref.: Modelo 4900.C35.GD – Linha Aspen – Deca","un ",1,"Orse 8436",43.83,"Pesquisa de Preços",43.83,{"$f":"SUM(I1057:I1058)","v":45.35}]
[null,null,"Encanador ou Bombeiro Hidráulico com Encargos Complementares","h",0.08,"Orse 8436",18.95,"Sinapi 88267",1.52]
[null,null,null,null,null," ","",null,""]
["SF-00194","Acabamento para registro PQ – Linha Administrativa",null,"un",null,"Orse 8436 Adaptada","",null,""]
[null,null,null,null,null,null,"",null,""]
[null,null,"Acabamento para registro de gaveta e pressão até 1” (PQ), cromado. Ref.: Modelo, 4900.C35.PQ – Linha Aspen – Deca","un ",1,"Orse 8436",32,"Pesquisa de Preços",32,{"$f":"SUM(I1062:I1063)","v":33.520000000000003}]
[null,null,"Encanador ou Bombeiro Hidráulico com Encargos Complementares","h",0.08,"Orse 8436",18.95,"Sinapi 88267",1.52]
[null,null,null,null,null,null,"",null,""]
["SF-00195","Ducha higiênica – Linha Administrativa",null,"un",null,"Pini 26.108.000090.SER Adaptada","",null,""]
[null,null,null,null,null,null,"",null,""]
[null,null,"Ducha higiênica com registro e derivação, com gatilho branco e flexível de 1,2m. Ref.: Modelo 1984.C35.ACT – Linha Aspen – Deca","un ",1,"Pini 26.108.000090.SER",215.98,"Pesquisa de Preços",215.98,{"$f":"SUM(I1067:I1069)","v":232.84999999999997}]
[null,null,"Encanador ou Bombeiro Hidráulico com Encargos Complementares","h",0.5,"Pini 26.108.000090.SER",18.95,"Sinapi 88267",9.48]
[null,null,"Auxiliar de encanador ou bombeiro hidráulico com encargos complementares","h",0.5,"Pini 26.108.000090.SER",14.78,"Sinapi 88248",7.39]
[null,null,null,null,null,null,"",null,""]
["SF-00196","Instalação de metais e acessórios reaproveitados",null,"un",null,"Sinapi 95541","",null,""]
[null,null,null,null,null,null,"",null,""]
[null,null,"Encanador ou Bombeiro Hidráulico com Encargos Complementares","h",0.16209999999999999,"Sinapi 95541",18.95,"Sinapi 88267",3.07,{"$f":"SUM(I1073:I1074)","v":3.4099999999999997}]
[null,null,"Auxiliar de encanador ou bombeiro hidráulico com encargos complementares","h",2.2700000000000001E-2,"Sinapi 95541",14.78,"Sinapi 88248",0.34]
[null,null,null,null,null,null,"",null,""]
["SF-00197","Ligação flexível 1/2” x 40 cm – Linha Administrativa",null,"un",null,"Sinapi 86887","",null,""]
[null,null,null,null,null,null,"",null,""]
[null,null,"Engate / rabicho flexivel inox 1/2 \" x 40 cm","un ",1,"Sinapi 86887",22.1,"Sinapi 11684",22.1,{"$f":"SUM(I1078:I1081)","v":25.71}]
[null,null,"Fita veda rosca em rolos de 18 mm x 10 m (L x C)","un ",1.7500000000000002E-2,"Sinapi 86887",3.36,"Sinapi 3146",0.06]
[null,null,"Encanador ou Bombeiro Hidráulico com Encargos Complementares","h",0.15,"Sinapi 86887",18.95,"Sinapi 88267",2.84]
[null,null,"Servente com Encargos Complementares","h",0.05,"Sinapi 86887",14.21,"Sinapi 88316",0.71]
[null,null,null,null,null,null,"",null,""]
["SF-00198","Sifão articulado para cozinha – Linha Administrativa",null,"un",null,"Sinapi 86881 Adaptada","",null,""]
[null,null,null,null,null,null,"",null,""]
[null,null,"Sifão regulável com tubo de saída corrugado para cozinha, cromado.  Ref.: Modelo VSM182 – Esteves","un ",1,"Sinapi 86881",167.92,"Pesquisa de Preços",167.92,{"$f":"SUM(I1085:I1088)","v":174.48999999999998}]
[null,null,"Fita veda rosca em rolos de 18 mm x 10 m (L x C)","un ",0.05,"Sinapi 86881",3.36,"Sinapi 3146",0.17]
[null,null,"Servente com Encargos Complementares","h",0.09,"Sinapi 86881",14.21,"Sinapi 88316",{"$f":"IF(ISNUMBER(G1087),ROUND(E1087*G1087,2),\"\")","v":1.28}]
[null,null,"Encanador ou Bombeiro Hidráulico com Encargos Complementares","h",0.27,"Sinapi 86881",18.95,"Sinapi 88267",5.12]
[null,null,null,null,null,null,"",null,""]
["SF-00199","Sifão para lavatório 1 1/2\"",null,"un",null,"Sinapi 86881","",null,""]
[null,null,null,null,null,null,"",null,""]
[null,null,"Sifao em metal cromado para pia ou lavatorio, 1 x 1.1/2 \"","un ",1,"Sinapi 86881",88.07,"Sinapi 6136",88.07,{"$f":"SUM(I1092:I1095)","v":94.64}]
[null,null,"Fita veda rosca em rolos de 18 mm x 10 m (L x C)","un ",0.05,"Sinapi 86881",3.36,"Sinapi 3146",0.17]
[null,null,"Encanador ou Bombeiro Hidráulico com Encargos Complementares","h",0.27,"Sinapi 86881",18.95,"Sinapi 88267",5.12]
[null,null,"Servente com Encargos Complementares","h",0.09,"Sinapi 86881",14.21,"Sinapi 88316",1.28]
[null,null,null,null,null,null,"",null,""]
["SF-00200","Sifão para tanque – Linha Administrativa",null,"un",null,"Sinapi 86881 Adaptada","",null,""]
[null,null,null,null,null,null,"",null,""]
[null,null,"Fita veda rosca em rolos de 18 mm x 10 m (L x C)","un ",0.05,"Sinapi 86881",3.36,"Sinapi 3146",0.17,{"$f":"SUM(I1099:I1102)","v":99.84}]
[null,null,"Servente com Encargos Complementares","h",0.09,"Sinapi 86881",14.21,"Sinapi 88316",1.28]
[null,null,"Encanador ou Bombeiro Hidráulico com Encargos Complementares","h",0.27,"Sinapi 86881",18.95,"Sinapi 88267",5.12]
[null,null,"Sifao em metal cromado para tanque, 1.1/4 x 1.1/2 \"","un",1,"Sinapi 86881",93.27,"Sinapi 38638",93.27]
[null,null,null,null,null,null,"",null,""]
["SF-00201","Torneira de mesa para cozinha bica móvel – Linha Administrativa",null,"un",null,"Sinapi 86909 Adaptada","",null,""]
[null,null,null,null,null,null,"",null,""]
[null,null,"Torneira de mesa para cozinha, cromada. Ref.: Deca Targa 1167.C40.CR","un ",1,"Sinapi 86909",260.12,"Pesquisa de Preços",260.12,{"$f":"SUM(I1106:I1109)","v":264.15000000000003}]
[null,null,"Fita veda rosca em rolos de 18 mm x 10 m (L x C)","un ",3.04E-2,"Sinapi 86909",3.36,"Sinapi 3146",0.1]
[null,null,"Encanador ou Bombeiro Hidráulico com Encargos Complementares","h",0.17,"Sinapi 86909",18.95,"Sinapi 88267",3.22]
[null,null,"Servente com Encargos Complementares","h",0.05,"Sinapi 86909",14.21,"Sinapi 88316",0.71]
[null,null,null,null,null,null,"",null,""]
["SF-00202","Torneira de mesa para cozinha bica móvel com arejador – Linha Administrativa",null,"un",null,"Sinapi 86909 Adaptada","",null,""]
[null,null,null,null,null,null,"",null,""]
[null,null,"Torneira de mesa bica móvel com arejador articulado para cozinha, cromada. Ref.: Código B5814C2CRB – Linha City – Celite","un ",1,"Sinapi 86909",143.55000000000001,"Pesquisa de Preços",143.55000000000001,{"$f":"SUM(I1113:I1116)","v":147.58000000000001}]
[null,null,"Fita veda rosca em rolos de 18 mm x 10 m (L x C)","un ",3.04E-2,"Sinapi 86909",3.36,"Sinapi 3146",0.1]
[null,null,"Encanador ou Bombeiro Hidráulico com Encargos Complementares","h",0.17,"Sinapi 86909",18.95,"Sinapi 88267",3.22]
[null,null,"Servente com Encargos Complementares","h",0.05,"Sinapi 86909",14.21,"Sinapi 88316",0.71]
[null,null,null,null,null,null,"",null,""]
["SF-00203","Torneira de mesa para lavatório – Linha Acessibilidade",null,"un",null,"Sinapi 86915 Adaptada","",null,""]
[null,null,null,null,null,null,"",null,""]
[null,null,"Torneira de mesa para lavatório, para uso clínico e apoio à pessoa. Ref.: Deca Link 1196.CLNK","un ",1,"Sinapi 86915",225.3,"Pesquisa de Preços",225.3,{"$f":"SUM(I1120:I1123)","v":227.73000000000002}]
[null,null,"Fita veda rosca em rolos de 18 mm x 10 m (L x C)","un ",3.04E-2,"Sinapi 86915",3.36,"Sinapi 3146",0.1]
[null,null,"Encanador ou Bombeiro Hidráulico com Encargos Complementares","h",0.1,"Sinapi 86915",18.95,"Sinapi 88267",1.9]
[null,null,"Servente com Encargos Complementares","h",0.03,"Sinapi 86915",14.21,"Sinapi 88316",0.43]
[null,null,null,null,null,null,"",null,""]
["SF-00204","Torneira de mesa para lavatório bica alta – Linha Administrativa",null,"un",null,"Sinapi 86915 Adaptada","",null,""]
[null,null,null,null,null,null,"",null,""]
[null,null,"Torneira de mesa para lavatorio, bica alta, com arejador, cromado. Ref.: Código B5810C2CRB – Linha City – Celite","un ",1,"Sinapi 86915",142.37,"Pesquisa de Preços",142.37,{"$f":"SUM(I1127:I1130)","v":144.80000000000001}]
[null,null,"Fita veda rosca em rolos de 18 mm x 10 m (L x C)","un ",3.04E-2,"Sinapi 86915",3.36,"Sinapi 3146",0.1]
[null,null,"Encanador ou Bombeiro Hidráulico com Encargos Complementares","h",0.1,"Sinapi 86915",18.95,"Sinapi 88267",1.9]
[null,null,"Servente com Encargos Complementares","h",0.03,"Sinapi 86915",14.21,"Sinapi 88316",0.43]
[null,null,null,null,null,null,"",null,""]
["SF-00205","Torneira de mesa para lavatório bica baixa – Linha Administrativa",null,"un",null,"Sinapi 86915 Adaptada","",null,""]
[null,null,null,null,null,null,"",null,""]
[null,null,"Torneira de mesa para lavatorio bica baixa. Ref.: Código B5811C2CRB – Linha City – Celite","un ",1,"Sinapi 86915",101.64,"Pesquisa de Preços",101.64,{"$f":"SUM(I1134:I1137)","v":104.07000000000001}]
[null,null,"Fita veda rosca em rolos de 18 mm x 10 m (L x C)","un ",3.04E-2,"Sinapi 86915",3.36,"Sinapi 3146",0.1]
[null,null,"Encanador ou Bombeiro Hidráulico com Encargos Complementares","h",0.1,"Sinapi 86915",18.95,"Sinapi 88267",1.9]
[null,null,"Servente com Encargos Complementares","h",0.03,"Sinapi 86915",14.21,"Sinapi 88316",0.43]
[null,null,null,null,null,null,"",null,""]
["SF-00206","Torneira de mesa para lavatório com fechamento automático – Linha Administrativa",null,"un",null,"Sinapi 86915 Adaptada","",null,""]
[null,null,null,null,null,null,"",null,""]
[null,null,"TORNEIRA CROMADA DE MESA PARA LAVATORIO TEMPORIZADA PRESSAO BICA BAIXA","un ",1,"Sinapi 86915",127.95,"Sinapi 36796",127.95,{"$f":"SUM(I1141:I1144)","v":130.38000000000002}]
[null,null,"Fita veda rosca em rolos de 18 mm x 10 m (L x C)","un ",3.04E-2,"Sinapi 86915",3.36,"Sinapi 3146",0.1]
[null,null,"Encanador ou Bombeiro Hidráulico com Encargos Complementares","h",0.1,"Sinapi 86915",18.95,"Sinapi 88267",1.9]
[null,null,"Servente com Encargos Complementares","h",0.03,"Sinapi 86915",14.21,"Sinapi 88316",0.43]
[null,null,null,null,null,null,"",null,""]
["SF-00207","Torneira de parede para cozinha bica móvel – Linha Administrativa",null,"un",null,"Sinapi 86910 Adaptada","",null,""]
[null,null,null,null,null,null,"",null,""]
[null,null,"Torneira de parede para cozinha bica móvel com arejador articulado, cromada. Ref.: Código B5815C2CRB – Linha City – Celite","un ",1,"Sinapi 86910",135.31,"Pesquisa de Preços",135.31,{"$f":"SUM(I1148:I1151)","v":139.34}]
[null,null,"Fita veda rosca em rolos de 18 mm x 10 m (L x C)","un ",3.04E-2,"Sinapi 86910",3.36,"Sinapi 3146",0.1]
[null,null,"Encanador ou Bombeiro Hidráulico com Encargos Complementares","h",0.17,"Sinapi 86910",18.95,"Sinapi 88267",3.22]
[null,null,"Servente com Encargos Complementares","h",0.05,"Sinapi 86910",14.21,"Sinapi 88316",{"$f":"IF(ISNUMBER(G1151),ROUND(E1151*G1151,2),\"\")","v":0.71}]
[null,null,null,null,null,null,"",null,""]
["SF-00208","Torneira de parede para tanque – Linha Administrativa",null,"un",null,"Sinapi 86914 Adaptada","",null,""]
[null,null,null,null,null,null,"",null,""]
[null,null,"Fita veda rosca em rolos de 18 mm x 10 m (L x C)","un ",3.04E-2,"Sinapi 86914",3.36,"Sinapi 3146",0.1,{"$f":"SUM(I1155:I1158)","v":49.18}]
[null,null,"Encanador ou Bombeiro Hidráulico com Encargos Complementares","h",0.15,"Sinapi 86914",18.95,"Sinapi 88267",2.84]
[null,null,"Servente com Encargos Complementares","h",0.05,"Sinapi 86914",14.21,"Sinapi 88316",0.71]
[null,null,"Torneira cromada com bico para jardim/tanque 1/2 \" ou 3/4 \" (ref 1153)","un",1,"Sinapi 86914",45.53,"Sinapi 11762",45.53]
[null,null,null,null,null,null,"",null,""]
["SF-00209","Válvula de descarga 1 1/2\" – Linha Acessibilidade",null,"un",null,"Sinapi 99635 Adaptada","",null,""]
[null,null,null,null,null,null,"",null,""]
[null,null,"Válvula de descarga 1 1/2\" cromada. ref.: modelo 2565.C.112.CONF – linha Hydra Eco Conforto – Deca ","un ",1,"Sinapi 99635",333.09,"Pesquisa de Preços",333.09,{"$f":"SUM(I1162:I1165)","v":359.94}]
[null,null,"Fita veda rosca em rolos de 18 mm x 50 m (L x C)","l",1.9E-2,"Sinapi 99635",12.38,"Sinapi 3148",0.24]
[null,null,"Auxiliar de encanador ou bombeiro hidráulico com encargos complementares","h",0.78900000000000003,"Sinapi 99635",14.78,"Sinapi 88248",11.66]
[null,null,"Encanador ou Bombeiro Hidráulico com Encargos Complementares","h",0.78900000000000003,"Sinapi 99635",18.95,"Sinapi 88267",14.95]
[null,null,null,null,null,null,"",null,""]
["SF-00210","Válvula de descarga 1 1/2\" – Linha Administrativa",null,"un",null,"Sinapi 99635","",null,""]
[null,null,null,null,null,null,"",null,""]
[null,null,"Valvula de descarga metalica, base 1 1/2 \" e acabamento metalico cromado","un ",1,"Sinapi 99635",147.35,"Sinapi 10228",147.35,{"$f":"SUM(I1169:I1172)","v":174.2}]
[null,null,"Fita veda rosca em rolos de 18 mm x 50 m (L x C)","l",1.9E-2,"Sinapi 99635",12.38,"Sinapi 3148",0.24]
[null,null,"Auxiliar de encanador ou bombeiro hidráulico com encargos complementares","h",0.78900000000000003,"Sinapi 99635",14.78,"Sinapi 88248",11.66]
[null,null,"Encanador ou Bombeiro Hidráulico com Encargos Complementares","h",0.78900000000000003,"Sinapi 99635",18.95,"Sinapi 88267",14.95]
[null,null,null,null,null,null,"",null,""]
["SF-00211","Válvula de descarga 1 1/4\" – Linha Acessibilidade",null,"un",null,"Sinapi 99635 Adaptada","",null,""]
[null,null,null,null,null,null,"",null,""]
[null,null,"Válvula de descarga 1 1/4\" . Ref.: Modelo 2565.C.114.CONF – Linha Hydra Eco Conforto – Deca","un ",1,"Sinapi 99635",338.9,"Pesquisa de Preços",338.9,{"$f":"SUM(I1176:I1179)","v":365.75}]
[null,null,"Fita veda rosca em rolos de 18 mm x 50 m (L x C)","l",1.9E-2,"Sinapi 99635",12.38,"Sinapi 3148",0.24]
[null,null,"Auxiliar de encanador ou bombeiro hidráulico com encargos complementares","h",0.78900000000000003,"Sinapi 99635",14.78,"Sinapi 88248",11.66]
[null,null,"Encanador ou Bombeiro Hidráulico com Encargos Complementares","h",0.78900000000000003,"Sinapi 99635",18.95,"Sinapi 88267",14.95]
[null,null,null,null,null,null,"",null,""]
["SF-00212","Válvula de descarga 1 1/4\" – Linha Administrativa",null,"un",null,"Sinapi 99635 Adaptada","",null,""]
[null,null,null,null,null,null,"",null,""]
[null,null,"Valvula de descarga metalica, base 1 1/4 \" e acabamento metalico cromado","un ",1,"Sinapi 99635",119.37,"Sinapi 11781",119.37,{"$f":"SUM(I1183:I1186)","v":146.22}]
[null,null,"Fita veda rosca em rolos de 18 mm x 50 m (L x C)","l",1.9E-2,"Sinapi 99635",12.38,"Sinapi 3148",0.24]
[null,null,"Auxiliar de encanador ou bombeiro hidráulico com encargos complementares","h",0.78900000000000003,"Sinapi 99635",14.78,"Sinapi 88248",11.66]
[null,null,"Encanador ou Bombeiro Hidráulico com Encargos Complementares","h",0.78900000000000003,"Sinapi 99635",18.95,"Sinapi 88267",14.95]
[null,null,null,null,null,null,"",null,""]
["SF-00213","Válvula de escoamento para lavatório – Linha Administrativa",null,"un",null,"Sinapi 86877 Adaptada","",null,""]
[null,null,null,null,null,null,"",null,""]
[null,null,"Valvula em metal cromado para lavatorio, 1 \" sem ladrao","un ",1,"Sinapi 86877",22.01,"Sinapi 38643",22.01,{"$f":"SUM(I1190:I1193)","v":26.07}]
[null,null,"Fita veda rosca em rolos de 18 mm x 10 m (L x C)","un ",0.04,"Sinapi 86877",3.36,"Sinapi 3146",0.13]
[null,null,"Encanador ou Bombeiro Hidráulico com Encargos Complementares","h",0.17,"Sinapi 86877",18.95,"Sinapi 88267",3.22]
[null,null,"Servente com Encargos Complementares","h",0.05,"Sinapi 86877",14.21,"Sinapi 88316",0.71]
[null,null,null,null,null,null,"",null,""]
["SF-00214","Válvula de escoamento para tanque – Linha Administrativa",null,"un",null,"Sinapi 86879 Adaptada","",null,""]
[null,null,null,null,null,null,"",null,""]
[null,null,"Fita veda rosca em rolos de 18 mm x 10 m (L x C)","un ",0.04,"Sinapi 86879",3.36,"Sinapi 3146",0.13,{"$f":"SUM(I1197:I1200)","v":21.38}]
[null,null,"Valvula em metal cromado para tanque, 1.1/2 \" sem ladrao","un",1,"Sinapi 86879",17.32,"Sinapi 37588",17.32]
[null,null,"Encanador ou Bombeiro Hidráulico com Encargos Complementares","h",0.17,"Sinapi 86879",18.95,"Sinapi 88267",3.22]
[null,null,"Servente com Encargos Complementares","h",0.05,"Sinapi 86879",14.21,"Sinapi 88316",0.71]
[null,null,null,null,null,null,"",null,""]
["SF-00215","Válvula descarga para mictório – Linha Administrativa",null,"un",null,"Sinapi 99635 Adaptada","",null,""]
[null,null,null,null,null,null,"",null,""]
[null,null,"Valvula de descarga em metal cromado para mictorio com acionamento por pressao e fechamento automatico","h",1,"Sinapi 99635",126.84,"Sinapi 21112",126.84,{"$f":"SUM(I1204:I1207)","v":153.69}]
[null,null,"Fita veda rosca em rolos de 18 mm x 50 m (L x C)","l",1.9E-2,"Sinapi 99635",12.38,"Sinapi 3148",0.24]
[null,null,"Auxiliar de encanador ou bombeiro hidráulico com encargos complementares","h",0.78900000000000003,"Sinapi 99635",14.78,"Sinapi 88248",11.66]
[null,null,"Encanador ou Bombeiro Hidráulico com Encargos Complementares","h",0.78900000000000003,"Sinapi 99635",18.95,"Sinapi 88267",14.95]
[null,null,null,null,null,null,"",null,""]
["SF-00216","Alarme de emergência para sanitários PNE",null,"un",null,"Pini 15.101.000050.SER Adaptada","",null,""]
[null,null,null,null,null,null,"",null,""]
[null,null,"Eletricista com encargos complementares","h",0.28999999999999998,"Pini 15.101.000050.SER",19.55,"Sinapi 88264",5.67,{"$f":"SUM(I1211:I1213)","v":344.97999999999996}]
[null,null,"Auxiliar de eletricista com encargos complementares","h",0.28999999999999998,"Pini 15.101.000050.SER",15.22,"Sinapi 88247",4.41]
[null,null,"Alarme de emergência audiovisual intermitente com fio. Ref. Planeta Acessível Alarme PCD ou AbaFire AFSAVPNE + AbaFire AFAMPNE ","un ",1,"Pini 15.101.000050.SER",334.9,"Pesquisa de Preços",334.9]
[null,null,null,null,null,null,"",null,""]
["SF-00217","Barra de apoio 40cm – Linha Acessibilidade",null,"un",null,"Pini 26.104.000060.SER Adaptada","",null,{"$f":"IF(ISNUMBER(G1215),ROUND(E1215*G1215,2),\"\")","v":""}]
[null,null,null,null,null,null,"",null,""]
[null,null,"Barra de apoio com comprimento de 405mm e espaçamento de 66mm da parede, barra com bitola de 32m, em aço escovado","un ",1,"Pini 26.104.000060.SER",73.62,"Pesquisa de Preços",73.62,{"$f":"SUM(I1217:I1220)","v":109.67000000000002}]
[null,null,"Bucha de nylon, diametro do furo 8 mm, comprimento 40 mm, com parafuso de rosca soberba, cabeca chata, fenda simples, 4,8 x 50 mm","un ",6,"Pini 26.104.000060.SER",0.42,"Sinapi 4350",2.52]
[null,null,"Pedreiro com Encargos Complementares","h",1,"Pini 26.104.000060.SER",19.32,"Sinapi 88309",19.32]
[null,null,"Servente com Encargos Complementares","h",1,"Pini 26.104.000060.SER",14.21,"Sinapi 88316",14.21]
[null,null,null,null,null,null,"",null,""]
["SF-00218","Barra de apoio 70cm – Linha Acessibilidade",null,"un",null,"Pini 26.104.000060.SER Adaptada","",null,""]
[null,null,null,null,null,null,"",null,""]
[null,null,"Barra de apoio com comprimento de 705mm e espaçamento de 66mm da parede, barra com bitola de 32mm em aço escovado","un ",1,"Pini 26.104.000060.SER",91.95,"Pesquisa de Preços",91.95,{"$f":"SUM(I1224:I1227)","v":128}]
[null,null,"Bucha de nylon, diametro do furo 8 mm, comprimento 40 mm, com parafuso de rosca soberba, cabeca chata, fenda simples, 4,8 x 50 mm","un ",6,"Pini 26.104.000060.SER",0.42,"Sinapi 4350",2.52]
[null,null,"Pedreiro com Encargos Complementares","h",1,"Pini 26.104.000060.SER",19.32,"Sinapi 88309",19.32]
[null,null,"Servente com Encargos Complementares","h",1,"Pini 26.104.000060.SER",14.21,"Sinapi 88316",14.21]
[null,null,null,null,null,null,"",null,""]
["SF-00219","Barra de apoio 80cm – Linha Acessibilidade",null,"un",null,"Pini 26.104.000060.SER Adaptada","",null,""]
[null,null,null,null,null,null,"",null,""]
[null,null,"Barra de apoio linha conforto com comprimento de 805mm e espaçamento de 66mm da parede, barra com bitola de 32mm em aço escovado","un ",1,"Pini 26.104.000060.SER",83.85,"Pesquisa de Preços",83.85,{"$f":"SUM(I1231:I1234)","v":119.9}]
[null,null,"Bucha de nylon, diametro do furo 8 mm, comprimento 40 mm, com parafuso de rosca soberba, cabeca chata, fenda simples, 4,8 x 50 mm","un ",6,"Pini 26.104.000060.SER",0.42,"Sinapi 4350",2.52]
[null,null,"Pedreiro com Encargos Complementares","h",1,"Pini 26.104.000060.SER",19.32,"Sinapi 88309",19.32]
[null,null,"Servente com Encargos Complementares","h",1,"Pini 26.104.000060.SER",14.21,"Sinapi 88316",14.21]
[null,null,null,null,null,null,"",null,""]
["SF-00220","Barra de apoio lateral fixa 30cm – Linha Acessibilidade",null,"un",null,"Pini 26.104.000060.SER Adaptada","",null,""]
[null,null,null,null,null,null,"",null,""]
[null,null,"Pedreiro com Encargos Complementares","h",1,"Pini 26.104.000060.SER",19.32,"Sinapi 88309",19.32,{"$f":"SUM(I1238:I1241)","v":134.9}]
[null,null,"Servente com Encargos Complementares","h",1,"Pini 26.104.000060.SER",14.21,"Sinapi 88316",14.21]
[null,null,"Barra de apoio lateral fixa, com 303mm de comprimento, com a bitola de 32mm e em aço escovado","un",1,"Pini 26.104.000050.SER Adaptada",98.85,"Pesquisa de Preços",98.85]
[null,null,"Bucha de nylon, diametro do furo 8 mm, comprimento 40 mm, com parafuso de rosca soberba, cabeca chata, fenda simples, 4,8 x 50 mm","un ",6,"Pini 26.104.000060.SER",0.42,"Sinapi 4350",2.52]
[null,null,null,null,null,null,"",null,""]
["SF-00221","Lavatório suspenso – Linha Acessibilidade",null,"un",null,"Sinapi 86904 Adaptada","",null,""]
[null,null,null,null,null,null,"",null,""]
[null,null,"Lavatório para instalação com coluna suspensa, para apoio à pessoa com deficiência. Ref.: Modelo L.39.17 – Linha Spot – Deca","un ",1,"Sinapi 86904",139.9,"Pesquisa de Preços",139.9,{"$f":"SUM(I1245:I1249)","v":173.70999999999998}]
[null,null,"Parafuso niquelado 3 1/2\" com acabamento cromado para fixar peca sanitaria, inclui porca cega, arruela e bucha de nylon tamanho S-8","un ",2,"Sinapi 86904",11.09,"Sinapi 4351",22.18]
[null,null,"Rejunte epoxi branco","kg",5.0700000000000002E-2,"Sinapi 86904",30.3,"Sinapi 37329",1.54]
[null,null,"Encanador ou Bombeiro Hidráulico com Encargos Complementares","h",0.39,"Sinapi 86904",18.95,"Sinapi 88267",7.39]
[null,null,"Servente com Encargos Complementares","h",0.19,"Sinapi 86904",14.21,"Sinapi 88316",2.7]
[null,null,null,null,null,null,"",null,""]
["SF-00222","Lavatório suspenso com Coluna – Linha Acessibilidade",null,"un",null,"Sinapi 86903 Adaptada","",null,""]
[null,null,null,null,null,null,"",null,""]
[null,null,"Encanador ou Bombeiro Hidráulico com Encargos Complementares","h",1.47,"Sinapi 86903",18.95,"Sinapi 88267",27.86,{"$f":"SUM(I1253:I1258)","v":368.93}]
[null,null,"Servente com Encargos Complementares","h",0.65,"Sinapi 86903",14.21,"Sinapi 88316",9.24]
[null,null,"Lavatório para instalação com coluna suspensa, para apoio à pessoa com deficiência. Ref.: Modelo L.39.17 – Linha Spot – Deca","un ",1,"Sinapi 86903",139.9,"Pesquisa de Preços",139.9]
[null,null,"Parafuso niquelado 3 1/2\" com acabamento cromado para fixar peca sanitaria, inclui porca cega, arruela e bucha de nylon tamanho S-8","un ",6,"Sinapi 86903",11.09,"Sinapi 4351",66.540000000000006]
[null,null,"Rejunte epoxi branco","kg",5.0700000000000002E-2,"Sinapi 86903",30.3,"Sinapi 37329",1.54]
[null,null,"Coluna suspensa para lavatório para apoio à pessoa com deficiência. Ref..: Deca Spot CS.39.17","un",1,"Sinapi 86903",123.85,"Pesquisa de Preços",123.85]
[null,null,null,null,null,null,"",null,""]
["SF-00223","Cabide – Linha Administrativa",null,"un",null,"Sinapi 95542 Adaptada","",null,""]
[null,null,null,null,null,null,"",null,""]
[null,null,"Cabide, cromado. Ref.: Modelo 2060.C.FLX – Linha Flex – Deca","un ",1,"Sinapi 95542",47.53,"Pesquisa de Preços",47.53,{"$f":"SUM(I1262:I1263)","v":50.93}]
[null,null,"Fixação utilizando parafuso e bucha de nylon, somente mão de obra. af_10/2016","un ",1,"Sinapi 95542",3.4,"Sinapi 95541",3.4]
[null,null,null,null,null,null,"",null,""]
["SF-00224","Papeleira – Linha Administrativa",null,"un",null,"Sinapi 95542 Adaptada","",null,""]
[null,null,null,null,null,null,"",null,""]
[null,null,"Papeleira, cromada. Ref.: Modelo 2020.C.FLX – Linha Flex – Deca","un ",1,"Sinapi 95542",89.61,"Pesquisa de Preços",89.61,{"$f":"SUM(I1267:I1268)","v":93.01}]
[null,null,"Fixação utilizando parafuso e bucha de nylon, somente mão de obra. af_10/2016","un ",1,"Sinapi 95542",3.4,"Sinapi 95541",3.4]
[null,null,null,null,null,null,"",null,""]
["SF-00225","Porta toalha argola – Linha Administrativa",null,"un",null,"Sinapi 95542 Adaptada","",null,""]
[null,null,null,null,null,null,"",null,""]
[null,null,"Porta-toalha em argola, cromado. Ref.: Modelo 2050.C.FLX – Linha Flex – Deca","un ",1,"Sinapi 95542",96.67,"Pesquisa de Preços",96.67,{"$f":"SUM(I1272:I1273)","v":100.07000000000001}]
[null,null,"Fixação utilizando parafuso e bucha de nylon, somente mão de obra. af_10/2016","un ",1,"Sinapi 95542",3.4,"Sinapi 95541",3.4]
[null,null,null,null,null,null,"",null,""]
["SF-00226","Porta toalha barra – Linha Administrativa",null,"un",null,"Sinapi 95542 Adaptada","",null,""]
[null,null,null,null,null,null,"",null,""]
[null,null,"Porta-toalha em barra, cromado. Ref.: Modelo 2040.C.FLX – Linha Flex – Deca","un ",1,"Sinapi 95542",112.86,"Pesquisa de Preços",112.86,{"$f":"SUM(I1277:I1278)","v":116.26}]
[null,null,"Fixação utilizando parafuso e bucha de nylon, somente mão de obra. af_10/2016","un ",1,"Sinapi 95542",3.4,"Sinapi 95541",3.4]
[null,null,null,null,null,null,"",null,{"$f":"IF(ISNUMBER(G1279),ROUND(E1279*G1279,2),\"\")","v":""}]
["SF-00227","Caixa 4x2 de embutir para alvenaria",null,"un",null,"Sinapi 91941","",null,""]
[null,null,null,null,null,null,"",null,""]
[null,null,"Auxiliar de eletricista com encargos complementares","h",0.14499999999999999,"Sinapi 91941",15.22,"Sinapi 88247",2.21,{"$f":"SUM(I1282:I1285)","v":6.86}]
[null,null,"Eletricista com encargos complementares","h",0.14499999999999999,"Sinapi 91941",19.55,"Sinapi 88264",2.83]
[null,null,"Argamassa traço 1:3 (cimento e areia média), preparo manual. AF_08/2014","m3",8.9999999999999998E-4,"Sinapi 91941",409.51,"Sinapi 88629",0.37]
[null,null,"Caixa de passagem, em PVC, de 4\" x 2\", para eletroduto flexivel corrugado","un",1,"Sinapi 91941",1.45,"Sinapi 1872",1.45]
[null,null,null,null,null,null,"",null,""]
["SF-00228","Caixa 4x2 para drywall",null,"un",null,"Sinapi 91941 Adaptada","",null,""]
[null,null,null,null,null,null,"",null,""]
[null,null,"Auxiliar de eletricista com encargos complementares","h",0.14499999999999999,"Sinapi 91941",15.22,"Sinapi 88247",2.21,{"$f":"SUM(I1289:I1291)","v":9.61}]
[null,null,"Eletricista com encargos complementares","h",0.14499999999999999,"Sinapi 91941",19.55,"Sinapi 88264",2.83]
[null,null,"Caixa 4x2 para drywall. Ref.: Tigre Caixa de Embutir Dryfix 4’’x2’’ (código 21007013)","un",1,"Sinapi 91941",4.57,"Pesquisa de Preços",4.57]
[null,null,null,null,null,null,"",null,""]
["SF-00229","Caixa 4x4 de embutir para alvenaria",null,"un",null,"Sinapi 91944","",null,""]
[null,null,null,null,null,null,"",null,""]
[null,null,"Auxiliar de eletricista com encargos complementares","h",0.16600000000000001,"Sinapi 91944",15.22,"Sinapi 88247",2.5299999999999998,{"$f":"SUM(I1295:I1298)","v":9.14}]
[null,null,"Eletricista com encargos complementares","h",0.16600000000000001,"Sinapi 91944",19.55,"Sinapi 88264",3.25]
[null,null,"Argamassa traço 1:3 (cimento e areia média), preparo manual. AF_08/2014","m3",1.1999999999999999E-3,"Sinapi 91944",409.51,"Sinapi 88629",0.49]
[null,null,"Caixa de passagem, em PVC, de 4\" x 4\", para eletroduto flexivel corrugado","un",1,"Sinapi 91944",2.87,"Sinapi 1873",2.87]
[null,null,null,null,null,null,"",null,""]
["SF-00230","Caixa 4x4 para drywall",null,"un",null,"Sinapi 91944 Adaptada","",null,""]
[null,null,null,null,null,null,"",null,""]
[null,null,"Auxiliar de eletricista com encargos complementares","h",0.16600000000000001,"Sinapi 91944",15.22,"Sinapi 88247",2.5299999999999998,{"$f":"SUM(I1302:I1304)","v":11.899999999999999}]
[null,null,"Eletricista com encargos complementares","h",0.16600000000000001,"Sinapi 91944",19.55,"Sinapi 88264",3.25]
[null,null,"Caixa 4x4 para drywall. Ref.: Tigre Caixa de Embutir Dryfix 4’’x4’’ (código 21007110)","un",1,"Sinapi 91944",6.12,"Pesquisa de Preços",6.12]
[null,null,null,null,null,null,"",null,""]
["SF-00231","Caixa de passagem em alumínio 100x100x50mm",null,"un",null,"Sinapi 83366 Adaptada","",null,""]
[null,null,null,null,null,null,"",null,""]
[null,null,"Auxiliar de eletricista com encargos complementares","h",{"$f":"1.25*(3/4)","v":0.9375},"Sinapi 83366 Adaptada",15.22,"Sinapi 88247",14.27,{"$f":"SUM(I1308:I1310)","v":54.599999999999994}]
[null,null,"Eletricista com encargos complementares","h",{"$f":"1.25*(3/4)","v":0.9375},"Sinapi 83366 Adaptada",19.55,"Sinapi 88264",18.329999999999998]
[null,null,"Caixa de passagem em alumínio c/ tampa, 100x100x50mm. Ref.: Daisa CDT 10; Wetzel CP-1010-6","m",1,"Sinapi 83366",22,"Pesquisa de Preços",22]
[null,null,null,null,null,null,"",null,""]
["SF-00232","Caixa de passagem em alumínio 200x200x100mm",null,"un",null,"Sinapi 83366 Adaptada","",null,""]
[null,null,null,null,null,null,"",null,""]
[null,null,"Auxiliar de eletricista com encargos complementares","h",1.25,"Sinapi 83366 Adaptada",15.22,"Sinapi 88247",19.03,{"$f":"SUM(I1314:I1316)","v":90.18}]
[null,null,"Eletricista com encargos complementares","h",1.25,"Sinapi 83366 Adaptada",19.55,"Sinapi 88264",24.44]
[null,null,"Caixa de passagem em alumínio c/ tampa, 200x200x100mm. Ref.: Daisa CDT 20; Wetzel CP-2020-10","m",1,"Sinapi 83366",46.71,"Pesquisa de Preços",46.71]
[null,null,null,null,null,null,"",null,""]
["SF-00233","Caixa de passagem em PVC 150x150x75mm",null,"un",null,"Sinapi 83366 Adaptada","",null,""]
[null,null,null,null,null,null,"",null,""]
[null,null,"Eletricista com encargos complementares","h",1.25,"Sinapi 83366",19.55,"Sinapi 88264",24.44,{"$f":"SUM(I1320:I1322)","v":58.180000000000007}]
[null,null,"Servente com Encargos Complementares","h",1.25,"Sinapi 83366",14.21,"Sinapi 88316",17.760000000000002]
[null,null,"Caixa de passagem de parede, de embutir, em PVC, dimensoes *150 x 150 x 75* mm","un",1,"Sinapi 83366",15.98,"Sinapi 39811",15.98]
[null,null,null,null,null,null,"",null,""]
["SF-00234","Caixa para piso elevado",null,"un",null,"Sinapi 83366 Adaptada","",null,""]
[null,null,null,null,null,null,"",null,""]
[null,null,"Eletricista com encargos complementares","h",{"$f":"1.25","v":1.25},"Sinapi 83366",19.55,"Sinapi 88264",24.44,{"$f":"SUM(I1326:I1328)","v":241.17}]
[null,null,"Auxiliar de eletricista com encargos complementares","h",{"$f":"1.25","v":1.25},"Sinapi 83366",15.22,"Sinapi 88247",19.03]
[null,null,"Caixa para piso elevado, 170 mm x 170 mm x 70 mm (dimensões aproximadas), incluindo módulos de tomadas 2P+T (fêmea). Ref.: Caixa: Dutotec DT 72921.00; Engeduto CPE MD 18 SR; Pisoag MOD-2702","un",1,"Sinapi 83366",197.7,"Pesquisa de Preços",197.7]
[null,null,null,null,null,null,"",null,""]
["SF-00235","Canaleta em alumínio aparente 73mmx25mm",null,"m",null,"Pini 16.111.000015.SER Adaptada","",null,""]
[null,null,null,null,null,null,"",null,""]
[null,null,"Canaleta em alumínio com tampa, divisória interna, 73x25mm, incluindo curvas, conexões e acessórios de fixação. Ref.: Canaleta: Dutotec DT 12241.00 (tipo D), tampa Dutotec DT 15040.00","m",1.1499999999999999,"Pini 16.111.000015.SER",76.63,"Pesquisa de Preços",88.12,{"$f":"SUM(I1332:I1334)","v":94.38}]
[null,null,"Auxiliar de eletricista com encargos complementares","h",0.18,"Pini 16.111.000015.SER",15.22,"Sinapi 88247",2.74]
[null,null,"Eletricista com encargos complementares","h",0.18,"Pini 16.111.000015.SER",19.55,"Sinapi 88264",3.52]
[null,null,null,null,null,null,"",null,""]
["SF-00236","Condulete de alumínio de 1’’",null,"un",null,"Sinapi 95802","",null,""]
[null,null,null,null,null,null,"",null,""]
[null,null,"Auxiliar de eletricista com encargos complementares","h",0.53849999999999998,"Sinapi 95802",15.22,"Sinapi 88247",8.1999999999999993,{"$f":"SUM(I1338:I1341)","v":29.369999999999997}]
[null,null,"Eletricista com encargos complementares","h",0.53849999999999998,"Sinapi 95802",19.55,"Sinapi 88264",10.53]
[null,null,"Bucha de nylon sem aba S6, com parafuso de 4,20 x 40 mm em aco zincado com rosca soberba, cabeca chata e fenda Phillips","un",2,"Sinapi 95802",0.18,"Sinapi 11950",0.36]
[null,null,"Condulete de aluminio tipo X, para eletroduto roscavel de 1\", com tampa cega","un",1,"Sinapi 95802",10.28,"Sinapi 2581",10.28]
[null,null,null,null,null,null,"",null,""]
["SF-00237","Eletrocalha 100x50 mm",null,"m",null,"Pini 16.113.000350.SER Adaptada","",null,{"$f":"IF(ISNUMBER(G1343),ROUND(E1343*G1343,2),\"\")","v":""}]
[null,null,null,null,null,null,"",null,""]
[null,null,"Eletricista com encargos complementares","h",0.45,"Pini 16.113.000350.SER",19.55,"Sinapi 88264",8.8000000000000007,{"$f":"SUM(I1345:I1356)","v":46.76}]
[null,null,"Auxiliar de eletricista com encargos complementares","h",0.45,"Pini 16.113.000350.SER",15.22,"Sinapi 88247",6.85]
[null,null,"Tiro com pistola para fixação de pino Ø 1/4\" em concreto, inclusive cartucho e pino","un ",0.67,"Pini 16.113.000350.SER",6.22,"Pini 16.113.000350.MAT",4.17]
[null,null,"Eletrocalha perfurada (cabos elétricos) ou lisa (dados), tipo \"U\", de aço galvanizado eletrolítico 100 x 50 mm, fabricado em chapa #20 (0,95 mm)","m",1.05,"Pini 16.113.000350.SER",10.8,"Pesquisa de preços",11.34]
[null,null,"Barra roscada em aço Ø 1/4\", comprimento 1 m, bicromatizada ou zincada","m",0.8,"Pini 16.113.000350.SER",3.01,"Pini 16.113.000350.MAT",2.41]
[null,null,"PORCA ZINCADA, SEXTAVADA, DIAMETRO 1/4\"","un ",4.0033000000000003,"Pini 16.113.000350.SER",0.2,"Sinapi 39997",0.8]
[null,null,"Arruela em aço galvanizado Ø 1/4\"","un ",4.0033000000000003,"Pini 16.113.000350.SER",0.1,"Pini 16.113.000350.MAT",0.4]
[null,null,"Suporte suspensão vertical para eletrocalha 100 x 50 mm largura x aba","un ",0.67,"Pini 16.113.000350.SER",2.59,"Pini 16.113.000350.MAT",1.74]
[null,null,"Prolongador para tirante rosqueado de 1/4\" x 50 mm","un ",1.05,"Pini 16.113.000350.SER",2.72,"Pini 16.113.000350.MAT",2.86]
[null,null,"Parafuso lentilha 1/4 x 1/2\"","un",2.67,"Pini 16.113.000350.SER",0.5,"Pini 16.113.000350.MAT",1.34]
[null,null,"Tala auto portante para emenda 50 mm","un ",0.66669999999999996,"Pini 16.113.000350.SER",2.86,"Pini 16.113.000350.MAT",1.91]
[null,null,"Tampa de encaixe para eletrocalha aço galvanizado perfurada ou lisa, 100 mm","m",1.05,"Pini 16.113.000350.SER",3.94,"Pesquisa de preços",4.1399999999999997]
[null,null,null,null,null,null,"",null,""]
["SF-00238","Eletrocalha 200x100 mm",null,"m",null,"Pini 16.113.000377.SER Adaptada","",null,""]
[null,null,null,null,null,null,"",null,""]
[null,null,"Eletricista com encargos complementares","h",0.6,"Pini 16.113.000377.SER",19.55,"Sinapi 88264",11.73,{"$f":"SUM(I1360:I1371)","v":81.91}]
[null,null,"Auxiliar de eletricista com encargos complementares","h",0.6,"Pini 16.113.000377.SER",15.22,"Sinapi 88247",9.1300000000000008]
[null,null,"Tiro com pistola para fixação de pino Ø 1/4\" em concreto, inclusive cartucho e pino","un ",1.3332999999999999,"Pini 16.113.000377.SER",6.22,"Pini 16.113.000377.MAT",8.2899999999999991]
[null,null,"Eletrocalha perfurada (cabos elétricos) ou lisa (dados), tipo \"U\", de aço galvanizado eletrolítico 200 x 100 mm, fabricado em chapa #18 (1,25 mm)","m",1.05,"Pini 16.113.000377.SER",26.7,"Pesquisa de preços",28.04]
[null,null,"Barra roscada em aço Ø 1/4\", comprimento 1 m, bicromatizada ou zincada","m",1.6,"Pini 16.113.000377.SER",3.01,"Pini 16.113.000377.MAT",4.82]
[null,null,"PORCA ZINCADA, SEXTAVADA, DIAMETRO 1/4\"","un ",5.3367000000000004,"Pini 16.113.000377.SER",0.2,"Sinapi 39997",1.07]
[null,null,"Arruela em aço galvanizado Ø 1/4\"","un ",5.34,"Pini 16.113.000377.SER",0.1,"Pini 16.113.000377.MAT",0.53]
[null,null,"Suporte suspensão omega para eletrocalha 200 x 100mm largura x aba","un ",0.67,"Pini 16.113.000377.SER",3.76,"Pini 16.113.000377.MAT",2.52]
[null,null,"Prolongador para tirante rosqueado de 1/4\" x 50 mm","un ",1.3332999999999999,"Pini 16.113.000377.SER",2.72,"Pini 16.113.000377.MAT",3.63]
[null,null,"Parafuso lentilha 1/4 x 1/2\"","un",2.67,"Pini 16.113.000377.SER",0.5,"Pini 16.113.000377.MAT",1.34]
[null,null,"Tala auto portante para emenda 100 mm","un ",0.67,"Pini 16.113.000377.SER",5.13,"Pini 16.113.000377.MAT",3.44]
[null,null,"Tampa de encaixe para eletrocalha aço galvanizado perfurada ou lisa, 200 mm","m",1.05,"Pini 16.113.000377.SER",7.02,"Pesquisa de preços",7.37]
[null,null,null,null,null,null,"",null,""]
["SF-00239","Eletrocalha 200x50 mm",null,"m",null,"Pini 16.113.000356.SER Adaptada","",null,""]
[null,null,null,null,null,null,"",null,""]
[null,null,"Eletricista com encargos complementares","h",0.5,"Pini 16.113.000356.SER",19.55,"Sinapi 88264",9.7799999999999994,{"$f":"SUM(I1375:I1386)","v":69.410000000000011}]
[null,null,"Auxiliar de eletricista com encargos complementares","h",0.5,"Pini 16.113.000356.SER",15.22,"Sinapi 88247",7.61]
[null,null,"Tiro com pistola para fixação de pino Ø 1/4\" em concreto, inclusive cartucho e pino","un ",1.3332999999999999,"Pini 16.113.000356.SER",6.22,"Pini 16.113.000356.MAT",8.2899999999999991]
[null,null,"Eletrocalha perfurada (cabos elétricos) ou lisa (dados), tipo \"U\", de aço galvanizado eletrolítico 200 x 50 mm, fabricado em chapa #18 (1,25 mm)","m",1.05,"Pini 16.113.000356.SER",19.98,"Pesquisa de preços",20.98]
[null,null,"Barra roscada em aço Ø 1/4\", comprimento 1 m, bicromatizada ou zincada","m",1.6,"Pini 16.113.000356.SER",3.01,"Pini 16.113.000356.MAT",4.82]
[null,null,"PORCA ZINCADA, SEXTAVADA, DIAMETRO 1/4\"","un ",5.3367000000000004,"Pini 16.113.000350.SER",0.2,"Sinapi 39997",1.07]
[null,null,"Arruela em aço galvanizado Ø 1/4\"","un ",5.34,"Pini 16.113.000356.SER",0.1,"Pini 16.113.000356.MAT",0.53]
[null,null,"Suporte suspensão omega para eletrocalha 200 x 50 mm largura x aba","un ",0.67,"Pini 16.113.000356.SER",3.09,"Pini 16.113.000356.MAT",2.0699999999999998]
[null,null,"Prolongador para tirante rosqueado de 1/4\" x 50 mm","un ",1.3332999999999999,"Pini 16.113.000356.SER",2.72,"Pini 16.113.000356.MAT",3.63]
[null,null,"Parafuso lentilha 1/4 x 1/2\"","un",2.67,"Pini 16.113.000356.SER",0.5,"Pini 16.113.000356.MAT",1.34]
[null,null,"Tala auto portante para emenda 50 mm","un ",0.67,"Pini 16.113.000356.SER",2.86,"Pini 16.113.000356.MAT",1.92]
[null,null,"Tampa de encaixe para eletrocalha aço galvanizado perfurada ou lisa, 200 mm","m",1.05,"Pini 16.113.000356.SER",7.02,"Pesquisa de preços",7.37]
[null,null,null,null,null,null,"",null,""]
["SF-00240","Eletrocalha 300x100 mm",null,"m",null,"Pini 16.113.000380.SER Adaptada","",null,""]
[null,null,null,null,null,null,"",null,""]
[null,null,"Eletricista com encargos complementares","h",0.65,"Pini 16.113.000380.SER",19.55,"Sinapi 88264",12.71,{"$f":"SUM(I1390:I1401)","v":94.36999999999999}]
[null,null,"Auxiliar de eletricista com encargos complementares","h",0.65,"Pini 16.113.000380.SER",15.22,"Sinapi 88247",9.89]
[null,null,"Tiro com pistola para fixação de pino Ø 1/4\" em concreto, inclusive cartucho e pino","un ",1.3332999999999999,"Pini 16.113.000380.SER",6.22,"Pini 16.113.000380.MAT",8.2899999999999991]
[null,null,"Eletrocalha perfurada (cabos elétricos) ou lisa (dados), tipo \"U\", de aço galvanizado eletrolítico 300 x 100 mm, fabricado em chapa #18 (1,25 mm)","m",1.05,"Pini 16.113.000380.SER",33.299999999999997,"Pesquisa de preços",34.97]
[null,null,"Barra roscada em aço Ø 1/4\", comprimento 1 m, bicromatizada ou zincada","m",1.6,"Pini 16.113.000380.SER",3.01,"Pini 16.113.000380.MAT",4.82]
[null,null,"PORCA ZINCADA, SEXTAVADA, DIAMETRO 1/4\"","un ",5.3367000000000004,"Pini 16.113.000350.SER",0.2,"Sinapi 39997",1.07]
[null,null,"Arruela em aço galvanizado Ø 1/4\"","un ",5.34,"Pini 16.113.000380.SER",0.1,"Pini 16.113.000380.MAT",0.53]
[null,null,"Suporte suspensão omega para eletrocalha 300 x 100 mm largura x aba","un ",0.67,"Pini 16.113.000380.SER",4.58,"Pini 16.113.000380.MAT",3.07]
[null,null,"Prolongador para tirante rosqueado de 1/4\" x 50 mm","un ",1.3332999999999999,"Pini 16.113.000380.SER",2.72,"Pini 16.113.000380.MAT",3.63]
[null,null,"Parafuso lentilha 1/4 x 1/2\"","un",2.67,"Pini 16.113.000380.SER",0.5,"Pini 16.113.000380.MAT",1.34]
[null,null,"Tala auto portante para emenda 100 mm","un ",0.67,"Pini 16.113.000380.SER",5.13,"Pini 16.113.000380.MAT",3.44]
[null,null,"Tampa de encaixe para eletrocalha aço galvanizado perfurada ou lisa, 300 mm","m",1.05,"Pini 16.113.000380.SER",10.1,"Pesquisa de preços",10.61]
[null,null,null,null,null,null,"",null,""]
["SF-00241","Eletrocalha 300x50 mm",null,"m",null,"Pini 16.113.000359.SER Adaptada","",null,""]
[null,null,null,null,null,null,"",null,""]
[null,null,"Eletricista com encargos complementares","h",0.55000000000000004,"Pini 16.113.000359.SER",19.55,"Sinapi 88264",10.75,{"$f":"SUM(I1405:I1416)","v":81.819999999999993}]
[null,null,"Auxiliar de eletricista com encargos complementares","h",0.55000000000000004,"Pini 16.113.000359.SER",15.22,"Sinapi 88247",8.3699999999999992]
[null,null,"Tiro com pistola para fixação de pino Ø 1/4\" em concreto, inclusive cartucho e pino","un ",1.3332999999999999,"Pini 16.113.000359.SER",6.22,"Pini 16.113.000359.MAT",{"$f":"IF(ISNUMBER(G1407),ROUND(E1407*G1407,2),\"\")","v":8.2899999999999991}]
[null,null,"Eletrocalha perfurada (cabos elétricos) ou lisa (dados), tipo \"U\", de aço galvanizado eletrolítico 300 x 050 mm, fabricado em chapa #18 (1,25 mm)","m",1.05,"Pini 16.113.000359.SER",26.64,"Pesquisa de preços",27.97]
[null,null,"Barra roscada em aço Ø 1/4\", comprimento 1 m, bicromatizada ou zincada","m",1.6,"Pini 16.113.000359.SER",3.01,"Pini 16.113.000359.MAT",4.82]
[null,null,"PORCA ZINCADA, SEXTAVADA, DIAMETRO 1/4\"","un ",5.3367000000000004,"Pini 16.113.000350.SER",0.2,"Sinapi 39997",1.07]
[null,null,"Arruela em aço galvanizado Ø 1/4\"","un ",5.34,"Pini 16.113.000359.SER",0.1,"Pini 16.113.000359.MAT",0.53]
[null,null,"Suporte suspensão omega para eletrocalha 300 x 50 mm largura x aba","un ",0.67,"Pini 16.113.000359.SER",3.76,"Pini 16.113.000359.MAT",2.52]
[null,null,"Prolongador para tirante rosqueado de 1/4\" x 50 mm","un ",1.3332999999999999,"Pini 16.113.000359.SER",2.72,"Pini 16.113.000359.MAT",3.63]
[null,null,"Parafuso lentilha 1/4 x 1/2\"","un",2.67,"Pini 16.113.000359.SER",0.5,"Pini 16.113.000359.MAT",1.34]
[null,null,"Tala auto portante para emenda 50 mm","un ",0.67,"Pini 16.113.000359.SER",2.86,"Pini 16.113.000359.MAT",1.92]
[null,null,"Tampa de encaixe para eletrocalha aço galvanizado perfurada ou lisa, 300 mm","m",1.05,"Pini 16.113.000359.SER",10.1,"Pesquisa de preços",10.61]
[null,null,null,null,null,null,"",null,""]
["SF-00242","Eletrocalha 400x50 mm",null,"m",null,"Pini 16.113.000362.SER Adaptada","",null,""]
[null,null,null,null,null,null,"",null,""]
[null,null,"Eletricista com encargos complementares","h",0.55000000000000004,"Pini 16.113.000362.SER",19.55,"Sinapi 88264",10.75,{"$f":"SUM(I1420:I1431)","v":106.34999999999998}]
[null,null,"Auxiliar de eletricista com encargos complementares","h",0.55000000000000004,"Pini 16.113.000362.SER",15.22,"Sinapi 88247",8.3699999999999992]
[null,null,"Tiro com pistola para fixação de pino Ø 1/4\" em concreto, inclusive cartucho e pino","un ",1.3332999999999999,"Pini 16.113.000362.SER",6.22,"Pini 16.113.000362.MAT",8.2899999999999991]
[null,null,"Eletrocalha perfurada (cabos elétricos) ou lisa (dados), tipo \"U\", de aço galvanizado eletrolítico 400 x 050 mm, fabricado em chapa #16 (1,55 mm)","m",1.05,"Pini 16.113.000362.SER",45,"Pesquisa de preços",47.25]
[null,null,"Barra roscada em aço Ø 1/4\", comprimento 1 m, bicromatizada ou zincada","m",1.6,"Pini 16.113.000362.SER",3.01,"Pini 16.113.000362.MAT",4.82]
[null,null,"PORCA ZINCADA, SEXTAVADA, DIAMETRO 1/4\"","un ",5.3367000000000004,"Pini 16.113.000350.SER",0.2,"Sinapi 39997",1.07]
[null,null,"Arruela em aço galvanizado Ø 1/4\"","un ",5.34,"Pini 16.113.000362.SER",0.1,"Pini 16.113.000362.MAT",0.53]
[null,null,"Suporte suspensão omega para eletrocalha 400 x 50 mm largura x aba","un ",0.67,"Pini 16.113.000362.SER",3.92,"Pini 16.113.000362.MAT",2.63]
[null,null,"Prolongador para tirante rosqueado de 1/4\" x 50 mm","un ",1.3332999999999999,"Pini 16.113.000362.SER",2.72,"Pini 16.113.000362.MAT",3.63]
[null,null,"Parafuso lentilha 1/4 x 1/2\"","un",2.67,"Pini 16.113.000362.SER",0.5,"Pini 16.113.000362.MAT",1.34]
[null,null,"Tala auto portante para emenda 50 mm","un ",0.67,"Pini 16.113.000362.SER",2.86,"Pini 16.113.000362.MAT",1.92]
[null,null,"Tampa de encaixe para eletrocalha aço galvanizado perfurada ou lisa, 400 mm","m",1.05,"Pini 16.113.000362.SER",15,"Pesquisa de preços",15.75]
[null,null,null,null,null,null,"",null,""]
["SF-00243","Eletrocalha 50x50 mm",null,"m",null,"Pini 16.113.000344.SER Adaptada","",null,""]
[null,null,null,null,null,null,"",null,""]
[null,null,"Eletricista com encargos complementares","h",0.45,"Pini 16.113.000344.SER",19.55,"Sinapi 88264",8.8000000000000007,{"$f":"SUM(I1435:I1446)","v":40.020000000000003}]
[null,null,"Auxiliar de eletricista com encargos complementares","h",0.45,"Pini 16.113.000344.SER",15.22,"Sinapi 88247",6.85]
[null,null,"Tiro com pistola para fixação de pino Ø 1/4\" em concreto, inclusive cartucho e pino","un ",0.67,"Pini 16.113.000344.SER",6.22,"Pini 16.113.000344.MAT",4.17]
[null,null,"Eletrocalha perfurada (cabos elétricos) ou lisa (dados), tipo \"U\", de aço galvanizado eletrolítico 50 x 50 mm, fabricado em chapa #22 (0,8 mm)","m",1.05,"Pini 16.113.000344.SER",6.12,"Pesquisa de preços",6.43]
[null,null,"Barra roscada em aço Ø 1/4\", comprimento 1 m, bicromatizada ou zincada","m",0.8,"Pini 16.113.000344.SER",3.01,"Pini 16.113.000344.MAT",2.41]
[null,null,"PORCA ZINCADA, SEXTAVADA, DIAMETRO 1/4\"","un ",4.0033000000000003,"Pini 16.113.000344.SER",0.2,"Sinapi 39997",0.8]
[null,null,"Arruela em aço galvanizado Ø 1/4\"","un ",4.0033000000000003,"Pini 16.113.000344.SER",0.1,"Pini 16.113.000344.MAT",0.4]
[null,null,"Suporte suspensão vertical para eletrocalha 50 x 50 mm largura x aba","un ",0.67,"Pini 16.113.000344.SER",2.29,"Pini 16.113.000344.MAT",1.53]
[null,null,"Prolongador para tirante rosqueado de 1/4\" x 50 mm","un ",1.05,"Pini 16.113.000344.SER",2.72,"Pini 16.113.000344.MAT",2.86]
[null,null,"Parafuso lentilha 1/4 x 1/2\"","un",2.67,"Pini 16.113.000344.SER",0.5,"Pini 16.113.000344.MAT",1.34]
[null,null,"Tala auto portante para emenda 50 mm","un ",0.66669999999999996,"Pini 16.113.000344.SER",2.86,"Pini 16.113.000344.MAT",1.91]
[null,null,"Tampa de encaixe para eletrocalha aço galvanizado perfurada ou lisa, 50 mm","m",1.05,"Pini 16.113.000344.SER",2.4,"Pesquisa de preços",2.52]
[null,null,null,null,null,null,"",null,""]
["SF-00244","Eletroduto de aço galvanizado de 1 1/2\"",null,"m",null,"Sinapi 95752 Adaptada","",null,""]
[null,null,null,null,null,null,"",null,""]
[null,null,"Eletroduto de aço com costura galvanização eletrolítica Ø 1 1/2\"","m",1.05,"Sinapi 95752",13.01,"Pini 16.111.000204.MAT",13.66,{"$f":"SUM(I1450:I1454)","v":30.129999999999995}]
[null,null,"Eletricista com encargos complementares","h",0.28210000000000002,"Sinapi 95752",19.55,"Sinapi 88264",5.52]
[null,null,"Auxiliar de eletricista com encargos complementares","h",0.28210000000000002,"Sinapi 95752",15.22,"Sinapi 88247",4.29]
[null,null,"Fixação de tubos verticais de PPR diâmetros menores ou iguais a 40 mm com abraçadeira metálica rígida tipo D 1/2\", fixada em perfilado em alvenaria. af_05/2015","m",2,"Sinapi 95752",1.04,"Sinapi 91173",2.08]
[null,null,"Luva de emenda para eletroduto, aço galvanizado, DN 40 mm (1 1/2''), aparente, instalada em parede - fornecimento e instalação. af_11/2016_p","un",0.33329999999999999,"Sinapi 95752",13.74,"Sinapi 95760",4.58]
[null,null,null,null,null,null,"",null,""]
["SF-00245","Eletroduto de aço galvanizado de 1 1/4\"",null,"m",null,"Sinapi 95751 Adaptada","",null,""]
[null,null,null,null,null,null,"",null,""]
[null,null,"Eletroduto de aço com costura galvanização eletrolítica Ø 1 1/4\"","m",1.05,"Sinapi 95751",10.56,"Pini 16.111.000203.MAT",11.09,{"$f":"SUM(I1458:I1462)","v":25.5}]
[null,null,"Eletricista com encargos complementares","h",0.247,"Sinapi 95751",19.55,"Sinapi 88264",4.83]
[null,null,"Auxiliar de eletricista com encargos complementares","h",0.247,"Sinapi 95751",15.22,"Sinapi 88247",3.76]
[null,null,"Fixação de tubos verticais de PPR diâmetros menores ou iguais a 40 mm com abraçadeira metálica rígida tipo D 1/2\", fixada em perfilado em alvenaria. af_05/2015","m",2,"Sinapi 95751",1.04,"Sinapi 91173",2.08]
[null,null,"Luva de emenda para eletroduto, aço galvanizado, DN 32 mm (1 1/4''), aparente, instalada em parede - fornecimento e instalação. af_11/2016_p","un",0.33329999999999999,"Sinapi 95751",11.21,"Sinapi 95759",3.74]
[null,null,null,null,null,null,"",null,""]
["SF-00246","Eletroduto de aço galvanizado de 1\"",null,"m",null,"Sinapi 95750 Adaptada","",null,""]
[null,null,null,null,null,null,"",null,""]
[null,null,"Eletroduto de aço com costura galvanização eletrolítica Ø 1\"","m",1.05,"Sinapi 95750",8.4600000000000009,"Pini 16.111.000202.MAT",8.8800000000000008,{"$f":"SUM(I1466:I1470)","v":21.430000000000003}]
[null,null,"Eletricista com encargos complementares","h",0.21629999999999999,"Sinapi 95750",19.55,"Sinapi 88264",4.2300000000000004]
[null,null,"Auxiliar de eletricista com encargos complementares","h",0.21629999999999999,"Sinapi 95750",15.22,"Sinapi 88247",3.29]
[null,null,"Fixação de tubos verticais de PPR diâmetros menores ou iguais a 40 mm com abraçadeira metálica rígida tipo D 1/2\", fixada em perfilado em alvenaria. af_05/2015","m",2,"Sinapi 95750",1.04,"Sinapi 91173",2.08]
[null,null,"Luva de emenda para eletroduto, aço galvanizado, DN 25 mm (1''), aparente, instalada em parede - fornecimento e instalação. af_11/2016_p","un",0.33329999999999999,"Sinapi 95750",8.84,"Sinapi 95758",2.95]
[null,null,null,null,null,null,"",null,{"$f":"IF(ISNUMBER(G1471),ROUND(E1471*G1471,2),\"\")","v":""}]
["SF-00247","Eletroduto de aço galvanizado de 2\"",null,"m",null,"Sinapi 95752 Adaptada","",null,""]
[null,null,null,null,null,null,"",null,""]
[null,null,"Eletroduto de aço com costura galvanização eletrolítica Ø 2\"","m",1.05,"Sinapi 95752",17.11,"Pini 16.111.000205.MAT",17.97,{"$f":"SUM(I1474:I1478)","v":37.019999999999996}]
[null,null,"Eletricista com encargos complementares","h",0.28210000000000002,"Sinapi 95752",19.55,"Sinapi 88264",5.52]
[null,null,"Auxiliar de eletricista com encargos complementares","h",0.28210000000000002,"Sinapi 95752",15.22,"Sinapi 88247",4.29]
[null,null,"FIXAÇÃO DE TUBOS VERTICAIS DE PPR DIÂMETROS MAIORES QUE 40 MM E MENORES OU IGUAIS A 75 MM COM ABRAÇADEIRA METÁLICA RÍGIDA TIPO D 1 1/2\", FIXADA EM PERFILADO EM ALVENARIA. AF_05/2015","m",2,"Sinapi 95752",2.0299999999999998,"Sinapi 91174",4.0599999999999996]
[null,null,"Luva de emenda para eletroduto, aço galvanizado, DN 50 mm (2''), aparente, instalada em parede - fornecimento e instalação. af_11/2016_p","un",0.33329999999999999,"Sinapi 95752",15.53,"Sinapi 95760 Adaptada",5.18]
[null,null,null,null,null,null,"",null,""]
["SF-00248","Eletroduto de aço galvanizado de 3/4\"",null,"m",null,"Sinapi 95749 Adaptada","",null,""]
[null,null,null,null,null,null,"",null,""]
[null,null,"Eletroduto de aço com costura galvanização eletrolítica Ø 3/4\"","m",1.05,"Sinapi 95749",5.2,"Pini 16.111.000201.MAT",5.46,{"$f":"SUM(I1482:I1486)","v":16.919999999999998}]
[null,null,"Eletricista com encargos complementares","h",0.19439999999999999,"Sinapi 95749",19.55,"Sinapi 88264",3.8]
[null,null,"Auxiliar de eletricista com encargos complementares","h",0.19439999999999999,"Sinapi 95749",15.22,"Sinapi 88247",2.96]
[null,null,"Fixação de tubos verticais de PPR diâmetros menores ou iguais a 40 mm com abraçadeira metálica rígida tipo D 1/2\", fixada em perfilado em alvenaria. af_05/2015","m",2,"Sinapi 95749",1.04,"Sinapi 91173",2.08]
[null,null,"Luva de emenda para eletroduto, aço galvanizado, DN 20 mm (3/4''), aparente, instalada em parede - fornecimento e instalação. af_11/2016_p","un",0.33329999999999999,"Sinapi 95749",7.87,"Sinapi 95757",2.62]
[null,null,null,null,null,null,"",null,""]
["SF-00249","Eletroduto de PVC Corrugado Reforçado 1'' (DE 32mm)",null,"m",null,"Sinapi 91836 Adaptada","",null,""]
[null,null,null,null,null,null,"",null,""]
[null,null,"Eletroduto PVC flexivel corrugado, reforcado, cor laranja, de 32 mm, para lajes e pisos","m",1.1000000000000001,"Sinapi 91836",4.01,"Sinapi 39245",4.41,{"$f":"SUM(I1490:I1493)","v":9.57}]
[null,null,"Eletricista com encargos complementares","h",0.09,"Sinapi 91836",19.55,"Sinapi 88264",1.76]
[null,null,"Auxiliar de eletricista com encargos complementares","h",0.09,"Sinapi 91836",15.22,"Sinapi 88247",1.37]
[null,null,"Fixação de tubos horizontais de PVC, CPVC ou cobre diâmetros menores ou iguais a 40 mm ou eletrocalhas até 150mm de largura, com abraçadeira metálica rígida tipo d 1/2\u0094, fixada em perfilado em laje. af_05/2015","m",1,"Sinapi 91836",2.0299999999999998,"Sinapi 91170",2.0299999999999998]
[null,null,null,null,null,null,"",null,""]
["SF-00250","Eletroduto de PVC Corrugado Reforçado 3/4'' (DE 25mm)",null,"m",null,"Sinapi 91834 Adaptada","",null,""]
[null,null,null,null,null,null,"",null,""]
[null,null,"Eletricista com encargos complementares","h",7.0000000000000007E-2,"Sinapi 91834",19.55,"Sinapi 88264",1.37,{"$f":"SUM(I1497:I1500)","v":6.76}]
[null,null,"Auxiliar de eletricista com encargos complementares","h",7.0000000000000007E-2,"Sinapi 91834",15.22,"Sinapi 88247",1.07]
[null,null,"Eletroduto PVC flexivel corrugado, reforcado, cor laranja, de 25 mm, para lajes e pisos","m",1.1000000000000001,"Sinapi 91834",2.08,"Sinapi 39244",2.29]
[null,null,"Fixação de tubos horizontais de PVC, CPVC ou cobre diâmetros menores ou iguais a 40 mm ou eletrocalhas até 150mm de largura, com abraçadeira metálica rígida tipo d 1/2\u0094, fixada em perfilado em laje. af_05/2015","m",1,"Sinapi 91834",2.0299999999999998,"Sinapi 91170",2.0299999999999998]
[null,null,null,null,null,null,"",null,""]
["SF-00251","Eletroduto flexível metálico com capa de PVC 1’’",null,"m",null,"Sinapi 91846 Adaptada","",null,""]
[null,null,null,null,null,null,"",null,""]
[null,null,"Eletroduto flexivel, em aco galvanizado, revestido externamente com PVC preto, diametro externo de 32 mm (1\"), tipo sealtubo","m",1.1000000000000001,"Sinapi 91846",12,"Sinapi 2501",13.2,{"$f":"SUM(I1504:I1507)","v":16.939999999999998}]
[null,null,"Arame recozido 16 BWG, 1,60 mm (0,016 kg/m)","kg",2E-3,"Sinapi 91846",10.15,"Sinapi 34562",0.02]
[null,null,"Auxiliar de eletricista com encargos complementares","h",0.107,"Sinapi 91846",15.22,"Sinapi 88247",1.63]
[null,null,"Eletricista com encargos complementares","h",0.107,"Sinapi 91846",19.55,"Sinapi 88264",2.09]
[null,null,null,null,null,null,"",null,""]
["SF-00252","Eletroduto flexível metálico com capa de PVC 3/4\"",null,"m",null,"Sinapi 91844 Adaptada","",null,""]
[null,null,null,null,null,null,"",null,""]
[null,null,"Eletroduto flexivel, em aco galvanizado, revestido externamente com PVC preto, diametro externo de 25 mm (3/4\"), tipo sealtubo","m",1.1000000000000001,"Sinapi 91844",9.14,"Sinapi 2504",10.050000000000001,{"$f":"SUM(I1511:I1514)","v":13.09}]
[null,null,"Arame recozido 16 BWG, 1,60 mm (0,016 kg/m)","kg",1.8E-3,"Sinapi 91844",10.15,"Sinapi 34562",0.02]
[null,null,"Auxiliar de eletricista com encargos complementares","h",8.6999999999999994E-2,"Sinapi 91844",15.22,"Sinapi 88247",1.32]
[null,null,"Eletricista com encargos complementares","h",8.6999999999999994E-2,"Sinapi 91844",19.55,"Sinapi 88264",1.7]
[null,null,null,null,null,null,"",null,""]
["SF-00253","Perfilado 38x38mm",null,"m",null,"Pini 16.113.000972.SER Adaptada","",null,""]
[null,null,null,null,null,null,"",null,""]
[null,null,"Perfilado perfurado em aço galvanizado # 18, 38 x 38 mm","m",1.05,"Pini 16.113.000972.SER",8.24,"Pesquisa de preços",8.65,{"$f":"SUM(I1518:I1529)","v":41.54}]
[null,null,"Auxiliar de eletricista com encargos complementares","h",0.45,"Pini 16.113.000972.SER",15.22,"Sinapi 88247",6.85]
[null,null,"Eletricista com encargos complementares","h",0.45,"Pini 16.113.000972.SER",19.55,"Sinapi 88264",8.8000000000000007]
[null,null,"Tiro com pistola para fixação de pino Ø 1/4\" em concreto, inclusive cartucho e pino","un ",0.67,"Pini 16.113.000972.SER",6.22,"Pini 16.113.000972.MAT",4.17]
[null,null,"Suporte curto para perfilado em aço galvanizado # 22, 38 mm x 100 mm","un ",0.67,"Pini 16.113.000972.SER",1.22,"Pini 16.113.000972.MAT",0.82]
[null,null,"Barra roscada em aço Ø 1/4\", comprimento 1 m, bicromatizada ou zincada","m",0.8,"Pini 16.113.000972.SER",3.01,"Pini 16.113.000972.MAT",2.41]
[null,null,"PORCA ZINCADA, SEXTAVADA, DIAMETRO 1/4\"","un ",2.6633,"Pini 16.113.000350.SER",0.2,"Sinapi 39997",0.53]
[null,null,"Arruela em aço galvanizado Ø 1/4\"","un ",2.6633,"Pini 16.113.000972.SER",0.1,"Pini 16.113.000972.MAT",0.27]
[null,null,"Prolongador para tirante rosqueado de 1/4\" x 50 mm","un ",0.67,"Pini 16.113.000972.SER",2.72,"Pini 16.113.000972.MAT",1.82]
[null,null,"Parafuso lentilha 1/4 x 1/2\"","un",1.33,"Pini 16.113.000972.SER",0.5,"Pini 16.113.000972.MAT",0.67]
[null,null,"Tala 4 furos para emenda 38 mm","un ",0.33329999999999999,"Pini 16.113.000972.SER",2.72,"Pini 16.113.000972.MAT",0.91]
[null,null,"Tampa de encaixe para perfilado em aço galvanizado 38 mm","m",1.05,"Pini 16.113.000972.SER",5.37,"Pini 16.113.000972.MAT",5.64]
[null,null,null,null,null,null,"",null,""]
["SF-00254","Espelho 4x2",null,"un",null,"Sinapi 91947","",null,""]
[null,null,null,null,null,null,"",null,""]
[null,null,"Espelho / placa de 3 postos 4\" x 2\", para instalacao de tomadas e interruptores","un",1,"Sinapi 91947",2.13,"Sinapi 38094",2.13,{"$f":"SUM(I1533:I1535)","v":4.96}]
[null,null,"Suporte de fixacao para espelho / placa 4\" x 2\", para 3 modulos, para instalacao de tomadas e interruptores (somente suporte)","un",1,"Sinapi 91947",1.1100000000000001,"Sinapi 38099",1.1100000000000001]
[null,null,"Eletricista com encargos complementares","h",8.7999999999999995E-2,"Sinapi 91947",19.55,"Sinapi 88264",{"$f":"IF(ISNUMBER(G1535),ROUND(E1535*G1535,2),\"\")","v":1.72}]
[null,null,null,null,null,null,"",null,""]
["SF-00255","Espelho 4x4",null,"un",null,"Sinapi 91951","",null,""]
[null,null,null,null,null,null,"",null,""]
[null,null,"Espelho / placa de 6 postos 4\" x 4\", para instalacao de tomadas e interruptores","un",1,"Sinapi 91951",4.34,"Sinapi 38098",4.34,{"$f":"SUM(I1539:I1541)","v":8.19}]
[null,null,"Suporte de fixacao para espelho / placa 4\" x 4\", para 6 modulos, para instalacao de tomadas e interruptores (somente suporte)","un",1,"Sinapi 91951",1.82,"Sinapi 38100",1.82]
[null,null,"Eletricista com encargos complementares","h",0.104,"Sinapi 91951",19.55,"Sinapi 88264",2.0299999999999998]
[null,null,null,null,null,null,"",null,""]
["SF-00256","Espelho cego redondo",null,"un",null,"Sinapi 91947 Adaptada","",null,""]
[null,null,null,null,null,null,"",null,""]
[null,null,"Espelho cego redondo. Ref: Tramontina Lux2 3x3 (57102/091); Pial 8530.","un",1,"Sinapi 91951",2.9,"Pesquisa de Preços",2.9,{"$f":"SUM(I1545:I1547)","v":6.75}]
[null,null,"Suporte de fixacao para espelho / placa 4\" x 4\", para 6 modulos, para instalacao de tomadas e interruptores (somente suporte)","un",1,"Sinapi 91951",1.82,"Sinapi 38100",1.82]
[null,null,"Eletricista com encargos complementares","h",0.104,"Sinapi 91951",19.55,"Sinapi 88264",2.0299999999999998]
[null,null,null,null,null,null,"",null,""]
["SF-00257","Interruptor para condulete",null,"un",null,"Pini 16.115.000201.SER Adaptada","",null,""]
[null,null,null,null,null,null,"",null,""]
[null,null,"Eletricista com encargos complementares","h",{"$f":"0.3/2","v":0.15},"Pini 16.115.000191.SER",19.55,"Sinapi 88264",2.93,{"$f":"SUM(I1551:I1554)","v":21.25}]
[null,null,"Auxiliar de eletricista com encargos complementares","h",{"$f":"0.3/2","v":0.15},"Pini 16.115.000191.SER",15.22,"Sinapi 88247",2.2799999999999998]
[null,null,"Tampa para condulete alumínio para eletrodutos de 1\", de sobrepor , com conexões e acessórios. ","un",1,"Pini 16.115.000191.SER",3.51,"Pesquisa de Preços",3.51]
[null,null,"Interruptor para condulete alumínio para eletrodutos de 1’’, de sobrepor, com conexões e acessórios.","un",1,"Pini 16.115.000191.SER",12.53,"Pesquisa de Preços",12.53]
[null,null,null,null,null,null,"",null,""]
["SF-00258","Módulo cego",null,"un",null,"Orse 00711 Adaptada","",null,""]
[null,null,null,null,null,null,"",null,""]
[null,null,"Eletricista com encargos complementares","h",0.1,"Orse 00711",19.55,"Sinapi 88264",1.96,{"$f":"SUM(I1558:I1559)","v":4.05}]
[null,null,"Módulo cego","un",1,"Orse 00711",2.09,"Pesquisa de Preços",2.09]
[null,null,null,null,null,null,"",null,""]
["SF-00259","Módulo interruptor paralelo",null,"un",null,"Sinapi 91954","",null,""]
[null,null,null,null,null,null,"",null,""]
[null,null,"Interruptor paralelo 10A, 250V (apenas modulo)","un",1,"Sinapi 91954",6.57,"Sinapi 38113",6.57,{"$f":"SUM(I1563:I1565)","v":17.28}]
[null,null,"Auxiliar de eletricista com encargos complementares","h",0.308,"Sinapi 91954",15.22,"Sinapi 88247",4.6900000000000004]
[null,null,"Eletricista com encargos complementares","h",0.308,"Sinapi 91954",19.55,"Sinapi 88264",6.02]
[null,null,null,null,null,null,"",null,""]
["SF-00260","Módulo interruptor simples",null,"un",null,"Sinapi 91952","",null,""]
[null,null,null,null,null,null,"",null,""]
[null,null,"Interruptor simples 10A, 250V (apenas modulo)","un",1,"Sinapi 91952",5.05,"Sinapi 38112",5.05,{"$f":"SUM(I1569:I1571)","v":12.87}]
[null,null,"Auxiliar de eletricista com encargos complementares","h",0.22500000000000001,"Sinapi 91952",15.22,"Sinapi 88247",3.42]
[null,null,"Eletricista com encargos complementares","h",0.22500000000000001,"Sinapi 91952",19.55,"Sinapi 88264",4.4000000000000004]
[null,null,null,null,null,null,"",null,""]
["SF-00261","Módulo para saída de fio",null,"un",null,"Orse 00711 Adaptada","",null,""]
[null,null,null,null,null,null,"",null,""]
[null,null,"Eletricista com encargos complementares","h",0.1,"Orse 00711",19.55,"Sinapi 88264",1.96,{"$f":"SUM(I1575:I1576)","v":4.13}]
[null,null,"Módulo para saída de fio","un",1,"Orse 00711",2.17,"Pesquisa de Preços",2.17]
[null,null,null,null,null,null,"",null,""]
["SF-00262","Módulo sensor de presença",null,"un",null,"Sinapi 91954 Adaptada","",null,""]
[null,null,null,null,null,null,"",null,""]
[null,null,"Eletricista com encargos complementares","h",0.308,"Sinapi 91954",19.55,"Sinapi 88264",6.02,{"$f":"SUM(I1580:I1582)","v":132.44999999999999}]
[null,null,"Auxiliar de eletricista com encargos complementares","h",0.308,"Sinapi 91954",15.22,"Sinapi 88247",4.6900000000000004]
[null,null,"Módulo sensor de presença","un",1,"Senado Federal",121.74,"Pesquisa de Preços",121.74]
[null,null,null,null,null,null,"",null,""]
["SF-00263","Módulo tomada 10 A",null,"un",null,"Sinapi 91998","",null,""]
[null,null,null,null,null,null,"",null,""]
[null,null,"TOMADA 2P+T 10A, 250V  (APENAS MODULO)","un",1,"Sinapi 91998",5.74,"Sinapi 38101",5.74,{"$f":"SUM(I1586:I1588)","v":13.91}]
[null,null,"Auxiliar de eletricista com encargos complementares","h",0.23499999999999999,"Sinapi 91998",15.22,"Sinapi 88247",3.58]
[null,null,"Eletricista com encargos complementares","h",0.23499999999999999,"Sinapi 91998",19.55,"Sinapi 88264",4.59]
[null,null,null,null,null,null,"",null,""]
["SF-00264","Módulo tomada 20 A",null,"un",null,"Sinapi 91999","",null,""]
[null,null,null,null,null,null,"",null,""]
[null,null,"TOMADA 2P+T 20A, 250V  (APENAS MODULO)","un",1,"Sinapi 91998",7.34,"Sinapi 38102",7.34,{"$f":"SUM(I1592:I1594)","v":15.51}]
[null,null,"Auxiliar de eletricista com encargos complementares","h",0.23499999999999999,"Sinapi 91998",15.22,"Sinapi 88247",3.58]
[null,null,"Eletricista com encargos complementares","h",0.23499999999999999,"Sinapi 91998",19.55,"Sinapi 88264",4.59]
[null,null,null,null,null,null,"",null,""]
["SF-00265","Porta equipamentos para canaleta de alumínio aparente",null,"un",null,"Pini 16.115.000180.SER Adaptada","",null,""]
[null,null,null,null,null,null,"",null,""]
[null,null,"Auxiliar de eletricista com encargos complementares","h",{"$f":"0.35/2","v":0.17499999999999999},"Pini 16.115.000180.SER",15.22,"Sinapi 88247",2.66,{"$f":"SUM(I1598:I1600)","v":23.979999999999997}]
[null,null,"Eletricista com encargos complementares","h",{"$f":"0.35/2","v":0.17499999999999999},"Pini 16.115.000180.SER",19.55,"Sinapi 88264",{"$f":"IF(ISNUMBER(G1599),ROUND(E1599*G1599,2),\"\")","v":3.42},""]
[null,null,"Porta equipamentos para canaleta de alumínio aparente. Ref: Dutotec DT 64440.20 (branco)","un",1,"Pini 16.115.000180.SER",17.899999999999999,"Pesquisa de Preços",17.899999999999999]
[null,null,null,null,null,null,"",null,""]
["SF-00266","Tampa cega metálica para caixas de piso 4x2",null,"un",null,"Orse 00711 Adaptada","",null,""]
[null,null,null,null,null,null,"",null,""]
[null,null,"Auxiliar de eletricista com encargos complementares","h",0.1,"Orse 00711 Adaptada",15.22,"Sinapi 88247",1.52,{"$f":"SUM(I1604:I1605)","v":10.98}]
[null,null,"Tampa cega para caixa de piso 4x2 cromada. ","un",1,"Orse 00711",9.4600000000000009,"Pesquisa de Preços",9.4600000000000009]
[null,null,null,null,null,null,"",null,""]
["SF-00267","Tampa cega metálica para caixas de piso 4x4",null,"un",null,"Orse 00711 Adaptada","",null,""]
[null,null,null,null,null,null,"",null,""]
[null,null,"Auxiliar de eletricista com encargos complementares","h",0.1,"Orse 00711 Adaptada",15.22,"Sinapi 88247",1.52,{"$f":"SUM(I1609:I1610)","v":14.42}]
[null,null,"Tampa cega para caixa de piso 4x4 cromada. ","un",1,"Orse 00711",12.9,"Pesquisa de Preços",12.9]
[null,null,null,null,null,null,"",null,""]
["SF-00268","Tampa cega para condulete",null,"un",null,"SEINFRA C2298","",null,""]
[null,null,null,null,null,null,"",null,""]
[null,null,"Auxiliar de eletricista com encargos complementares","h",0.15,"SEINFRA C2298",15.22,"Sinapi 88247",2.2799999999999998,{"$f":"SUM(I1614:I1615)","v":5.26}]
[null,null,"Tampa cega para condulete alumínio para eletrodutos de 1’’, de sobrepor, com conexões e acessórios.","un",1,"SEINFRA C2298",2.98,"Pesquisa de Preços",2.98]
[null,null,null,null,null,null,"",null,""]
["SF-00269","Tampa RJ45 dupla para condulete",null,"un",null,{"$f":"F1620","v":"SEINFRA C2298"},"",null,""]
[null,null,null,null,null,null,"",null,""]
[null,null,"Auxiliar de eletricista com encargos complementares","h",0.15,"SEINFRA C2298",15.22,"Sinapi 88247",2.2799999999999998,{"$f":"SUM(I1619:I1621)","v":10.75}]
[null,null,"Eletricista com encargos complementares","h",0.15,"SEINFRA C2298",19.55,"Sinapi 88264",2.93]
[null,null,"Espelho para dois módulos RJ45 para condulete alumínio para eletrodutos de 1’’, de sobrepor, com conexões e acessórios.","un",1,"SEINFRA C2298",5.54,"Pesquisa de Preços",5.54]
[null,null,null,null,null,null,"",null,""]
["SF-00270","Tomada para condulete",null,"un",null,"Sinapi 91994 Adaptada","",null,""]
[null,null,null,null,null,null,"",null,""]
[null,null,"Eletricista com encargos complementares","h",0.308,"Sinapi 91994",19.55,"Sinapi 88264",6.02,{"$f":"SUM(I1625:I1628)","v":26.03}]
[null,null,"Auxiliar de eletricista com encargos complementares","h",0.308,"Sinapi 91994",15.22,"Sinapi 88247",4.6900000000000004]
[null,null,"Tampa para condulete alumínio para eletrodutos de 1\", de sobrepor , com conexões e acessórios. ","un",1,"Sinapi 91994",3.51,"Pesquisa de Preços",3.51]
[null,null,"Tomada para condulete alumínio para eletrodutos de 1’’, de sobrepor, com conexões e acessórios. ","un",1,"Sinapi 91994",11.81,"Pesquisa de Preços",11.81]
[null,null,null,null,null,null,"",null,""]
["SF-00271","Tomada para perfilado e eletrocalha",null,"un",null,"Pini 16.113.000020.SER Adaptada","",null,""]
[null,null,null,null,null,null,"",null,""]
[null,null,"Auxiliar de eletricista com encargos complementares","h",0.65,"Pini 16.113.000020.SER",15.22,"Sinapi 88247",9.89,{"$f":"SUM(I1632:I1635)","v":32.53}]
[null,null,"Eletricista com encargos complementares","h",0.65,"Pini 16.113.000020.SER",19.55,"Sinapi 88264",12.71]
[null,null,"Caixa com tampa fixa em perfil para tomada em perfilado","un",1,"Pini 16.113.000020.SER",3.13,"Pini 16.113.000020.MAT",3.13]
[null,null,"Tomada de embutir 2 polos + terra sem placa 250 V 10 A","un",1,"Pini 16.113.000020.SER",6.8,"Pini 16.113.000020.MAT",6.8]
[null,null,null,null,null,null,"",null,""]
["SF-00272","Bloco autônomo de emergência",null,"un",null,"Sinapi 97599 Adaptada","",null,""]
[null,null,null,null,null,null,"",null,""]
[null,null,"Bloco autônomo (luminária de emergência). Ref.: Aureon BLOKITO BLK 500 (9901.0000.1079.05 – Aclaramento e 9901.0000.1128.05 – balizamento)","un ",1,"Sinapi 97599",156.24,"Pesquisa de Preços",156.24,{"$f":"SUM(I1639:I1641)","v":160.88999999999999}]
[null,null,"Auxiliar de eletricista com encargos complementares","h",7.4800000000000005E-2,"Sinapi 97599",15.22,"Sinapi 88247",1.1399999999999999]
[null,null,"Eletricista com encargos complementares","h",0.17949999999999999,"Sinapi 97599",19.55,"Sinapi 88264",3.51]
[null,null,null,null,null,null,"",null,""]
["SF-00273","Instalação de luminária reaproveitada",null,"un",null,"Sinapi 97587 Adaptada","",null,""]
[null,null,null,null,null,null,"",null,""]
[null,null,"Auxiliar de eletricista com encargos complementares","h",0.12889999999999999,"Sinapi 97587",15.22,"Sinapi 88247",1.96,{"$f":"SUM(I1645:I1649)","v":22.700000000000003}]
[null,null,"Eletricista com encargos complementares","h",0.30940000000000001,"Sinapi 97587",19.55,"Sinapi 88264",6.05]
[null,null,"Cabo PP 3x2,5mm2 300/500 V, extraflexível (classe 5), com condutor de proteção, com isolação, enchimento e cobertura de PVC","m",1.5,"Senado Federal",4.57,"Pesquisa de Preços",6.86]
[null,null,"Plugue (macho) com 3 polos (2P+T), para 10A","un ",1,"Senado Federal",3.75,"Pesquisa de Preços",3.75]
[null,null,"Plugue (fêmea) com 3 polos (2P+T), para 10A","un ",1,"Senado Federal",4.08,"Pesquisa de Preços",4.08]
[null,null,null,null,null,null,"",null,""]
["SF-00274","Luminária 2x14 W de embutir",null,"un",null,"Sinapi 97587 Adaptada","",null,""]
[null,null,null,null,null,null,"",null,""]
[null,null,"Luminária de embutir T5 2 x 14W, ref: Intral DE-500 (cod. 08017); Lumicenter FAA20-E214","un ",1,"Sinapi 97587",119.99,"Pesquisa de Preços",119.99,{"$f":"SUM(I1653:I1660)","v":202.43000000000004}]
[null,null,"Reator eletrônico 2x14W, ref: Philips EB214A26; Philips EL214-28A26; Lumicenter LEB. 214; MarGirus PB 2X14 AF2","un ",1,"Senado Federal",46.76,"Pesquisa de Preços",46.76]
[null,null,"Lâmpada fluorescente T5 de 14W, ref: Osram HE 14W/840 SMARTLUX; Philips TL5-14W-HE/840; GE F14W/T5/840","un ",2,"Senado Federal",6.49,"Pesquisa de Preços",12.98]
[null,null,"Cabo PP 3x2,5mm2 300/500 V, extraflexível (classe 5), com condutor de proteção, com isolação, enchimento e cobertura de PVC","m",1.5,"Senado Federal",4.57,"Pesquisa de Preços",6.86]
[null,null,"Plugue (macho) com 3 polos (2P+T), para 10A","un ",1,"Senado Federal",3.75,"Pesquisa de Preços",3.75]
[null,null,"Plugue (fêmea) com 3 polos (2P+T), para 10A","un ",1,"Senado Federal",4.08,"Pesquisa de Preços",4.08]
[null,null,"Auxiliar de eletricista com encargos complementares","h",0.12889999999999999,"Sinapi 97587",15.22,"Sinapi 88247",1.96]
[null,null,"Eletricista com encargos complementares","h",0.30940000000000001,"Sinapi 97587",19.55,"Sinapi 88264",6.05]
[null,null,null,null,null,null,"",null,""]
["SF-00275","Luminária 2x14 W de sobrepor",null,"un",null,"Sinapi 97585 Adaptada","",null,""]
[null,null,null,null,null,null,"",null,{"$f":"IF(ISNUMBER(G1663),ROUND(E1663*G1663,2),\"\")","v":""}]
[null,null,"Luminária de sobrepor T5 2 x 14W, ref: Intral DS-500 (cod. 08021); Lumicenter FAA20-S214","un ",1,"Sinapi 97585",110.46,"Pesquisa de Preços",110.46,{"$f":"SUM(I1664:I1671)","v":197.09000000000003}]
[null,null,"Reator eletrônico 2x14W, ref: Philips EB214A26; Philips EL214-28A26; Lumicenter LEB. 214; MarGirus PB 2X14 AF2","un ",1,"Senado Federal",46.76,"Pesquisa de Preços",46.76]
[null,null,"Lâmpada fluorescente T5 de 14W, ref: Osram HE 14W/840 SMARTLUX; Philips TL5-14W-HE/840; GE F14W/T5/840","un ",2,"Senado Federal",6.49,"Pesquisa de Preços",12.98]
[null,null,"Cabo PP 3x2,5mm2 300/500 V, extraflexível (classe 5), com condutor de proteção, com isolação, enchimento e cobertura de PVC","m",1.5,"Senado Federal",4.57,"Pesquisa de Preços",6.86]
[null,null,"Plugue (macho) com 3 polos (2P+T), para 10A","un ",1,"Senado Federal",3.75,"Pesquisa de Preços",3.75]
[null,null,"Plugue (fêmea) com 3 polos (2P+T), para 10A","un ",1,"Senado Federal",4.08,"Pesquisa de Preços",4.08]
[null,null,"Auxiliar de eletricista com encargos complementares","h",0.1963,"Sinapi 97585",15.22,"Sinapi 88247",2.99]
[null,null,"Eletricista com encargos complementares","h",0.47099999999999997,"Sinapi 97585",19.55,"Sinapi 88264",9.2100000000000009]
[null,null,null,null,null,null,"",null,""]
["SF-00276","Luminária 2x28 W de embutir",null,"un",null,"Sinapi 97587 Adaptada","",null,""]
[null,null,null,null,null,null,"",null,""]
[null,null,"Luminária de embutir T5 2 x 28W, ref: Intral DE-500 (cod. 08025); Lumicenter FAA20-E228","un ",1,"Sinapi 97587",135.03,"Pesquisa de Preços",135.03,{"$f":"SUM(I1675:I1682)","v":216.47000000000003}]
[null,null,"Reator eletrônico 2x28W, ref: Philips EB228A26; Philips EL214-28A26; Intral REH-T5 2x28/127-220/50-60 (cod. 02475); MarGirus PB 2X28 AF2.","un ",1,"Senado Federal",45.32,"Pesquisa de Preços",45.32]
[null,null,"Lâmpada fluorescente T5 de 28W, ref: Osram HE 28W/840 SMARTLUX; Philips TL5-28W-HE/840; GE F28W/T5/840","un ",2,"Senado Federal",6.71,"Pesquisa de Preços",13.42]
[null,null,"Cabo PP 3x2,5mm2 300/500 V, extraflexível (classe 5), com condutor de proteção, com isolação, enchimento e cobertura de PVC","m",1.5,"Senado Federal",4.57,"Pesquisa de Preços",6.86]
[null,null,"Plugue (macho) com 3 polos (2P+T), para 10A","un ",1,"Senado Federal",3.75,"Pesquisa de Preços",3.75]
[null,null,"Plugue (fêmea) com 3 polos (2P+T), para 10A","un ",1,"Senado Federal",4.08,"Pesquisa de Preços",4.08]
[null,null,"Auxiliar de eletricista com encargos complementares","h",0.12889999999999999,"Sinapi 97587",15.22,"Sinapi 88247",1.96]
[null,null,"Eletricista com encargos complementares","h",0.30940000000000001,"Sinapi 97587",19.55,"Sinapi 88264",6.05]
[null,null,null,null,null,null,"",null,""]
["SF-00277","Luminária 2x28 W de sobrepor",null,"un",null,"Sinapi 97585 Adaptada","",null,""]
[null,null,null,null,null,null,"",null,""]
[null,null,"Luminária de sobrepor T5 2 x 28W, ref: Intral DS-500 (cod. 08029); Lumicenter FAA20-S228","un ",1,"Sinapi 97585",143.80000000000001,"Pesquisa de Preços",143.80000000000001,{"$f":"SUM(I1686:I1693)","v":229.43000000000004}]
[null,null,"Reator eletrônico 2x28W, ref: Philips EB228A26; Philips EL214-28A26; Intral REH-T5 2x28/127-220/50-60 (cod. 02475); MarGirus PB 2X28 AF2.","un ",1,"Senado Federal",45.32,"Pesquisa de Preços",45.32]
[null,null,"Lâmpada fluorescente T5 de 28W, ref: Osram HE 28W/840 SMARTLUX; Philips TL5-28W-HE/840; GE F28W/T5/840","un ",2,"Senado Federal",6.71,"Pesquisa de Preços",13.42]
[null,null,"Cabo PP 3x2,5mm2 300/500 V, extraflexível (classe 5), com condutor de proteção, com isolação, enchimento e cobertura de PVC","m",1.5,"Senado Federal",4.57,"Pesquisa de Preços",6.86]
[null,null,"Plugue (macho) com 3 polos (2P+T), para 10A","un ",1,"Senado Federal",3.75,"Pesquisa de Preços",3.75]
[null,null,"Plugue (fêmea) com 3 polos (2P+T), para 10A","un ",1,"Senado Federal",4.08,"Pesquisa de Preços",4.08]
[null,null,"Auxiliar de eletricista com encargos complementares","h",0.1963,"Sinapi 97587",15.22,"Sinapi 88247",2.99]
[null,null,"Eletricista com encargos complementares","h",0.47099999999999997,"Sinapi 97585",19.55,"Sinapi 88264",9.2100000000000009]
[null,null,null,null,null,null,"",null,""]
["SF-00278","Condutor 10mm²",null,"m",null,"Sinapi 92980 Adaptada","",null,""]
[null,null,null,null,null,null,"",null,""]
[null,null,"Auxiliar de eletricista com encargos complementares","h",8.9999999999999993E-3,"Sinapi 92980",15.22,"Sinapi 88247",0.14000000000000001,{"$f":"SUM(I1697:I1700)","v":9.43}]
[null,null,"Eletricista com encargos complementares","h",8.9999999999999993E-3,"Sinapi 92980",19.55,"Sinapi 88264",0.18]
[null,null,"Cabo flexível isolado em EPR não halogenado 10 mm² 0,6 a 1 kV","m",1.0269999999999999,"Sinapi 92980",8.83,"Pini 16.119.000304.MAT",9.07]
[null,null,"Fita isolante adesiva antichama, uso ate 750 V, em rolo de 19 mm x 5 m","un",0.01,"Sinapi 92980",3.73,"Sinapi 21127",0.04]
[null,null,null,null,null,null,"",null,""]
["SF-00279","Condutor 16mm²",null,"m",null,"Sinapi 92982 Adaptada","",null,""]
[null,null,null,null,null,null,"",null,""]
[null,null,"Auxiliar de eletricista com encargos complementares","h",1.2999999999999999E-2,"Sinapi 92982",15.22,"Sinapi 88247",0.2,{"$f":"SUM(I1704:I1707)","v":13.969999999999999}]
[null,null,"Eletricista com encargos complementares","h",1.2999999999999999E-2,"Sinapi 92982",19.55,"Sinapi 88264",0.25]
[null,null,"Cabo flexível isolado em EPR não halogenado 16 mm² 0,6 a 1 kV","m",1.0269999999999999,"Sinapi 92982",13.13,"Pini 16.119.000305.MAT",13.48]
[null,null,"Fita isolante adesiva antichama, uso ate 750 V, em rolo de 19 mm x 5 m","un",0.01,"Sinapi 92982",3.73,"Sinapi 21127",0.04]
[null,null,null,null,null,null,"",null,""]
["SF-00280","Condutor 2,5 mm²",null,"m",null,"Sinapi 91926 Adaptada","",null,""]
[null,null,null,null,null,null,"",null,""]
[null,null,"Auxiliar de eletricista com encargos complementares","h",0.03,"Sinapi 91926",15.22,"Sinapi 88247",0.46,{"$f":"SUM(I1711:I1714)","v":2.4499999999999997}]
[null,null,"Eletricista com encargos complementares","h",0.03,"Sinapi 91926",19.55,"Sinapi 88264",0.59]
[null,null,"Cabo de cobre isolado PVC 450/750V 2,5mm² resistente a chamas, livre de halogênios","m",1.19,"Sinapi 91926",1.1499999999999999,"Pesquisa de Preços",1.37]
[null,null,"Fita isolante adesiva antichama, uso ate 750 V, em rolo de 19 mm x 5 m","un",8.9999999999999993E-3,"Sinapi 91926",3.73,"Sinapi 21127",0.03]
[null,null,null,null,null,null,"",null,""]
["SF-00281","Condutor 3x2,5 mm²",null,"m",null,"Sinapi 91930 Adaptada","",null,""]
[null,null,null,null,null,null,"",null,""]
[null,null,"Auxiliar de eletricista com encargos complementares","h",5.1999999999999998E-2,"Sinapi 91930",15.22,"Sinapi 88247",0.79,{"$f":"SUM(I1718:I1721)","v":7.79}]
[null,null,"Eletricista com encargos complementares","h",5.1999999999999998E-2,"Sinapi 91930",19.55,"Sinapi 88264",1.02]
[null,null,"Cabo de cobre multipolar, classe 5, isolação em EPR, 0,6/1 kV, 3x2,5mm² resistente a chama, livre de halogênios","m",1.19,"Sinapi 91930",5,"Pesquisa de Preços",5.95]
[null,null,"Fita isolante adesiva antichama, uso ate 750 V, em rolo de 19 mm x 5 m","un",8.9999999999999993E-3,"Sinapi 91930",3.73,"Sinapi 21127",0.03]
[null,null,null,null,null,null,"",null,""]
["SF-00282","Condutor 4 mm²",null,"m",null,"Sinapi 91928 Adaptada","",null,""]
[null,null,null,null,null,null,"",null,""]
[null,null,"Auxiliar de eletricista com encargos complementares","h",0.04,"Sinapi 91928",15.22,"Sinapi 88247",0.61,{"$f":"SUM(I1725:I1728)","v":3.73}]
[null,null,"Eletricista com encargos complementares","h",0.04,"Sinapi 91928",19.55,"Sinapi 88264",0.78]
[null,null,"Cabo de cobre isolado PVC 450/750V 4mm² resistente a chamas, livre de halogênios","m",1.19,"Sinapi 91928",1.94,"Pesquisa de Preços",{"$f":"IF(ISNUMBER(G1727),ROUND(E1727*G1727,2),\"\")","v":2.31}]
[null,null,"Fita isolante adesiva antichama, uso ate 750 V, em rolo de 19 mm x 5 m","un",8.9999999999999993E-3,"Sinapi 91928",3.73,"Sinapi 21127",0.03]
[null,null,null,null,null,null,"",null,""]
["SF-00283","Condutor 4x2,5 mm²",null,"m",null,"Sinapi 92980 Adaptada","",null,""]
[null,null,null,null,null,null,"",null,""]
[null,null,"Auxiliar de eletricista com encargos complementares","h",8.9999999999999993E-3,"Sinapi 92980",15.22,"Sinapi 88247",0.14000000000000001,{"$f":"SUM(I1732:I1735)","v":5.91}]
[null,null,"Eletricista com encargos complementares","h",8.9999999999999993E-3,"Sinapi 92980",19.55,"Sinapi 88264",0.18]
[null,null,"Cabo de cobre multipolar, classe 5, isolação em EPR, 0,6/1 kV, 4x2,5mm² resistente a chama, livre de halogênios","m",1.0269999999999999,"Sinapi 92980",5.4,"Pesquisa de Preços",5.55]
[null,null,"Fita isolante adesiva antichama, uso ate 750 V, em rolo de 19 mm x 5 m","un",0.01,"Sinapi 92980",3.73,"Sinapi 21127",0.04]
[null,null,null,null,null,null,"",null,""]
["SF-00284","Condutor 6 mm²",null,"m",null,"Sinapi 91930 Adaptada","",null,""]
[null,null,null,null,null,null,"",null,""]
[null,null,"Auxiliar de eletricista com encargos complementares","h",5.1999999999999998E-2,"Sinapi 91930",15.22,"Sinapi 88247",0.79,{"$f":"SUM(I1739:I1742)","v":5.0200000000000005}]
[null,null,"Eletricista com encargos complementares","h",5.1999999999999998E-2,"Sinapi 91930",19.55,"Sinapi 88264",1.02]
[null,null,"Cabo de cobre isolado PVC 450/750V 6mm² resistente a chamas, livre de halogênios","m",1.19,"Sinapi 91930",2.67,"Pesquisa de Preços",3.18]
[null,null,"Fita isolante adesiva antichama, uso ate 750 V, em rolo de 19 mm x 5 m","un",8.9999999999999993E-3,"Sinapi 91930",3.73,"Sinapi 21127",0.03]
[null,null,null,null,null,null,"",null,""]
["SF-00285","Quadro elétrico TTA",null,"un",null,"Sinapi 74131/6 Adaptada","",null,""]
[null,null,null,null,null,null,"",null,""]
[null,null,"Quadro elétrico tipo TTA completo com 30 disjuntores terminais, contemplando disjuntores, dispositovos de proteção contra surto (DPS), módulo diferencial residual (DR), borneiras, barramentos e outros itens necessários, conforme especificação","un",1,"Sinapi 74131/6",8398.5300000000007,"Pesquisa de Preços",8398.5300000000007,{"$f":"SUM(I1746:I1748)","v":8520.2300000000014}]
[null,null,"Auxiliar de eletricista com encargos complementares","h",3.5,"Sinapi 74131/6",15.22,"Sinapi 88247",53.27]
[null,null,"Eletricista com encargos complementares","h",3.5,"Sinapi 74131/6",19.55,"Sinapi 88264",68.430000000000007]
[null,null,null,null,null,null,"",null,""]
["SF-00293","Instalação de fancolete reaproveitado",null,"un",null,"Senado Federal","",null,""]
[null,null,null,null,null,null,"",null,""]
[null,null,"Ajudante de operação em geral com encargos complementares","h",2,"Senado Federal",15.23,"Sinapi 88241",30.46,{"$f":"SUM(I1752:I1753)","v":70.94}]
[null,null,"MONTADOR ELETROMECÃNICO COM ENCARGOS COMPLEMENTARES","h",2,"Senado Federal",20.239999999999998,"Sinapi 88279",40.479999999999997]
[null,null,null,null,null,null,"",null,""]
["SF-00294","Instalação de split reaproveitado",null,"un",null,"Senado Federal","",null,""]
[null,null,null,null,null,null,"",null,""]
[null,null,"Ajudante de operação em geral com encargos complementares","h",3,"Senado Federal",15.23,"Sinapi 88241",45.69,{"$f":"SUM(I1757:I1758)","v":106.41}]
[null,null,"MONTADOR ELETROMECÃNICO COM ENCARGOS COMPLEMENTARES","h",3,"Senado Federal",20.239999999999998,"Sinapi 88279",60.72]
[null,null,null,null,null,null,"",null,""]
["SF-00295","Exaustor axial 340 m3/h",null,"un",null,"Orse 11148 Adaptada","",null,""]
[null,null,null,null,null,null,"",null,""]
[null,null,"Eletricista com encargos complementares","h",1,"Orse 11148",19.55,"Sinapi 88264",19.55,{"$f":"SUM(I1762:I1764)","v":187.18}]
[null,null,"Auxiliar de eletricista com encargos complementares","h",1,"Orse 11148",15.22,"Sinapi 88247",15.22]
[null,null,"Exaustor axial, 1F/220V/60Hz,  vazão máxima 340 m3/h, pressão estática máxima 104 Pa. Referência Comercial: Multivac Muro150B 220V","un ",1,"Orse 11148",152.41,"Pesquisa de Preços",152.41]
[null,null,null,null,null,null,"",null,""]
["SF-00296","Exaustor axial 865 m3/h",null,"un",null,"Orse 11148 Adaptada","",null,""]
[null,null,null,null,null,null,"",null,""]
[null,null,"Eletricista com encargos complementares","h",1,"Orse 11148",19.55,"Sinapi 88264",19.55,{"$f":"SUM(I1768:I1770)","v":894.02}]
[null,null,"Auxiliar de eletricista com encargos complementares","h",1,"Orse 11148",15.22,"Sinapi 88247",15.22]
[null,null,"Exaustor axial, 1F/220V/60Hz,  vazão máxima 865 m3/h, pressão estática máxima 582 Pa . Referência Comercial: Multivac AXC 200B","un ",1,"Orse 11148",859.25,"Pesquisa de Preços",859.25]
[null,null,null,null,null,null,"",null,""]
["SF-00297","Duto chapa galvanizada # 22",null,"m2",null,"Pini 19.104.000012.SER Adaptada","",null,""]
[null,null,null,null,null,null,"",null,""]
[null,null,"Chapa de aco galvanizada bitola GSG 22, E = 0,80 mm (6,40 kg/m2)","kg",6.6559999999999997,"Pini 19.104.000012.SER",6.21,"Sinapi 11049",41.33,{"$f":"SUM(I1774:I1777)","v":176.03}]
[null,null,"Suportes e acessórios de fixação de dutos em chapa de aço #22","cj",1,"Pini 19.104.000012.SER",2.41,"Pini 19.104.000012.MAT",2.41]
[null,null,"Servente com Encargos Complementares","h",3.84,"Pini 19.104.000012.SER",14.21,"Sinapi 88316",54.57]
[null,null,"MONTADOR ELETROMECÃNICO COM ENCARGOS COMPLEMENTARES","h",3.84,"Pini 19.104.000012.SER",20.239999999999998,"Sinapi 88279",77.72]
[null,null,null,null,null,null,"",null,""]
["SF-00298","Duto flexível 6”",null,"m",null,"Pini 19.104.000080.SER Adaptada","",null,""]
[null,null,null,null,null,null,"",null,""]
[null,null,"Servente com Encargos Complementares","h",0.4,"Pini 19.104.000080.SER",14.21,"Sinapi 88316",5.68,{"$f":"SUM(I1781:I1783)","v":26.42}]
[null,null,"MONTADOR ELETROMECÃNICO COM ENCARGOS COMPLEMENTARES","h",0.4,"Pini 19.104.000080.SER",20.239999999999998,"Sinapi 88279",8.1]
[null,null,"Duto flexível com isolamento térmico e barreira de vapor, diâmetro 6”, 6 m de comprimento. Referência Comercial: Multivac Isodec RT 0.6","m",1.05,"Pini 19.104.000080.SER",12.04,"Pesquisa de Preços",12.64]
[null,null,null,null,null,null,"",null,""]
["SF-00299","Duto flexível 8”",null,"m",null,"Pini 19.104.000080.SER Adaptada","",null,""]
[null,null,null,null,null,null,"",null,""]
[null,null,"Servente com Encargos Complementares","h",0.4,"Pini 19.104.000080.SER",14.21,"Sinapi 88316",5.68,{"$f":"SUM(I1787:I1789)","v":28.38}]
[null,null,"MONTADOR ELETROMECÃNICO COM ENCARGOS COMPLEMENTARES","h",0.4,"Pini 19.104.000080.SER",20.239999999999998,"Sinapi 88279",8.1]
[null,null,"Duto flexível com isolamento térmico e barreira de vapor, diâmetro 8”, 6 m de comprimento. Referência: Multivac Isodec RT 0.6","m",1.05,"Pini 19.104.000080.SER",13.9,"Pesquisa de Preços",14.6]
[null,null,null,null,null,null,"",null,""]
["SF-00300","Difusor de ar quadrado 360x360 mm",null,"un",null,"Pini 19.104.000200.SER Adaptada","",null,{"$f":"IF(ISNUMBER(G1791),ROUND(E1791*G1791,2),\"\")","v":""}]
[null,null,null,null,null,null,"",null,""]
[null,null,"Ajudante de operação em geral com encargos complementares","h",2.5,"Pini 19.104.000200.SER",15.23,"Sinapi 88241",38.08,{"$f":"SUM(I1793:I1795)","v":207.59}]
[null,null,"MONTADOR ELETROMECÃNICO COM ENCARGOS COMPLEMENTARES","h",2.5,"Pini 19.104.000200.SER",20.239999999999998,"Sinapi 88279",50.6]
[null,null,"Difusor de ar quadrado, 360x360 mm, Referência Comercial: Trox ADLQ-AG Nº4","un ",1,"Pini 19.104.000200.SER",118.91,"Pesquisa de Preços",118.91]
[null,null,null,null,null,null,"",null,""]
["SF-00301","Difusor de ar quadrado com caixa plenum AK6 360x360 mm",null,"un",null,"Pini 19.104.000200.SER Adaptada","",null,""]
[null,null,null,null,null,null,"",null,""]
[null,null,"Ajudante de operação em geral com encargos complementares","h",2.5,"Pini 19.104.000200.SER",15.23,"Sinapi 88241",38.08,{"$f":"SUM(I1799:I1801)","v":246.68}]
[null,null,"MONTADOR ELETROMECÃNICO COM ENCARGOS COMPLEMENTARES","h",2.5,"Pini 19.104.000200.SER",20.239999999999998,"Sinapi 88279",50.6]
[null,null,"Difusor de ar quadrado com caixa pleno AK6 360x360 mm. Ref.: Trox ADLK-AG Nº4","un ",1,"Pini 19.104.000200.SER",158,"Pesquisa de Preços",158]
[null,null,null,null,null,null,"",null,""]
["SF-00302","Difusor de ar quadrado para insuflamento em duas direções perpendiculares 376x376 mm",null,"un",null,"Pini 19.104.000200.SER Adaptada","",null,""]
[null,null,null,null,null,null,"",null,""]
[null,null,"Ajudante de operação em geral com encargos complementares","h",2.5,"Pini 19.104.000200.SER",15.23,"Sinapi 88241",38.08,{"$f":"SUM(I1805:I1807)","v":191.18}]
[null,null,"MONTADOR ELETROMECÃNICO COM ENCARGOS COMPLEMENTARES","h",2.5,"Pini 19.104.000200.SER",20.239999999999998,"Sinapi 88279",50.6]
[null,null,"Difusor de ar quadrado para insuflamento em duas direções perpendiculares 376x376 mm, Referência Comercial: Trox  ADQ-2C-AG","un ",1,"Pini 19.104.000200.SER",102.5,"Pesquisa de Preços",102.5]
[null,null,null,null,null,null,"",null,""]
["SF-00303","Difusor de ar retangular para insuflamento em duas direções 371x208 mm",null,"un",null,"Pini 19.104.000200.SER Adaptada","",null,""]
[null,null,null,null,null,null,"",null,""]
[null,null,"Ajudante de operação em geral com encargos complementares","h",2.5,"Pini 19.104.000200.SER",15.23,"Sinapi 88241",38.08,{"$f":"SUM(I1811:I1813)","v":154.99}]
[null,null,"MONTADOR ELETROMECÃNICO COM ENCARGOS COMPLEMENTARES","h",2.5,"Pini 19.104.000200.SER",20.239999999999998,"Sinapi 88279",50.6]
[null,null,"Difusor de ar retangular para insuflamento em duas direções (fluxo na direção perpendicular às maiores arestas do retângulo), 371x208 mm. Ref.: Trox ADQ-2","un ",1,"Pini 19.104.000200.SER",66.31,"Pesquisa de Preços",66.31]
[null,null,null,null,null,null,"",null,""]
["SF-00304","Difusor de ar retangular para insuflamento em três direções 264x432 mm",null,"un",null,"Pini 19.104.000200.SER Adaptada","",null,""]
[null,null,null,null,null,null,"",null,""]
[null,null,"Ajudante de operação em geral com encargos complementares","h",2.5,"Pini 19.104.000200.SER",15.23,"Sinapi 88241",38.08,{"$f":"SUM(I1817:I1819)","v":208.9}]
[null,null,"MONTADOR ELETROMECÃNICO COM ENCARGOS COMPLEMENTARES","h",2.5,"Pini 19.104.000200.SER",20.239999999999998,"Sinapi 88279",50.6]
[null,null,"Difusor de ar retangular para insuflamento em três direções (um fluxo na direção perpendicular às maiores arestas do retângulo e dois fluxos na direção perpendicular às menores arestas), 264x432 mm, Referência Comercial: Trox  ADQ-32-AG","un ",1,"Pini 19.104.000200.SER",120.22,"Pesquisa de Preços",120.22]
[null,null,null,null,null,null,"",null,""]
["SF-00305","Difusor de ar retangular para insuflamento em três direções 320x562 mm",null,"un",null,"Pini 19.104.000200.SER Adaptada","",null,""]
[null,null,null,null,null,null,"",null,""]
[null,null,"Ajudante de operação em geral com encargos complementares","h",2.5,"Pini 19.104.000200.SER",15.23,"Sinapi 88241",38.08,{"$f":"SUM(I1823:I1825)","v":246.31}]
[null,null,"MONTADOR ELETROMECÃNICO COM ENCARGOS COMPLEMENTARES","h",2.5,"Pini 19.104.000200.SER",20.239999999999998,"Sinapi 88279",50.6]
[null,null,"Difusor de ar retangular para insuflamento em três direções 320x562 mm. Ref.: Trox ADQ-32-AG","un ",1,"Pini 19.104.000200.SER",157.63,"Pesquisa de Preços",157.63]
[null,null,null,null,null,null,"",null,""]
["SF-00306","Difusor de ar retangular para insuflamento em três direções 371x208 mm",null,"un",null,"Pini 19.104.000200.SER Adaptada","",null,""]
[null,null,null,null,null,null,"",null,""]
[null,null,"Ajudante de operação em geral com encargos complementares","h",2.5,"Pini 19.104.000200.SER",15.23,"Sinapi 88241",38.08,{"$f":"SUM(I1829:I1831)","v":167.16000000000003}]
[null,null,"MONTADOR ELETROMECÃNICO COM ENCARGOS COMPLEMENTARES","h",2.5,"Pini 19.104.000200.SER",20.239999999999998,"Sinapi 88279",50.6]
[null,null,"Difusor de ar retangular para insuflamento em três direções (dois fluxos na direção perpendicular às maiores arestas do retângulo e um fluxo na direção perpendicular às menores arestas), 371x208 mm. Ref.: Trox ADQ-3","un ",1,"Pini 19.104.000200.SER",78.48,"Pesquisa de Preços",78.48]
[null,null,null,null,null,null,"",null,""]
["SF-00307","Difusor de ar retangular para insuflamento em uma direção 371x208 mm",null,"un",null,"Pini 19.104.000200.SER Adaptada","",null,""]
[null,null,null,null,null,null,"",null,""]
[null,null,"Ajudante de operação em geral com encargos complementares","h",2.5,"Pini 19.104.000200.SER",15.23,"Sinapi 88241",38.08,{"$f":"SUM(I1835:I1837)","v":152.27000000000001}]
[null,null,"MONTADOR ELETROMECÃNICO COM ENCARGOS COMPLEMENTARES","h",2.5,"Pini 19.104.000200.SER",20.239999999999998,"Sinapi 88279",50.6]
[null,null,"Difusor de ar retangular para insuflamento em uma direção (fluxo na direção perpendicular às maiores arestas do retângulo), 371x208 mm. Ref.: Trox ADQ-1","un ",1,"Pini 19.104.000200.SER",63.59,"Pesquisa de Preços",63.59]
[null,null,null,null,null,null,"",null,""]
["SF-00308","Grelha para retorno retangular 425x225 mm",null,"un",null,"Pini 19.104.000906.SER Adaptada","",null,""]
[null,null,null,null,null,null,"",null,""]
[null,null,"Ajudante de operação em geral com encargos complementares","h",3.5,"Pini 19.104.000906.SER",15.23,"Sinapi 88241",53.31,{"$f":"SUM(I1841:I1843)","v":165.4}]
[null,null,"MONTADOR ELETROMECÃNICO COM ENCARGOS COMPLEMENTARES","h",3.5,"Pini 19.104.000906.SER",20.239999999999998,"Sinapi 88279",70.84]
[null,null,"Grelha para retorno de ar com lâminas fixas e registro, 40 x 20 cm","un ",1,"Pini 19.104.000906.SER",41.25,"Pini 19.104.000905.MAT",41.25]
[null,null,null,null,null,null,"",null,""]
["SF-00309","Grelha para retorno retangular 525x325 mm",null,"un",null,"Pini 19.104.000906.SER Adaptada","",null,""]
[null,null,null,null,null,null,"",null,""]
[null,null,"Ajudante de operação em geral com encargos complementares","h",3.5,"Pini 19.104.000906.SER",15.23,"Sinapi 88241",53.31,{"$f":"SUM(I1847:I1849)","v":185.08}]
[null,null,"MONTADOR ELETROMECÃNICO COM ENCARGOS COMPLEMENTARES","h",3.5,"Pini 19.104.000906.SER",20.239999999999998,"Sinapi 88279",70.84]
[null,null,"Grelha para retorno de ar com lâminas fixas e registro, 50 x 30 cm","un ",1,"Pini 19.104.000906.SER",60.93,"Pini 19.104.000907.MAT",60.93]
[null,null,null,null,null,null,"",null,""]
["SF-00310","Instalação de difusores, grelhas e acessórios de climatização reaproveitados",null,"un",null,"Pini 19.104.000200.SER Adaptada","",null,""]
[null,null,null,null,null,null,"",null,""]
[null,null,"Ajudante de operação em geral com encargos complementares","h",2.5,"Pini 19.104.000200.SER",15.23,"Sinapi 88241",38.08,{"$f":"SUM(I1853:I1854)","v":88.68}]
[null,null,"MONTADOR ELETROMECÃNICO COM ENCARGOS COMPLEMENTARES","h",2.5,"Pini 19.104.000200.SER",20.239999999999998,"Sinapi 88279",50.6]
[null,null,null,null,null,null,"",null,{"$f":"IF(ISNUMBER(G1855),ROUND(E1855*G1855,2),\"\")","v":""}]
["SF-00311","Instalação de exaustor reaproveitado",null,"un",null,"Orse 11148 Adaptada","",null,""]
[null,null,null,null,null,null,"",null,""]
[null,null,"Eletricista com encargos complementares","h",1,"Orse 11148",19.55,"Sinapi 88264",19.55,{"$f":"SUM(I1858:I1859)","v":34.770000000000003}]
[null,null,"Auxiliar de eletricista com encargos complementares","h",1,"Orse 11148",15.22,"Sinapi 88247",15.22]
[null,null,null,null,null,null,"",null,""]
["SF-00312","Preparação para instalação de difusores/grelhas de ar em portas",null,"un",null,"Senado Federal","",null,""]
[null,null,null,null,null,null,"",null,""]
[null,null,"Marceneiro com encargos complementares","h",0.75,"Senado Federal",19.53,"Sinapi 88273",14.65,{"$f":"SUM(I1863:I1864)","v":26.78}]
[null,null,"Ajudante de carpinteiro com encargos complementares","h",0.75,"Senado Federal",16.170000000000002,"Sinapi 88239",12.13]
[null,null,null,null,null,null,"",null,""]
["SF-00313","Bomba para condensado de ar-condicionado para instalação oculta",null,"un",null,"CPOS 43.20.140 Adaptada","",null,""]
[null,null,null,null,null,null,"",null,""]
[null,null,"Auxiliar de eletricista com encargos complementares","h",1,"CPOS 43.20.140",15.22,"Sinapi 88247",15.22,{"$f":"SUM(I1868:I1870)","v":472.02}]
[null,null,"Eletricista com encargos complementares","h",1,"CPOS 43.20.140",19.55,"Sinapi 88264",19.55]
[null,null,"Bomba para condensado de ar-condicionado para instalação oculta, 1F/220V/60Hz, vazão 14 l/h (a 0 mmca). Ref.: Elgin Mini Orange","un",1,"CPOS 43.20.140",437.25,"Pesquisa de Preços",437.25]
[null,null,null,null,null,null,"",null,""]
["SF-00317","Suporte para unidade condensadora de aparelho split",null,"un",null,"SBC 112411 Adaptada","",null,""]
[null,null,null,null,null,null,"",null,""]
[null,null,"Serralheiro com encargos complementares","h",0.85099999999999998,"SBC 112411",19.22,"Sinapi 88315",16.36,{"$f":"SUM(I1874:I1876)","v":56.03}]
[null,null,"Auxiliar de serralheiro com encargos complementares","h",0.85099999999999998,"SBC 112411",15.62,"Sinapi 88251",13.29]
[null,null,"Suporte para unidade condensadora de aparelho split ou fancolete","un ",1,"Senado Federal",26.38,"Pesquisa de Preços",26.38]
[null,null,null,null,null,null,"",null,""]
["SF-00318","Suporte para unidade evaporadora de aparelho split ou fancolete",null,"un",null,"SBC 112411 Adaptada","",null,""]
[null,null,null,null,null,null,"",null,""]
[null,null,"Serralheiro com encargos complementares","h",0.85099999999999998,"SBC 112411",19.22,"Sinapi 88315",16.36,{"$f":"SUM(I1880:I1882)","v":79.599999999999994}]
[null,null,"Auxiliar de serralheiro com encargos complementares","h",0.85099999999999998,"SBC 112411",15.62,"Sinapi 88251",13.29]
[null,null,"Suporte para unidade evaporadora de aparelho split ou fancolete","un ",1,"Senado Federal",49.95,"Pesquisa de Preços",49.95]
[null,null,null,null,null,null,"",null,""]
["SF-00319","Filtro em Y 1\"",null,"un",null,"Sinapi 95250 Adaptada","",null,""]
[null,null,null,null,null,null,"",null,""]
[null,null,"Auxiliar de encanador ou bombeiro hidráulico com encargos complementares","h",0.77449999999999997,"Sinapi 95250",14.78,"Sinapi 88248",11.45,{"$f":"SUM(I1886:I1889)","v":130.23000000000002}]
[null,null,"Encanador ou Bombeiro Hidráulico com Encargos Complementares","h",0.77449999999999997,"Sinapi 95250",18.95,"Sinapi 88267",14.68]
[null,null,"Filtro em Y 1\" (DN 25 mm), fabricado em bronze, extremidade com roscas, filtro em aço inoxidável, classe de pressão PN20 ou superior. Ref.: Deca 000.085.100.03","un ",1,"Sinapi 95249",103.98,"Pesquisa de Preços",103.98]
[null,null,"Fita veda rosca em rolos de 18 mm x 50 m (L x C)","un ",9.4999999999999998E-3,"Sinapi 95250",12.38,"Sinapi 3148",0.12]
[null,null,null,null,null,null,"",null,""]
["SF-00320","Filtro em Y 3/4\"",null,"un",null,"Sinapi 95249 Adaptada","",null,""]
[null,null,null,null,null,null,"",null,""]
[null,null,"Auxiliar de encanador ou bombeiro hidráulico com encargos complementares","h",0.77449999999999997,"Sinapi 95249",14.78,"Sinapi 88248",11.45,{"$f":"SUM(I1893:I1896)","v":98.84}]
[null,null,"Encanador ou Bombeiro Hidráulico com Encargos Complementares","h",0.77449999999999997,"Sinapi 95249",18.95,"Sinapi 88267",14.68]
[null,null,"Filtro em Y 3/4\" (DN 20 mm), fabricado em bronze, extremidade com roscas, filtro em aço inoxidável, classe de pressão PN20 ou superior. Ref.: Deca 000.085.034.03","un ",1,"Sinapi 95249",72.59,"Pesquisa de Preços",72.59]
[null,null,"Fita veda rosca em rolos de 18 mm x 50 m (L x C)","un ",9.4999999999999998E-3,"Sinapi 95249",12.38,"Sinapi 3148",0.12]
[null,null,null,null,null,null,"",null,""]
["SF-00321","Válvula de balanceamento e controle independente da pressão (PIBCV) 2 vias 1\"",null,"un",null,"Sinapi 95250 Adaptada","",null,""]
[null,null,null,null,null,null,"",null,""]
[null,null,"Auxiliar de encanador ou bombeiro hidráulico com encargos complementares","h",0.77449999999999997,"Sinapi 95250",14.78,"Sinapi 88248",11.45,{"$f":"SUM(I1900:I1904)","v":498.51}]
[null,null,"Encanador ou Bombeiro Hidráulico com Encargos Complementares","h",0.77449999999999997,"Sinapi 95250",18.95,"Sinapi 88267",14.68]
[null,null,"Fita veda rosca em rolos de 18 mm x 50 m (L x C)","un ",9.4999999999999998E-3,"Sinapi 95250",12.38,"Sinapi 3148",0.12]
[null,null,"Atuador tipo liga/desliga (ON/OFF), com tensão compatível com o restante do sistema (24 V ou 220 V) e mecanicamente compatível com a válvula fornecida. Referência comercial: IMI Hydronic Engineering EMO-T","un ",1,"Senado Federal",127.49,"Pesquisa de Preços",127.49]
[null,null,"Válvula de balanceamento e controle (PIBCV) 2 vias, para controle on-off, diâmetro nominal 1\" (25 mm). Ref.: IMI Hydronic Engineering TA-COMPACT-P DN 25, Honeywell VRN2C","un ",1,"Sinapi 95250",344.77,"Pesquisa de Preços",344.77]
[null,null,null,null,null,null,"",null,""]
["SF-00322","Válvula de balanceamento e controle independente da pressão (PIBCV) 2 vias 3/4\"",null,"un",null,"Sinapi 95249 Adaptada","",null,""]
[null,null,null,null,null,null,"",null,""]
[null,null,"Auxiliar de encanador ou bombeiro hidráulico com encargos complementares","h",0.77449999999999997,"Sinapi 95249",14.78,"Sinapi 88248",11.45,{"$f":"SUM(I1908:I1912)","v":519.82999999999993}]
[null,null,"Encanador ou Bombeiro Hidráulico com Encargos Complementares","h",0.77449999999999997,"Sinapi 95249",18.95,"Sinapi 88267",14.68]
[null,null,"Fita veda rosca em rolos de 18 mm x 50 m (L x C)","un ",9.4999999999999998E-3,"Sinapi 95249",12.38,"Sinapi 3148",0.12]
[null,null,"Atuador tipo liga/desliga (ON/OFF), com tensão compatível com o restante do sistema (24 V ou 220 V) e mecanicamente compatível com a válvula fornecida. Referência comercial: IMI Hydronic Engineering EMO-T","un ",1,"Senado Federal",127.49,"Pesquisa de Preços",127.49]
[null,null,"Válvula de balanceamento e controle (PIBCV) 2 vias, para controle on-off, diâmetro nominal 3/4\" (20 mm). Ref.: IMI Hydronic Engineering TA-COMPACT-P DN 20, Honeywell VRN2B","un ",1,"Sinapi 95249",366.09,"Pesquisa de Preços",366.09]
[null,null,null,null,null,null,"",null,""]
["SF-00323","Válvula de esfera em bronze 1 1/2\"",null,"un",null,"Sinapi 95252","",null,""]
[null,null,null,null,null,null,"",null,""]
[null,null,"Fita veda rosca em rolos de 18 mm x 50 m (L x C)","un ",1.9E-2,"Sinapi 95252",12.38,"Sinapi 3148",0.24,{"$f":"SUM(I1916:I1919)","v":106.41}]
[null,null,"VALVULA DE ESFERA BRUTA EM BRONZE, BITOLA 1 1/2 \" (REF 1552-B)","un",1,"Sinapi 95252",79.56,"Sinapi 11751",79.56]
[null,null,"Auxiliar de encanador ou bombeiro hidráulico com encargos complementares","h",0.78900000000000003,"Sinapi 95252",14.78,"Sinapi 88248",11.66]
[null,null,"Encanador ou Bombeiro Hidráulico com Encargos Complementares","h",0.78900000000000003,"Sinapi 95252",18.95,"Sinapi 88267",{"$f":"IF(ISNUMBER(G1919),ROUND(E1919*G1919,2),\"\")","v":14.95}]
[null,null,null,null,null,null,"",null,""]
["SF-00324","Válvula de esfera em bronze 1 1/4\"",null,"un",null,"Sinapi 95251","",null,""]
[null,null,null,null,null,null,"",null,""]
[null,null,"Fita veda rosca em rolos de 18 mm x 50 m (L x C)","un ",1.9E-2,"Sinapi 95251",12.38,"Sinapi 3148",0.24,{"$f":"SUM(I1923:I1926)","v":92.86999999999999}]
[null,null,"VALVULA DE ESFERA BRUTA EM BRONZE, BITOLA 1 1/4 \" (REF 1552-B)","un",1,"Sinapi 95251",66.02,"Sinapi 11750",66.02]
[null,null,"Auxiliar de encanador ou bombeiro hidráulico com encargos complementares","h",0.78900000000000003,"Sinapi 95251",14.78,"Sinapi 88248",11.66]
[null,null,"Encanador ou Bombeiro Hidráulico com Encargos Complementares","h",0.78900000000000003,"Sinapi 95251",18.95,"Sinapi 88267",14.95]
[null,null,null,null,null,null,"",null,""]
["SF-00325","Válvula de esfera em bronze 1\"",null,"un",null,"Sinapi 95250","",null,""]
[null,null,null,null,null,null,"",null,""]
[null,null,"Fita veda rosca em rolos de 18 mm x 50 m (L x C)","un ",9.4999999999999998E-3,"Sinapi 95250",12.38,"Sinapi 3148",0.12,{"$f":"SUM(I1930:I1933)","v":70.549999999999983}]
[null,null,"Valvula de esfera bruta em bronze, bitola 1 \" (ref 1552-B)","un",1,"Sinapi 95250",44.3,"Sinapi 11746",44.3]
[null,null,"Auxiliar de encanador ou bombeiro hidráulico com encargos complementares","h",0.77449999999999997,"Sinapi 95250",14.78,"Sinapi 88248",11.45]
[null,null,"Encanador ou Bombeiro Hidráulico com Encargos Complementares","h",0.77449999999999997,"Sinapi 95250",18.95,"Sinapi 88267",14.68]
[null,null,null,null,null,null,"",null,""]
["SF-00326","Válvula de esfera em bronze 3/4\"",null,"un",null,"Sinapi 95249","",null,""]
[null,null,null,null,null,null,"",null,""]
[null,null,"Fita veda rosca em rolos de 18 mm x 50 m (L x C)","un ",9.4999999999999998E-3,"Sinapi 95249",12.38,"Sinapi 3148",0.12,{"$f":"SUM(I1937:I1940)","v":59.059999999999995}]
[null,null,"Valvula de esfera bruta em bronze, bitola 3/4 \" (ref 1552-B)","un",1,"Sinapi 95249",32.81,"Sinapi 11749",32.81]
[null,null,"Auxiliar de encanador ou bombeiro hidráulico com encargos complementares","h",0.77449999999999997,"Sinapi 95249",14.78,"Sinapi 88248",11.45]
[null,null,"Encanador ou Bombeiro Hidráulico com Encargos Complementares","h",0.77449999999999997,"Sinapi 95249",18.95,"Sinapi 88267",14.68]
[null,null,null,null,null,null,"",null,""]
["SF-00327","Isolamento elastomérico em formato de prancha autoadesiva",null,"m2",null,"Senado Federal","",null,""]
[null,null,null,null,null,null,"",null,""]
[null,null,"Auxiliar de encanador ou bombeiro hidráulico com encargos complementares","h",0.1,"Senado Federal",14.78,"Sinapi 88248",1.48,{"$f":"SUM(I1944:I1946)","v":107.64999999999999}]
[null,null,"Encanador ou Bombeiro Hidráulico com Encargos Complementares","h",0.1,"Senado Federal",18.95,"Sinapi 88267",1.9]
[null,null,"Isolamento elastomérico em formato prancha autoadesiva de espessura M. Ref.: AF/Armaflex M-99/E-A, K-Flex ST","m2",1.05,"Senado Federal",99.3,"Pesquisa de Preços",104.27]
[null,null,null,null,null,null,"",null,""]
["SF-00328","Isolamento elastomérico para tubulações de cobre de 1 1/8\" / tubulações de ferro de 3/4\"",null,"m",null,"Sinapi 97330 Adaptada","",null,""]
[null,null,null,null,null,null,"",null,""]
[null,null,"Isolamento elastomérico em formato de tubo ou coquilha de espessura M, próprio para tubulação de cobre de diâmetro nominal 1 1/8\" e para tubulações de ferro de diâmetro nominal 3/4\". Ref.: AF/Armaflex M-28, K-Flex ST","m",1.0210999999999999,"Sinapi 97330",11.22,"Pesquisa de Preços",11.46,{"$f":"SUM(I1950:I1952)","v":12.1}]
[null,null,"Auxiliar de encanador ou bombeiro hidráulico com encargos complementares","h",{"$f":"0.064*0.3","v":1.9199999999999998E-2},"Sinapi 97330",14.78,"Sinapi 88248",0.28000000000000003]
[null,null,"Encanador ou Bombeiro Hidráulico com Encargos Complementares","h",{"$f":"0.064*0.3","v":1.9199999999999998E-2},"Sinapi 97330",18.95,"Sinapi 88267",0.36]
[null,null,null,null,null,null,"",null,""]
[null,null,"As seguintes proporções foram consideradas quanto ao tempo de mão de obra: 70% para instalação do tubo e 30% para instalação do isolamento térmico.",null,null,null,"",null,""]
[null,null,null,null,null,null,"",null,""]
["SF-00329","Isolamento elastomérico para tubulações de cobre de 1/2\"",null,"m",null,"Sinapi 97329 Adaptada","",null,""]
[null,null,null,null,null,null,"",null,""]
[null,null,"Isolamento elastomérico em formato de tubo ou coquilha de espessura M, próprio para tubulação de cobre de diâmetro nominal 1/2\". Ref.: AF/Armaflex M-12, K-Flex ST","m",1.0210999999999999,"Sinapi 97329",7.52,"Pesquisa de Preços",7.68,{"$f":"SUM(I1958:I1960)","v":8.2999999999999989}]
[null,null,"Auxiliar de encanador ou bombeiro hidráulico com encargos complementares","h",{"$f":"0.061*0.3","v":1.83E-2},"Sinapi 97329",14.78,"Sinapi 88248",0.27]
[null,null,"Encanador ou Bombeiro Hidráulico com Encargos Complementares","h",{"$f":"0.061*0.3","v":1.83E-2},"Sinapi 97329",18.95,"Sinapi 88267",0.35]
[null,null,null,null,null,null,"",null,""]
[null,null,"Obs.: As seguintes proporções foram consideradas quanto ao tempo de mão de obra: 70% para instalação do tubo e 30% para instalação do isolamento térmico.",null,null,null,"",null,""]
[null,null,null,null,null,null,"",null,""]
["SF-00330","Isolamento elastomérico para tubulações de cobre de 1/4\"",null,"m",null,"Sinapi 97327 Adaptada","",null,""]
[null,null,null,null,null,null,"",null,""]
[null,null,"Isolamento elastomérico em formato de tubo ou coquilha de espessura M, próprio para tubulação de cobre de diâmetro nominal 1/4\". Ref.: AF/Armaflex M-06, K-Flex ST","m",1.0210999999999999,"Sinapi 97327",4.78,"Pesquisa de Preços",4.88,{"$f":"SUM(I1966:I1968)","v":5.41}]
[null,null,"Auxiliar de encanador ou bombeiro hidráulico com encargos complementares","h",{"$f":"0.052*0.3","v":1.5599999999999999E-2},"Sinapi 97327",14.78,"Sinapi 88248",0.23]
[null,null,"Encanador ou Bombeiro Hidráulico com Encargos Complementares","h",{"$f":"0.052*0.3","v":1.5599999999999999E-2},"Sinapi 97327",18.95,"Sinapi 88267",0.3]
[null,null,null,null,null,null,"",null,""]
[null,null,"Obs.: As seguintes proporções foram consideradas quanto ao tempo de mão de obra: 70% para instalação do tubo e 30% para instalação do isolamento térmico.",null,null,null,"",null,""]
[null,null,null,null,null,null,"",null,""]
["SF-00331","Isolamento elastomérico para tubulações de cobre de 3/4\"",null,"m",null,"Sinapi 97330 Adaptada","",null,""]
[null,null,null,null,null,null,"",null,""]
[null,null,"Isolamento elastomérico em formato de tubo ou coquilha de espessura M, próprio para tubulação de cobre de diâmetro nominal 3/4\". Ref.: AF/Armaflex M-18, K-Flex ST","m",1.0210999999999999,"Sinapi 97330",8.84,"Pesquisa de Preços",9.0299999999999994,{"$f":"SUM(I1974:I1976)","v":9.6699999999999982}]
[null,null,"Auxiliar de encanador ou bombeiro hidráulico com encargos complementares","h",{"$f":"0.064*0.3","v":1.9199999999999998E-2},"Sinapi 97330",14.78,"Sinapi 88248",0.28000000000000003]
[null,null,"Encanador ou Bombeiro Hidráulico com Encargos Complementares","h",{"$f":"0.064*0.3","v":1.9199999999999998E-2},"Sinapi 97330",18.95,"Sinapi 88267",0.36]
[null,null,null,null,null,null,"",null,""]
[null,null,"Obs.: As seguintes proporções foram consideradas quanto ao tempo de mão de obra: 70% para instalação do tubo e 30% para instalação do isolamento térmico.",null,null,null,"",null,""]
[null,null,null,null,null,null,"",null,""]
["SF-00332","Isolamento elastomérico para tubulações de cobre de 3/8\"",null,"m",null,"Sinapi 97328 Adaptada","",null,""]
[null,null,null,null,null,null,"",null,""]
[null,null,"Isolamento elastomérico em formato de tubo ou coquilha de espessura M, próprio para tubulação de cobre de diâmetro nominal 3/8\". Ref.: AF/Armaflex M-10, K-Flex ST","m",1.0210999999999999,"Sinapi 97328",6.59,"Pesquisa de Preços",6.73,{"$f":"SUM(I1982:I1984)","v":7.3000000000000007}]
[null,null,"Auxiliar de encanador ou bombeiro hidráulico com encargos complementares","h",{"$f":"0.057*0.3","v":1.7100000000000001E-2},"Sinapi 97328",14.78,"Sinapi 88248",{"$f":"IF(ISNUMBER(G1983),ROUND(E1983*G1983,2),\"\")","v":0.25}]
[null,null,"Encanador ou Bombeiro Hidráulico com Encargos Complementares","h",{"$f":"0.057*0.3","v":1.7100000000000001E-2},"Sinapi 97328",18.95,"Sinapi 88267",0.32]
[null,null,null,null,null,null,"",null,""]
[null,null,"Obs.: As seguintes proporções foram consideradas quanto ao tempo de mão de obra: 70% para instalação do tubo e 30% para instalação do isolamento térmico.",null,null,null,"",null,""]
[null,null,null,null,null,null,"",null,""]
["SF-00333","Isolamento elastomérico para tubulações de cobre de 5/8\"",null,"m",null,"Sinapi 97330 Adaptada","",null,""]
[null,null,null,null,null,null,"",null,""]
[null,null,"Isolamento elastomérico em formato de tubo ou coquilha de espessura M, próprio para tubulação de cobre de diâmetro nominal 5/8\". Ref.: AF/Armaflex M-15, K-Flex ST","m",1.0210999999999999,"Sinapi 97330",8.14,"Pesquisa de Preços",8.31,{"$f":"SUM(I1990:I1992)","v":8.9499999999999993}]
[null,null,"Auxiliar de encanador ou bombeiro hidráulico com encargos complementares","h",{"$f":"0.064*0.3","v":1.9199999999999998E-2},"Sinapi 97330",14.78,"Sinapi 88248",0.28000000000000003]
[null,null,"Encanador ou Bombeiro Hidráulico com Encargos Complementares","h",{"$f":"0.064*0.3","v":1.9199999999999998E-2},"Sinapi 97330",18.95,"Sinapi 88267",0.36]
[null,null,null,null,null,null,"",null,""]
[null,null,"Obs.: As seguintes proporções foram consideradas quanto ao tempo de mão de obra: 70% para instalação do tubo e 30% para instalação do isolamento térmico.",null,null,null,"",null,""]
[null,null,null,null,null,null,"",null,""]
["SF-00334","Isolamento elastomérico para tubulações de cobre de 7/8\" / tubulações de ferro de 1/2\"",null,"m",null,"Sinapi 97330 Adaptada","",null,""]
[null,null,null,null,null,null,"",null,""]
[null,null,"Isolamento elastomérico em formato de tubo ou coquilha de espessura M, próprio para tubulação de cobre de diâmetro nominal 7/8\" e para tubulações de ferro de diâmetro nominal 1/2\". Ref.: AF/Armaflex M-22, K-Flex ST","m",1.0210999999999999,"Sinapi 97330",9.52,"Pesquisa de Preços",9.7200000000000006,{"$f":"SUM(I1998:I2000)","v":10.36}]
[null,null,"Auxiliar de encanador ou bombeiro hidráulico com encargos complementares","h",{"$f":"0.064*0.3","v":1.9199999999999998E-2},"Sinapi 97330",14.78,"Sinapi 88248",0.28000000000000003]
[null,null,"Encanador ou Bombeiro Hidráulico com Encargos Complementares","h",{"$f":"0.064*0.3","v":1.9199999999999998E-2},"Sinapi 97330",18.95,"Sinapi 88267",0.36]
[null,null,null,null,null,null,"",null,""]
[null,null,"Obs.: As seguintes proporções foram consideradas quanto ao tempo de mão de obra: 70% para instalação do tubo e 30% para instalação do isolamento térmico.",null,null,null,"",null,""]
[null,null,null,null,null,null,"",null,""]
["SF-00335","Isolamento elastomérico para tubulações de cobre de 1\"",null,"m",null,"Sinapi 97330 Adaptada","",null,""]
[null,null,null,null,null,null,"",null,""]
[null,null,"Isolamento elastomérico em formato de tubo ou coquilha de espessura M, próprio para tubulação de cobre de diâmetro nominal 1\". Ref.: AF/Armaflex M-25, K-Flex ST","m",1.0210999999999999,"Sinapi 97330",9.6999999999999993,"Pesquisa de Preços",9.9,{"$f":"SUM(I2006:I2008)","v":10.54}]
[null,null,"Auxiliar de encanador ou bombeiro hidráulico com encargos complementares","h",{"$f":"0.064*0.3","v":1.9199999999999998E-2},"Sinapi 97330",14.78,"Sinapi 88248",0.28000000000000003]
[null,null,"Encanador ou Bombeiro Hidráulico com Encargos Complementares","h",{"$f":"0.064*0.3","v":1.9199999999999998E-2},"Sinapi 97330",18.95,"Sinapi 88267",0.36]
[null,null,null,null,null,null,"",null,""]
[null,null,"Obs.: As seguintes proporções foram consideradas quanto ao tempo de mão de obra: 70% para instalação do tubo e 30% para instalação do isolamento térmico.",null,null,null,"",null,""]
[null,null,null,null,null,null,"",null,""]
["SF-00336","Isolamento elastomérico para tubulações de ferro de 1 1/2\"",null,"m",null,"Sinapi 97330 Adaptada","",null,""]
[null,null,null,null,null,null,"",null,""]
[null,null,"Isolamento elastomérico em formato de tubo ou coquilha de espessura M, próprio para tubulação ferro de diâmetro nominal 1 1/2\". Ref.: AF/Armaflex M-48, K-Flex ST","m",1.0210999999999999,"Sinapi 97330",19.59,"Pesquisa de Preços",20,{"$f":"SUM(I2014:I2016)","v":20.64}]
[null,null,"Auxiliar de encanador ou bombeiro hidráulico com encargos complementares","h",{"$f":"0.064*0.3","v":1.9199999999999998E-2},"Sinapi 97330",14.78,"Sinapi 88248",0.28000000000000003]
[null,null,"Encanador ou Bombeiro Hidráulico com Encargos Complementares","h",{"$f":"0.064*0.3","v":1.9199999999999998E-2},"Sinapi 97330",18.95,"Sinapi 88267",0.36]
[null,null,null,null,null,null,"",null,""]
[null,null,"Obs.: As seguintes proporções foram consideradas quanto ao tempo de mão de obra: 70% para instalação do tubo e 30% para instalação do isolamento térmico.",null,null,null,"",null,""]
[null,null,null,null,null,null,"",null,""]
["SF-00337","Isolamento elastomérico para tubulações de ferro de 1 1/4\"",null,"m",null,"Sinapi 97330 Adaptada","",null,""]
[null,null,null,null,null,null,"",null,""]
[null,null,"Isolamento elastomérico em formato de tubo ou coquilha de espessura M, próprio para tubulação ferro de diâmetro nominal 1 1/4\". Ref.: AF/Armaflex M-42, K-Flex ST","m",1.0210999999999999,"Sinapi 97330",17.28,"Pesquisa de Preços",17.64,{"$f":"SUM(I2022:I2024)","v":18.28}]
[null,null,"Auxiliar de encanador ou bombeiro hidráulico com encargos complementares","h",{"$f":"0.064*0.3","v":1.9199999999999998E-2},"Sinapi 97330",14.78,"Sinapi 88248",0.28000000000000003]
[null,null,"Encanador ou Bombeiro Hidráulico com Encargos Complementares","h",{"$f":"0.064*0.3","v":1.9199999999999998E-2},"Sinapi 97330",18.95,"Sinapi 88267",0.36]
[null,null,null,null,null,null,"",null,""]
[null,null,"Obs.: As seguintes proporções foram consideradas quanto ao tempo de mão de obra: 70% para instalação do tubo e 30% para instalação do isolamento térmico.",null,null,null,"",null,""]
[null,null,null,null,null,null,"",null,""]
["SF-00338","Isolamento elastomérico para tubulações de ferro de 1\"",null,"m",null,"Sinapi 97330 Adaptada","",null,""]
[null,null,null,null,null,null,"",null,""]
[null,null,"Isolamento elastomérico em formato de tubo ou coquilha de espessura M, próprio para tubulação ferro de diâmetro nominal 1\". Ref.: AF/Armaflex M-35, K-Flex ST","m",1.0210999999999999,"Sinapi 97330",13.78,"Pesquisa de Preços",14.07,{"$f":"SUM(I2030:I2032)","v":14.709999999999999}]
[null,null,"Auxiliar de encanador ou bombeiro hidráulico com encargos complementares","h",{"$f":"0.064*0.3","v":1.9199999999999998E-2},"Sinapi 97330",14.78,"Sinapi 88248",0.28000000000000003]
[null,null,"Encanador ou Bombeiro Hidráulico com Encargos Complementares","h",{"$f":"0.064*0.3","v":1.9199999999999998E-2},"Sinapi 97330",18.95,"Sinapi 88267",0.36]
[null,null,null,null,null,null,"",null,""]
[null,null,"Obs.: As seguintes proporções foram consideradas quanto ao tempo de mão de obra: 70% para instalação do tubo e 30% para instalação do isolamento térmico.",null,null,null,"",null,""]
[null,null,null,null,null,null,"",null,""]
["SF-00339","Proteção mecânica em alumínio",null,"m2",null,"Senado Federal","",null,""]
[null,null,null,null,null,null,"",null,""]
[null,null,"Auxiliar de encanador ou bombeiro hidráulico com encargos complementares","h",0.2,"Senado Federal",14.78,"Sinapi 88248",2.96,{"$f":"SUM(I2038:I2040)","v":21.29}]
[null,null,"Encanador ou Bombeiro Hidráulico com Encargos Complementares","h",0.2,"Senado Federal",18.95,"Sinapi 88267",3.79]
[null,null,"Alumínio corrugado sem barreira espessura mínima = 0,15mm","m2",1.05,"Senado Federal",13.85,"Pesquisa de Preços",14.54]
[null,null,null,null,null,null,"",null,""]
["SF-00340","Tubo de aço-carbono galvanizado 1 1/2\"",null,"m",null,"Sinapi 92653 Adaptada","",null,""]
[null,null,null,null,null,null,"",null,""]
[null,null,"Encanador ou Bombeiro Hidráulico com Encargos Complementares","h",0.29199999999999998,"Sinapi 92653",18.95,"Sinapi 88267",5.53,{"$f":"SUM(I2044:I2046)","v":49.49}]
[null,null,"Auxiliar de encanador ou bombeiro hidráulico com encargos complementares","h",0.29199999999999998,"Sinapi 92653",14.78,"Sinapi 88248",4.32]
[null,null,"TUBO ACO CARBONO SEM COSTURA 1 1/2\", E= *3,68 MM, SCHEDULE 40, 4,05 KG/M","m",1.0389999999999999,"Sinapi 92653",38.15,"Sinapi 40624",39.64]
[null,null,null,null,null,null,"",null,{"$f":"IF(ISNUMBER(G2047),ROUND(E2047*G2047,2),\"\")","v":""}]
["SF-00341","Tubo de aço-carbono galvanizado 1 1/4\"",null,"m",null,"Sinapi 92652 Adaptada","",null,""]
[null,null,null,null,null,null,"",null,""]
[null,null,"Encanador ou Bombeiro Hidráulico com Encargos Complementares","h",0.27500000000000002,"Sinapi 92652",18.95,"Sinapi 88267",5.21,{"$f":"SUM(I2050:I2052)","v":57.19}]
[null,null,"Auxiliar de encanador ou bombeiro hidráulico com encargos complementares","h",0.27500000000000002,"Sinapi 92652",14.78,"Sinapi 88248",4.0599999999999996]
[null,null,"Tubo de aço galvanizado sem costura schedule 40 Ø 1 1/4\"","m",1.0389999999999999,"Sinapi 92652",46.12,"Pini 13.109.000023.SER",47.92]
[null,null,null,null,null,null,"",null,""]
["SF-00342","Tubo de aço-carbono galvanizado 1\"",null,"m",null,"Sinapi 92688 Adaptada","",null,""]
[null,null,null,null,null,null,"",null,""]
[null,null,"Encanador ou Bombeiro Hidráulico com Encargos Complementares","h",0.29699999999999999,"Sinapi 92688",18.95,"Sinapi 88267",5.63,{"$f":"SUM(I2056:I2058)","v":45.099999999999994}]
[null,null,"Auxiliar de encanador ou bombeiro hidráulico com encargos complementares","h",0.29699999999999999,"Sinapi 92688",14.78,"Sinapi 88248",4.3899999999999997]
[null,null,"Tubo de aço galvanizado sem costura schedule 40 Ø 1\"","m",1.0389999999999999,"Sinapi 92688",33.76,"Pini 13.109.000022.SER",35.08]
[null,null,null,null,null,null,"",null,""]
["SF-00343","Tubo de aço-carbono galvanizado 3/4\"",null,"m",null,"Sinapi 92688 Adaptada","",null,""]
[null,null,null,null,null,null,"",null,""]
[null,null,"Encanador ou Bombeiro Hidráulico com Encargos Complementares","h",0.29699999999999999,"Sinapi 92688",18.95,"Sinapi 88267",5.63,{"$f":"SUM(I2062:I2064)","v":34.14}]
[null,null,"Auxiliar de encanador ou bombeiro hidráulico com encargos complementares","h",0.29699999999999999,"Sinapi 92688",14.78,"Sinapi 88248",4.3899999999999997]
[null,null,"TUBO ACO CARBONO SEM COSTURA 3/4\", E= *2,87 MM, SCHEDULE 40, *1,69 KG/M","m",1.0389999999999999,"Sinapi 92688",23.21,"Sinapi 21150",24.12]
[null,null,null,null,null,null,"",null,""]
["SF-00344","Tubo de cobre de 1/2\"",null,"m",null,"Sinapi 97329 Adaptada","",null,""]
[null,null,null,null,null,null,"",null,""]
[null,null,"Tubo de cobre flexivel, D = 1/2 \", E = 0,79 mm, para ar-condicionado/ instalacoes gas residenciais e comerciais","m",1.0210999999999999,"Sinapi 97329",21.04,"Sinapi 39660",21.48,{"$f":"SUM(I2068:I2070)","v":22.919999999999998}]
[null,null,"Auxiliar de encanador ou bombeiro hidráulico com encargos complementares","h",{"$f":"0.061*0.7","v":4.2699999999999995E-2},"Sinapi 97329",14.78,"Sinapi 88248",0.63]
[null,null,"Encanador ou Bombeiro Hidráulico com Encargos Complementares","h",{"$f":"0.061*0.7","v":4.2699999999999995E-2},"Sinapi 97329",18.95,"Sinapi 88267",0.81]
[null,null,null,null,null,null,"",null,""]
[null,null,"Obs.: As seguintes proporções foram consideradas quanto ao tempo de mão de obra: 70% para instalação do tubo e 30% para instalação do isolamento térmico.",null,null,null,"",null,""]
[null,null,null,null,null,null,"",null,""]
["SF-00345","Tubo de cobre de 1/4\"",null,"m",null,"Sinapi 97327 Adaptada","",null,""]
[null,null,null,null,null,null,"",null,""]
[null,null,"Tubo de cobre flexivel, D = 1/4 \", E = 0,79 mm, para ar-condicionado/ instalacoes gas residenciais e comerciais","m",1.0210999999999999,"Sinapi 97327",10.09,"Sinapi 39662",10.3,{"$f":"SUM(I2076:I2078)","v":11.53}]
[null,null,"Auxiliar de encanador ou bombeiro hidráulico com encargos complementares","h",{"$f":"0.052*0.7","v":3.6399999999999995E-2},"Sinapi 97327",14.78,"Sinapi 88248",0.54]
[null,null,"Encanador ou Bombeiro Hidráulico com Encargos Complementares","h",{"$f":"0.052*0.7","v":3.6399999999999995E-2},"Sinapi 97327",18.95,"Sinapi 88267",0.69]
[null,null,null,null,null,null,"",null,""]
[null,null,"Obs.: As seguintes proporções foram consideradas quanto ao tempo de mão de obra: 70% para instalação do tubo e 30% para instalação do isolamento térmico.",null,null,null,"",null,""]
[null,null,null,null,null,null,"",null,""]
["SF-00346","Tubo de cobre de 3/4\"",null,"m",null,"Sinapi 97330 Adaptada","",null,""]
[null,null,null,null,null,null,"",null,""]
[null,null,"Tubo de cobre flexivel, D = 3/4 \", E = 0,79 mm, para ar-condicionado/ instalacoes gas residenciais e comerciais","m",1.0210999999999999,"Sinapi 97330",31.66,"Sinapi 39666",32.33,{"$f":"SUM(I2084:I2086)","v":33.839999999999996}]
[null,null,"Auxiliar de encanador ou bombeiro hidráulico com encargos complementares","h",{"$f":"0.064*0.7","v":4.48E-2},"Sinapi 97330",14.78,"Sinapi 88248",0.66]
[null,null,"Encanador ou Bombeiro Hidráulico com Encargos Complementares","h",{"$f":"0.064*0.7","v":4.48E-2},"Sinapi 97330",18.95,"Sinapi 88267",0.85]
[null,null,null,null,null,null,"",null,""]
[null,null,"Obs.: As seguintes proporções foram consideradas quanto ao tempo de mão de obra: 70% para instalação do tubo e 30% para instalação do isolamento térmico.",null,null,null,"",null,""]
[null,null,null,null,null,null,"",null,""]
["SF-00347","Tubo de cobre de 3/8\"",null,"m",null,"Sinapi 97328 Adaptada","",null,""]
[null,null,null,null,null,null,"",null,""]
[null,null,"Tubo de cobre flexivel, D = 3/8 \", E = 0,79 mm, para ar-condicionado/ instalacoes gas residenciais e comerciais","m",1.0210999999999999,"Sinapi 97328",15.52,"Sinapi 39664",15.85,{"$f":"SUM(I2092:I2094)","v":17.200000000000003}]
[null,null,"Auxiliar de encanador ou bombeiro hidráulico com encargos complementares","h",{"$f":"0.057*0.7","v":3.9899999999999998E-2},"Sinapi 97328",14.78,"Sinapi 88248",0.59]
[null,null,"Encanador ou Bombeiro Hidráulico com Encargos Complementares","h",{"$f":"0.057*0.7","v":3.9899999999999998E-2},"Sinapi 97328",18.95,"Sinapi 88267",0.76]
[null,null,null,null,null,null,"",null,""]
[null,null,"Obs.: As seguintes proporções foram consideradas quanto ao tempo de mão de obra: 70% para instalação do tubo e 30% para instalação do isolamento térmico.",null,null,null,"",null,""]
[null,null,null,null,null,null,"",null,""]
["SF-00348","Tubo de cobre de 5/8\"",null,"m",null,"Sinapi 97330 Adaptada","",null,""]
[null,null,null,null,null,null,"",null,""]
[null,null,"Tubo de cobre flexivel, D = 5/8 \", E = 0,79 mm, para ar-condicionado/ instalacoes gas residenciais e comerciais","m",1.0210999999999999,"Sinapi 97330",26.18,"Sinapi 39665",26.73,{"$f":"SUM(I2100:I2102)","v":28.240000000000002}]
[null,null,"Auxiliar de encanador ou bombeiro hidráulico com encargos complementares","h",{"$f":"0.064*0.7","v":4.48E-2},"Sinapi 97330",14.78,"Sinapi 88248",0.66]
[null,null,"Encanador ou Bombeiro Hidráulico com Encargos Complementares","h",{"$f":"0.064*0.7","v":4.48E-2},"Sinapi 97330",18.95,"Sinapi 88267",0.85]
[null,null,null,null,null,null,"",null,""]
[null,null,"Obs.: As seguintes proporções foram consideradas quanto ao tempo de mão de obra: 70% para instalação do tubo e 30% para instalação do isolamento térmico.",null,null,null,"",null,""]
[null,null,null,null,null,null,"",null,""]
["SF-00349","Tubo de cobre de 7/8\"",null,"m",null,"Sinapi 97330 Adaptada","",null,""]
[null,null,null,null,null,null,"",null,""]
[null,null,"Tubo de cobre flexivel, D = 7/8 \", E = 0,79 mm, para ar-condicionado/ instalacoes gas residenciais e comerciais","m",1.0210999999999999,"Sinapi 97330",27.89,"Pini 19.105.001505.MAT",28.48,{"$f":"SUM(I2108:I2110)","v":29.990000000000002}]
[null,null,"Auxiliar de encanador ou bombeiro hidráulico com encargos complementares","h",{"$f":"0.064*0.7","v":4.48E-2},"Sinapi 97330",14.78,"Sinapi 88248",0.66]
[null,null,"Encanador ou Bombeiro Hidráulico com Encargos Complementares","h",{"$f":"0.064*0.7","v":4.48E-2},"Sinapi 97330",18.95,"Sinapi 88267",0.85]
[null,null,null,null,null,null,"",null,{"$f":"IF(ISNUMBER(G2111),ROUND(E2111*G2111,2),\"\")","v":""}]
[null,null,"Obs.: As seguintes proporções foram consideradas quanto ao tempo de mão de obra: 70% para instalação do tubo e 30% para instalação do isolamento térmico.",null,null,null,"",null,""]
[null,null,null,null,null,null,"",null,""]
["SF-00350","Tubo de cobre de 1\"",null,"m",null,"Sinapi 97330 Adaptada","",null,""]
[null,null,null,null,null,null,"",null,""]
[null,null,"Tubo de cobre flexivel, D = 1 \", E = 0,79 mm, para ar-condicionado/ instalacoes gas residenciais e comerciais","m",1.0210999999999999,"Sinapi 97330",31.65,"Pini 19.105.001505.MAT Adaptado",32.32,{"$f":"SUM(I2116:I2118)","v":33.83}]
[null,null,"Auxiliar de encanador ou bombeiro hidráulico com encargos complementares","h",{"$f":"0.064*0.7","v":4.48E-2},"Sinapi 97330",14.78,"Sinapi 88248",0.66]
[null,null,"Encanador ou Bombeiro Hidráulico com Encargos Complementares","h",{"$f":"0.064*0.7","v":4.48E-2},"Sinapi 97330",18.95,"Sinapi 88267",0.85]
[null,null,null,null,null,null,"",null,""]
[null,null,"Obs.: As seguintes proporções foram consideradas quanto ao tempo de mão de obra: 70% para instalação do tubo e 30% para instalação do isolamento térmico.",null,null,null,"",null,""]
[null,null,null,null,null,null,"",null,""]
["SF-00351","Tubo de cobre de 1 1/8\"",null,"m",null,"Sinapi 97330 Adaptada","",null,""]
[null,null,null,null,null,null,"",null,""]
[null,null,"Tubo de cobre flexivel, D = 1 1/8 \", E = 0,79 mm, para ar-condicionado/ instalacoes gas residenciais e comerciais","m",1.0210999999999999,"Sinapi 97330",35.409999999999997,"Pini 19.105.001506.MAT",36.159999999999997,{"$f":"SUM(I2124:I2126)","v":37.669999999999995}]
[null,null,"Auxiliar de encanador ou bombeiro hidráulico com encargos complementares","h",{"$f":"0.064*0.7","v":4.48E-2},"Sinapi 97330",14.78,"Sinapi 88248",0.66]
[null,null,"Encanador ou Bombeiro Hidráulico com Encargos Complementares","h",{"$f":"0.064*0.7","v":4.48E-2},"Sinapi 97330",18.95,"Sinapi 88267",0.85]
[null,null,null,null,null,null,"",null,""]
[null,null,"Obs.: As seguintes proporções foram consideradas quanto ao tempo de mão de obra: 70% para instalação do tubo e 30% para instalação do isolamento térmico.",null,null,null,"",null,""]
[null,null,null,null,null,null,"",null,""]
["SF-00354","Instalação de armários reaproveitados",null,"m2",null,"SEINFRA C0222 Adaptada","",null,""]
[null,null,null,null,null,null,"",null,""]
[null,null,"Marceneiro com encargos complementares","h",1.8,"SEINFRA C0222",19.53,"Sinapi 88273",35.15,{"$f":"SUM(I2132:I2133)","v":86.09}]
[null,null,"Ajudante de carpinteiro com encargos complementares","h",3.15,"SEINFRA C0222",16.170000000000002,"Sinapi 88239",50.94]
[null,null,null,null,null,null,"",null,""]
["SF-00355","Mesa/tampo de MDF, fixada em parede com mão-francesa",null,"m2",null,"Senado Federal","",null,""]
[null,null,null,null,null,null,"",null,""]
[null,null,"Marceneiro com encargos complementares","h",1.8,"Senado Federal",19.53,"Sinapi 88273",35.15,{"$f":"SUM(I2137:I2140)","v":169.23}]
[null,null,"Ajudante de carpinteiro com encargos complementares","h",{"$f":"3.15/2","v":1.575},"Senado Federal",16.170000000000002,"Sinapi 88239",25.47]
[null,null,"Suporte mao-francesa em aco, abas iguais 40 cm, capacidade minima 70 kg, branco","un",2,"Senado Federal",28.54,"Sinapi 37591",57.08]
[null,null,"Chapa de MDF branco liso 2 faces, e = 25 mm, de *2,75 x 1,85* m","m2",1,"Senado Federal",51.53,"Sinapi 34666",51.53]
[null,null,null,null,null,null,"",null,""]
["SF-00356","Painel para TV de 120 x 180 cm",null,"un",null,"Senado Federal","",null,""]
[null,null,null,null,null,null,"",null,""]
[null,null,"Marceneiro com encargos complementares","h",1,"Senado Federal",19.53,"Sinapi 88273",19.53,{"$f":"SUM(I2144:I2146)","v":234.7}]
[null,null,"Ajudante de carpinteiro com encargos complementares","h",1,"Senado Federal",16.170000000000002,"Sinapi 88239",16.170000000000002]
[null,null,"Painel de TV de 120 x 180 cm, fabricado em MDP. Ref.: Urbe Móveis Plus","un",1,"Senado Federal",199,"Pesquisa de Preços",199]
[null,null,null,null,null,null,"",null,""]
["SF-00357","Painel para TV de 160 x 160 cm",null,"un",null,"Senado Federal","",null,""]
[null,null,null,null,null,null,"",null,""]
[null,null,"Marceneiro com encargos complementares","h",1,"Senado Federal",19.53,"Sinapi 88273",19.53,{"$f":"SUM(I2150:I2152)","v":501.81}]
[null,null,"Ajudante de carpinteiro com encargos complementares","h",1,"Senado Federal",16.170000000000002,"Sinapi 88239",16.170000000000002]
[null,null,"Painel de TV de 160 x 160 cm, fabricado em MDP. Ref.: HB Móveis Life Canyon, HB Móveis Livin","un",1,"Senado Federal",466.11,"Pesquisa de Preços",466.11]
[null,null,null,null,null,null,"",null,""]
["SF-00358","Painel para TV de 90 x 120 cm",null,"un",null,"Senado Federal","",null,""]
[null,null,null,null,null,null,"",null,""]
[null,null,"Marceneiro com encargos complementares","h",1,"Senado Federal",19.53,"Sinapi 88273",19.53,{"$f":"SUM(I2156:I2158)","v":130.94999999999999}]
[null,null,"Ajudante de carpinteiro com encargos complementares","h",1,"Senado Federal",16.170000000000002,"Sinapi 88239",16.170000000000002]
[null,null,"Painel de TV de 90 x 120 cm, fabricado em MDP. Ref.: Germai Ipanema 90 x 120 x 26,5","un",1,"Senado Federal",95.25,"Pesquisa de Preços",95.25]
[null,null,null,null,null,null,"",null,""]
["SF-00359","Batentes e guarnições para porta, em madeira",null,"un",null,"Sinapi 90818","",null,""]
[null,null,null,null,null,null,"",null,""]
[null,null,"Prego de aco polido com cabeca 18 x 27 (2 1/2 x 10)","kg",0.2,"Sinapi 90818",8.9600000000000009,"Sinapi 5061",1.79,{"$f":"SUM(I2162:I2168)","v":309.71999999999997}]
[null,null,"Tinta asfaltica impermeabilizante dispersa em agua, para materiais cimenticios","l",0.17369999999999999,"Sinapi 90818",7.79,"Sinapi 7319",1.35]
[null,null,"Carpinteiro de esquadria com encargos complementares","h",0.65500000000000003,"Sinapi 90818",19.22,"Sinapi 88261",12.59]
[null,null,"Pedreiro com Encargos Complementares","h",1.617,"Sinapi 90818",19.32,"Sinapi 88309",31.24]
[null,null,"Servente com Encargos Complementares","h",1.1359999999999999,"Sinapi 90818",14.21,"Sinapi 88316",16.14]
[null,null,"Argamassa traço 1:3 (cimento e areia média), preparo manual. AF_08/2014","m3",2.29E-2,"Sinapi 90818",409.51,"Sinapi 88629",9.3800000000000008]
[null,null,"Aduela / marco / batente para porta de 90x210cm, padrão médio - fornecimento e montagem. AF_08/2015","un",1,"Sinapi 90818",237.23,"Sinapi 90803",237.23]
[null,null,null,null,null,null,"",null,""]
["SF-00360","Chapa de proteção para porta – Linha Acessibilidade",null,"m2",null,"Seinfra C4621 Adaptada","",null,""]
[null,null,null,null,null,null,"",null,""]
[null,null,"Servente com Encargos Complementares","h",0.3,"Seinfra C4621 Adaptada",14.21,"Sinapi 88316",4.26,{"$f":"SUM(I2172:I2174)","v":193.28}]
[null,null,"Marceneiro com encargos complementares","h",0.3,"Seinfra C4621 Adaptada",19.53,"Sinapi 88273",5.86]
[null,null,"Chapa de proteção em aço inox AISI 304, largura conforme projeto, 400 mm de altura, chapa com espessura de 1 mm, acabamento escovado fosco","m2",1,"Seinfra C4621 Adaptada",183.16,"Pesquisa de Preços",183.16]
[null,null,null,null,null,null,"",null,{"$f":"IF(ISNUMBER(G2175),ROUND(E2175*G2175,2),\"\")","v":""}]
["SF-00361","Folha de porta em madeira 2,10x0,60m, com ou sem bandeira, e dobradiças",null,"un",null,"Sinapi 91009 Adaptada","",null,""]
[null,null,null,null,null,null,"",null,""]
[null,null,"DOBRADICA EM LATAO, 3 \" X 2 1/2 \", E= 1,9 A 2 MM, COM ANEL, CROMADO, TAMPA BOLA, COM PARAFUSOS","UN",3,"Sinapi 91009",19.690000000000001,"Sinapi 11447",59.07,{"$f":"SUM(I2178:I2182)","v":262.13}]
[null,null,"PORTA DE MADEIRA, FOLHA MEDIA (NBR 15930) DE 60 X 210 CM, E = 35 MM, NUCLEO SARRAFEADO, CAPA LISA EM HDF, ACABAMENTO LAMINADO NATURAL PARA VERNIZ","UN",1,"Sinapi 91009",168.52,"Sinapi 5020",168.52]
[null,null,"PARAFUSO ROSCA SOBERBA ZINCADO CABECA CHATA FENDA SIMPLES 3,5 X 25 MM (1 \")","UN",19.8,"Sinapi 91009",0.04,"Sinapi 11055",0.79]
[null,null,"CARPINTEIRO DE ESQUADRIA COM ENCARGOS COMPLEMENTARES","H",1.282,"Sinapi 91009",19.22,"Sinapi 88261",24.64]
[null,null,"SERVENTE COM ENCARGOS COMPLEMENTARES","H",0.64100000000000001,"Sinapi 91009",14.21,"Sinapi 88316",9.11]
[null,null,null,null,null,null,"",null,""]
["SF-00362","Folha de porta em madeira 2,10x0,70m, com ou sem bandeira, e dobradiças",null,"un",null,"Sinapi 91010 Adaptada","",null,""]
[null,null,null,null,null,null,"",null,""]
[null,null,"DOBRADICA EM LATAO, 3 \" X 2 1/2 \", E= 1,9 A 2 MM, COM ANEL, CROMADO, TAMPA BOLA, COM PARAFUSOS","UN",3,"Sinapi 91009",19.690000000000001,"Sinapi 11447",59.07,{"$f":"SUM(I2186:I2190)","v":213.19}]
[null,null,"PORTA DE MADEIRA, FOLHA MEDIA (NBR 15930) DE 70 X 210 CM, E = 35 MM, NUCLEO SARRAFEADO, CAPA LISA EM HDF, ACABAMENTO EM LAMINADO NATURAL PARA VERNIZ","UN",1,"Sinapi 91010",116.1,"Sinapi 4981",116.1]
[null,null,"PARAFUSO ROSCA SOBERBA ZINCADO CABECA CHATA FENDA SIMPLES 3,5 X 25 MM (1 \")","UN",19.8,"Sinapi 91010",0.04,"Sinapi 11055",0.79]
[null,null,"CARPINTEIRO DE ESQUADRIA COM ENCARGOS COMPLEMENTARES","H",1.4139999999999999,"Sinapi 91010",19.22,"Sinapi 88261",27.18]
[null,null,"SERVENTE COM ENCARGOS COMPLEMENTARES","H",0.70699999999999996,"Sinapi 91010",14.21,"Sinapi 88316",10.050000000000001]
[null,null,null,null,null,null,"",null,""]
["SF-00363","Folha de porta em madeira 2,10x0,80m, com ou sem bandeira, e dobradiças",null,"un",null,"Sinapi 91011 Adaptada","",null,""]
[null,null,null,null,null,null,"",null,""]
[null,null,"DOBRADICA EM LATAO, 3 \" X 2 1/2 \", E= 1,9 A 2 MM, COM ANEL, CROMADO, TAMPA BOLA, COM PARAFUSOS","UN",3,"Sinapi 91009",19.690000000000001,"Sinapi 11447",59.07,{"$f":"SUM(I2194:I2198)","v":298.27000000000004}]
[null,null,"PORTA DE MADEIRA, FOLHA MEDIA (NBR 15930) DE 80 X 210 CM, E = 35 MM, NUCLEO SARRAFEADO, CAPA LISA EM HDF, ACABAMENTO EM LAMINADO NATURAL PARA VERNIZ","UN",1,"Sinapi 91011",197.72,"Sinapi 4992",197.72]
[null,null,"PARAFUSO ROSCA SOBERBA ZINCADO CABECA CHATA FENDA SIMPLES 3,5 X 25 MM (1 \")","UN",19.8,"Sinapi 91011",0.04,"Sinapi 11055",0.79]
[null,null,"CARPINTEIRO DE ESQUADRIA COM ENCARGOS COMPLEMENTARES","H",1.546,"Sinapi 91011",19.22,"Sinapi 88261",29.71]
[null,null,"SERVENTE COM ENCARGOS COMPLEMENTARES","H",0.77300000000000002,"Sinapi 91011",14.21,"Sinapi 88316",10.98]
[null,null,null,null,null,null,"",null,""]
["SF-00364","Folha de porta em madeira 2,10x0,90m, com ou sem bandeira, e dobradiças",null,"un",null,"Sinapi 91012 Adaptada","",null,""]
[null,null,null,null,null,null,"",null,""]
[null,null,"DOBRADICA EM LATAO, 3 \" X 2 1/2 \", E= 1,9 A 2 MM, COM ANEL, CROMADO, TAMPA BOLA, COM PARAFUSOS","UN",3,"Sinapi 91009",19.690000000000001,"Sinapi 11447",59.07,{"$f":"SUM(I2202:I2206)","v":285.68}]
[null,null,"PORTA DE MADEIRA, FOLHA MEDIA (NBR 15930) DE 90 X 210 CM, E = 35 MM, NUCLEO SARRAFEADO, CAPA LISA EM HDF, ACABAMENTO EM LAMINADO NATURAL PARA VERNIZ","UN",1,"Sinapi 91012",181.65,"Sinapi 4987",181.65]
[null,null,"PARAFUSO ROSCA SOBERBA ZINCADO CABECA CHATA FENDA SIMPLES 3,5 X 25 MM (1 \")","UN",19.8,"Sinapi 91012",0.04,"Sinapi 11055",0.79]
[null,null,"CARPINTEIRO DE ESQUADRIA COM ENCARGOS COMPLEMENTARES","H",1.6779999999999999,"Sinapi 91012",19.22,"Sinapi 88261",32.25]
[null,null,"SERVENTE COM ENCARGOS COMPLEMENTARES","H",0.83899999999999997,"Sinapi 91012",14.21,"Sinapi 88316",11.92]
[null,null,null,null,null,null,"",null,""]
["SF-00365","Folha de porta em madeira 2,10x1,0m, com ou sem bandeira, e dobradiças",null,"un",null,"Sinapi 91012 Adaptada","",null,""]
[null,null,null,null,null,null,"",null,""]
[null,null,"DOBRADICA EM LATAO, 3 \" X 2 1/2 \", E= 1,9 A 2 MM, COM ANEL, CROMADO, TAMPA BOLA, COM PARAFUSOS","UN",3,"Sinapi 91009",19.690000000000001,"Sinapi 11447",59.07,{"$f":"SUM(I2210:I2214)","v":303.27000000000004}]
[null,null,"PORTA DE MADEIRA, FOLHA MEDIA (NBR 15930) DE 100 X 210 CM, E = 35 MM, NUCLEO SARRAFEADO, CAPA LISA EM HDF, ACABAMENTO EM LAMINADO NATURAL PARA VERNIZ","UN",1,"Sinapi 91012",199.24,"Sinapi 4989",199.24]
[null,null,"PARAFUSO ROSCA SOBERBA ZINCADO CABECA CHATA FENDA SIMPLES 3,5 X 25 MM (1 \")","UN",19.8,"Sinapi 91012",0.04,"Sinapi 11055",0.79]
[null,null,"CARPINTEIRO DE ESQUADRIA COM ENCARGOS COMPLEMENTARES","H",1.6779999999999999,"Sinapi 91012",19.22,"Sinapi 88261",32.25]
[null,null,"SERVENTE COM ENCARGOS COMPLEMENTARES","H",0.83899999999999997,"Sinapi 91012",14.21,"Sinapi 88316",11.92]
[null,null,null,null,null,null,"",null,""]
["SF-00366","Instalação de batentes de madeira reaproveitados",null,"un",null,"Sinapi 91294 Adaptada","",null,""]
[null,null,null,null,null,null,"",null,""]
[null,null,"Pedreiro com Encargos Complementares","h",0.65500000000000003,"Sinapi 91294",19.32,"Sinapi 88309",12.65,{"$f":"SUM(I2218:I2223)","v":72.39}]
[null,null,"Carpinteiro de esquadria com encargos complementares","h",1.617,"Sinapi 91294",19.22,"Sinapi 88261",31.08]
[null,null,"Servente com Encargos Complementares","h",1.1359999999999999,"Sinapi 91294",14.21,"Sinapi 88316",16.14]
[null,null,"Prego de aco polido com cabeca 18 x 27 (2 1/2 x 10)","kg",0.2,"Sinapi 91294",8.9600000000000009,"Sinapi 5061",1.79]
[null,null,"Tinta asfaltica impermeabilizante dispersa em agua, para materiais cimenticios","l",0.17369999999999999,"Sinapi 91294",7.79,"Sinapi 7319",1.35]
[null,null,"Argamassa traço 1:3 (cimento e areia média), preparo manual. AF_08/2014","m3",2.29E-2,"Sinapi 91294",409.51,"Sinapi 88629",9.3800000000000008]
[null,null,null,null,null,null,"",null,""]
["SF-00367","Instalação de folhas de portas e dobradiças reaproveitadas",null,"un",null,"Sinapi 72144","",null,""]
[null,null,null,null,null,null,"",null,""]
[null,null,"Carpinteiro de esquadria com encargos complementares","h",2.2000000000000002,"Sinapi 72144",19.22,"Sinapi 88261",42.28,{"$f":"SUM(I2227:I2228)","v":73.540000000000006}]
[null,null,"Servente com Encargos Complementares","h",2.2000000000000002,"Sinapi 72144",14.21,"Sinapi 88316",31.26]
[null,null,null,null,null,null,"",null,""]
["SF-00368","Dobradiça para porta",null,"un",null,"Sinapi 74047/2 Adaptada","",null,""]
[null,null,null,null,null,null,"",null,""]
[null,null,"DOBRADICA EM LATAO, 3 \" X 2 1/2 \", E= 1,9 A 2 MM, COM ANEL, CROMADO, TAMPA BOLA, COM PARAFUSOS","UN",1,"Sinapi 74047/2",19.690000000000001,"Sinapi 11447",19.690000000000001,{"$f":"SUM(I2232:I2234)","v":30.31}]
[null,null,"Ajudante de carpinteiro com encargos complementares","h",0.3,"Sinapi 74047/2",16.170000000000002,"Sinapi 88239",4.8499999999999996]
[null,null,"Carpinteiro de esquadria com encargos complementares","h",0.3,"Sinapi 74047/2",19.22,"Sinapi 88261",5.77]
[null,null,null,null,null,null,"",null,""]
["SF-00369","Fechadura para banheiro maçaneta em barra",null,"un",null,"Sinapi 90831 Adaptada","",null,""]
[null,null,null,null,null,null,"",null,""]
[null,null,"Fechadura para porta de banheiro, com maçaneta em formato de barra, confeccionada em aço com acabamento inox polido. Ref.: MZ 270 WC Standard – Linha Standard – Papaiz","un ",1,"Sinapi 90830 Adaptada",85.8,"Pesquisa de Preços",85.8,{"$f":"SUM(I2238:I2240)","v":105.99999999999999}]
[null,null,"Carpinteiro de esquadria com encargos complementares","h",0.76700000000000002,"Sinapi 90830 Adaptada",19.22,"Sinapi 88261",{"$f":"IF(ISNUMBER(G2239),ROUND(E2239*G2239,2),\"\")","v":14.74}]
[null,null,"Servente com Encargos Complementares","h",0.38400000000000001,"Sinapi 90830 Adaptada",14.21,"Sinapi 88316",5.46]
[null,null,null,null,null,null,"",null,""]
["SF-00370","Fechadura para porta externa maçaneta em barra",null,"un",null,"Sinapi 90830 Adaptada","",null,""]
[null,null,null,null,null,null,"",null,""]
[null,null,"Fechadura para porta externa, com maçaneta em formato de barra, confeccionada em zamac com acabamento cromado. Ref.: MZ 270 EXT Standard – Linha Standard – Papaiz","un ",1,"Sinapi 90830 Adaptada",94.51,"Pesquisa de Preços",94.51,{"$f":"SUM(I2244:I2246)","v":120.89000000000001}]
[null,null,"Carpinteiro de esquadria com encargos complementares","h",1.002,"Sinapi 90830 Adaptada",19.22,"Sinapi 88261",19.260000000000002]
[null,null,"Servente com Encargos Complementares","h",0.501,"Sinapi 90830 Adaptada",14.21,"Sinapi 88316",7.12]
[null,null,null,null,null,null,"",null,""]
["SF-00371","Fechadura para porta interna maçaneta tubular",null,"un",null,"Sinapi 90830 Adaptada","",null,""]
[null,null,null,null,null,null,"",null,""]
[null,null,"Fechadura para porta interna, com acabamento cromado brilhante, maçaneta tipo pera, com pino giratório central. Ref.: CJ 030 (externo) – Linha Professionel – La Fonte","un ",1,"Sinapi 90830 Adaptada",629.46,"Pesquisa de Preços",629.46,{"$f":"SUM(I2250:I2252)","v":655.84}]
[null,null,"Carpinteiro de esquadria com encargos complementares","h",1.002,"Sinapi 90830",19.22,"Sinapi 88261",19.260000000000002]
[null,null,"Servente com Encargos Complementares","h",0.501,"Sinapi 90830",14.21,"Sinapi 88316",7.12]
[null,null,null,null,null,null,"",null,""]
["SF-00372","Instalação de fechadura/puxador de porta reaproveitados",null,"m",null,"Sinapi 90830 Adaptada","",null,""]
[null,null,null,null,null,null,"",null,""]
[null,null,"Carpinteiro de esquadria com encargos complementares","h",1.002,"Sinapi 90830",19.22,"Sinapi 88261",19.260000000000002,{"$f":"SUM(I2256:I2257)","v":26.380000000000003}]
[null,null,"Servente com Encargos Complementares","h",0.501,"Sinapi 90830",14.21,"Sinapi 88316",7.12]
[null,null,null,null,null,null,"",null,""]
["SF-00373","Mola hidráulica aérea",null,"un",null,"Orse 01778 Adaptada","",null,""]
[null,null,null,null,null,null,"",null,""]
[null,null,"Marceneiro com encargos complementares","h",1,"Orse 01778 Adaptada",19.53,"Sinapi 88273",19.53,{"$f":"SUM(I2261:I2262)","v":144.23000000000002}]
[null,null,"Mola aérea para fechamento automático de portas com regulagem da velocidade de fechamento. Ref.: Mola automática – Modelo 453 - Coimbra","un",1,"Orse 01778 Adaptada",124.7,"Pesquisa de Preços",124.7]
[null,null,null,null,null,null,"",null,""]
["SF-00374","Pivô em latão com acabamento cromado para portas pivotantes",null,"un",null,"Senado Federal","",null,""]
[null,null,null,null,null,null,"",null,""]
[null,null,"Marceneiro com encargos complementares","h",{"$f":"1/2","v":0.5},"Senado Federal",19.53,"Sinapi 88273",9.77,{"$f":"SUM(I2266:I2267)","v":71.900000000000006}]
[null,null,"Pivô em latão com acabamento cromado para portas pivotantes até 150 kg. Conjunto completo composto de superior macho e fêmea e inferior macho e fêmea. Ref.: Pivô Strong 150 - La fonte","un",1,"Senado Federal",62.13,"Pesquisa de Preços",62.13]
[null,null,null,null,null,null,"",null,""]
["SF-00375","Cabo de dados tipo UTP, tipo LSZH, categoria 6",null,"m",null,"Sinapi 98295 Adaptada","",null,""]
[null,null,null,null,null,null,"",null,""]
[null,null,"Auxiliar de eletricista com encargos complementares","h",2.8E-3,"Sinapi 98295",15.22,"Sinapi 88247",0.04,{"$f":"SUM(I2271:I2273)","v":4.84}]
[null,null,"Eletricista com encargos complementares","h",2.8E-3,"Sinapi 98295",19.55,"Sinapi 88264",0.05]
[null,null,"Cabo de dados tipo UTP, tipo LSZH, categoria 6. Ref.: AMP 1989106-6","m",1.05,"Sinapi 98295",4.5199999999999996,"Pesquisa de Preços",4.75]
[null,null,null,null,null,null,"",null,""]
["SF-00376","Módulo (tomada) de rede RJ45, categoria 6, com conectorização e certificação",null,"un",null,"Sinapi 98307 Adaptada","",null,""]
[null,null,null,null,null,null,"",null,""]
[null,null,"Tampa p/ conector /RJ45. ref.: Schneider Electric PRM47761 (Padrão Keystone), Schneider Electric PRM47771 (Padrão AMP)","un ",1,"Senado Federal",5.74,"Pesquisa de Preços",5.74,{"$f":"SUM(I2277:I2281)","v":56.260000000000005}]
[null,null,"Módulo RJ 45 - CAT 6. Ref.: AMP 1375055-2","un ",1,"Senado Federal",22.65,"Pesquisa de Preços",22.65]
[null,null,"Certificação de ponto de rede","un ",1,"Senado Federal",13.53,"Pesquisa de Preços",13.53]
[null,null,"Auxiliar de eletricista com encargos complementares","h",{"$f":"0.2062*2","v":0.41239999999999999},"Sinapi 98307 Adaptada",15.22,"Sinapi 88247",6.28]
[null,null,"Eletricista com encargos complementares","h",{"$f":"0.2062*2","v":0.41239999999999999},"Sinapi 98307 Adaptada",19.55,"Sinapi 88264",8.06]
[null,null,null,null,null,null,"",null,""]
["SF-00377","Painel de distribuição (patch panel) de 24 portas, categoria 6",null,"un",null,"Sinapi 98302 Adaptada","",null,""]
[null,null,null,null,null,null,"",null,""]
[null,null,"Auxiliar de eletricista com encargos complementares","h",{"$f":"6.2007","v":6.2007000000000003},"Sinapi 98302",15.22,"Sinapi 88247",94.37,{"$f":"SUM(I2285:I2288)","v":1224.69}]
[null,null,"Eletricista com encargos complementares","h",{"$f":"6.2007","v":6.2007000000000003},"Sinapi 98302",19.55,"Sinapi 88264",121.22]
[null,null,"Painel de distribuição (patch panel) de 24 portas, categoria 6. Ref.: AMP 1375014-2","un",1,"Sinapi 98302 Adaptada",465.5,"Pesquisa de Preços",465.5]
[null,null,"Módulo RJ 45 - CAT 6. Ref.: AMP 1375055-2","un ",24,"Senado Federal",22.65,"Pesquisa de Preços",543.6]
[null,null,null,null,null,null,"",null,""]
["SF-00378","Cabo de telefonia tipo CCI 50x2",null,"m",null,"Sinapi 98262 Adaptada","",null,""]
[null,null,null,null,null,null,"",null,""]
[null,null,"Auxiliar de eletricista com encargos complementares","h",6.4100000000000004E-2,"Sinapi 98262",15.22,"Sinapi 88247",0.98,{"$f":"SUM(I2292:I2294)","v":2.68}]
[null,null,"Eletricista com encargos complementares","h",6.4100000000000004E-2,"Sinapi 98262",19.55,"Sinapi 88264",1.25]
[null,null,"Cabo de telefonia tipo CCI 50x2. Ref.: Multitoc CCI 50x2, Induscabos Cabos Telefônicos Interno CCI 50-2, GP Cabos Cabo CCI, CobreKabos CCI 50","m",1.05,"Sinapi 98262 Adaptada",0.43,"Pesquisa de Preços",0.45]
[null,null,null,null,null,null,"",null,""]
["SF-00379","Módulo (tomada) de rede RJ45, para telefonia",null,"un",null,"Sinapi 98307 Adaptada","",null,""]
[null,null,null,null,null,null,"",null,""]
[null,null,"Tampa p/ conector /RJ45. ref.: Schneider Electric PRM47761 (padrão Keystone), Schneider Electric PRM47771 (padrão AMP)","un ",1,"Senado Federal",5.74,"Pesquisa de Preços",5.74,{"$f":"SUM(I2298:I2301)","v":36.550000000000004}]
[null,null,"Tomada RJ45, 8 fios, CAT 5E (apenas modulo)","un ",1,"Senado Federal",23.64,"Sinapi 38104",23.64]
[null,null,"Auxiliar de eletricista com encargos complementares","h",0.20619999999999999,"Sinapi 98307",15.22,"Sinapi 88247",3.14]
[null,null,"Eletricista com encargos complementares","h",0.20619999999999999,"Sinapi 98307",19.55,"Sinapi 88264",4.03]
[null,null,null,null,null,null,"",null,""]
["SF-00380","Grelha para retorno para portas, divisórias e paredes 525x325 mm",null,"un",null,"Pini 19.104.000804.SER Adaptada","",null,{"$f":"IF(ISNUMBER(G2303),ROUND(E2303*G2303,2),\"\")","v":""}]
[null,null,null,null,null,null,"",null,""]
[null,null,"Ajudante de operação em geral com encargos complementares","h",3.5,"Pini 19.104.000804.SER",15.23,"Sinapi 88241",53.31,{"$f":"SUM(I2305:I2307)","v":309.99}]
[null,null,"MONTADOR ELETROMECÃNICO COM ENCARGOS COMPLEMENTARES","h",3.5,"Pini 19.104.000804.SER",20.239999999999998,"Sinapi 88279",70.84]
[null,null,"Grelha para retorno para portas, divisórias e paredes 525x325 mm, Ref. Trox AGS-T","un ",1,"Pini 19.104.000804.SER",185.84,"Pesquisa de Preços",185.84]
[null,null,null,null,null,null,"",null,""]
["SF-00898","Armação de aço CA-50 bitolas de 5,0mm a 8,00mm",null,"kg",null,"Sinapi 92777","",null,""]
[null,null,null,null,null,null,"",null,""]
[null,null,"ARAME RECOZIDO 18 BWG, 1,25 MM (0,01 KG/M)","KG",2.5000000000000001E-2,"Sinapi 92777",9.81,"Sinapi 337",0.25,{"$f":"SUM(I2311:I2315)","v":9.27}]
[null,null,"ESPACADOR / DISTANCIADOR CIRCULAR COM ENTRADA LATERAL, EM PLASTICO, PARA VERGALHAO *4,2 A 12,5* MM, COBRIMENTO 20 MM","UN",0.74299999999999999,"Sinapi 92777",0.14000000000000001,"Sinapi 39017",0.1]
[null,null,"AJUDANTE DE ARMADOR COM ENCARGOS COMPLEMENTARES","H",2.0899999999999998E-2,"Sinapi 92777",14.9,"Sinapi 88238",0.31]
[null,null,"ARMADOR COM ENCARGOS COMPLEMENTARES","H",0.1278,"Sinapi 92777",19.22,"Sinapi 88245",2.46]
[null,null,"CORTE E DOBRA DE AÇO CA-50, DIÂMETRO DE 8,0 MM, UTILIZADO EM ESTRUTURAS DIVERSAS, EXCETO LAJES. AF_12/2015","KG",1,"Sinapi 92777",6.15,"Sinapi 92793",6.15]
[null,null,null,null,null,null,"",null,""]
["SF-00915","Graute industrializado, fck ≥ 25MPa",null,"m3",null,"Sinapi 89994 Adaptada","",null,""]
[null,null,null,null,null,null,"",null,""]
[null,null,"PEDREIRO COM ENCARGOS COMPLEMENTARES","H",4.7313999999999998,"Sinapi 89994",19.32,"Sinapi 88309",91.41,{"$f":"SUM(I2319:I2321)","v":2763.97}]
[null,null,"SERVENTE COM ENCARGOS COMPLEMENTARES","H",3.3466,"Sinapi 89994",14.21,"Sinapi 88316",47.56]
[null,null,"GRAUTE CIMENTICIO PARA USO GERAL","KG",1875,"Sinapi 89994 Adaptada",1.4,"Sinapi 134",2625]
[null,null,null,null,null,null,"",null,""]
["SF-00916","Armação de aço CA-50 bitolas de 10,0mm a 12,50mm",null,"kg",null,"Sinapi 92779","",null,""]
[null,null,null,null,null,null,"",null,""]
[null,null,"ARAME RECOZIDO 18 BWG, 1,25 MM (0,01 KG/M)","KG",2.5000000000000001E-2,"Sinapi 92779",9.81,"Sinapi 337",0.25,{"$f":"SUM(I2325:I2329)","v":6.5600000000000005}]
[null,null,"ESPACADOR / DISTANCIADOR CIRCULAR COM ENTRADA LATERAL, EM PLASTICO, PARA VERGALHAO *4,2 A 12,5* MM, COBRIMENTO 20 MM","UN",0.36699999999999999,"Sinapi 92779",0.14000000000000001,"Sinapi 39017",0.05]
[null,null,"AJUDANTE DE ARMADOR COM ENCARGOS COMPLEMENTARES","H",1.14E-2,"Sinapi 92779",14.9,"Sinapi 88238",0.17]
[null,null,"ARMADOR COM ENCARGOS COMPLEMENTARES","H",6.9800000000000001E-2,"Sinapi 92779",19.22,"Sinapi 88245",1.34]
[null,null,"CORTE E DOBRA DE AÇO CA-50, DIÂMETRO DE 12,5 MM, UTILIZADO EM ESTRUTURAS DIVERSAS, EXCETO LAJES. AF_12/2015","KG",1,"Sinapi 92779",4.75,"Sinapi 92795",4.75]
[null,null,null,null,null,null,"",null,""]
["SF-00917","Armação de aço CA-50 bitolas de 16,0mm a 25,0mm",null,"kg",null,"Sinapi 92781","",null,""]
[null,null,null,null,null,null,"",null,""]
[null,null,"ARAME RECOZIDO 18 BWG, 1,25 MM (0,01 KG/M)","KG",2.5000000000000001E-2,"Sinapi 92781",9.81,"Sinapi 337",0.25,{"$f":"SUM(I2333:I2337)","v":5.4}]
[null,null,"ESPACADOR / DISTANCIADOR CIRCULAR COM ENTRADA LATERAL, EM PLASTICO, PARA VERGALHAO *4,2 A 12,5* MM, COBRIMENTO 20 MM","UN",0.113,"Sinapi 92781",0.14000000000000001,"Sinapi 39017",0.02]
[null,null,"AJUDANTE DE ARMADOR COM ENCARGOS COMPLEMENTARES","H",5.1000000000000004E-3,"Sinapi 92781",14.9,"Sinapi 88238",0.08]
[null,null,"ARMADOR COM ENCARGOS COMPLEMENTARES","H",3.1199999999999999E-2,"Sinapi 92781",19.22,"Sinapi 88245",0.6]
[null,null,"CORTE E DOBRA DE AÇO CA-50, DIÂMETRO DE 20,0 MM, UTILIZADO EM ESTRUTURAS DIVERSAS, EXCETO LAJES. AF_12/2015","KG",1,"Sinapi 92781",4.45,"Sinapi 92797",4.45]
[null,null,null,null,null,null,"",null,""]
["SF-00918","Remoção de mola hidráulica de piso",null,"un",null,"Pini 02.102.000042.SER Adaptada","",null,""]
[null,null,null,null,null,null,"",null,""]
[null,null,"Servente com Encargos Complementares","h",0.55000000000000004,"Pini 02.102.000042.SER",14.21,"Sinapi 88316",7.82,{"$f":"SUM(I2341:I2342)","v":17.689999999999998}]
[null,null,"Vidraceiro com encargos complementares","h",0.55000000000000004,"Senado Federal",17.940000000000001,"Sinapi 88325",9.8699999999999992]
[null,null,null,null,null,null,"",null,""]
["SF-00919","Escavação manual de valas",null,"m3",null,{"$f":"F2346","v":"Sinapi 93358"},"",null,""]
[null,null,null,null,null,null,"",null,""]
[null,null,"Servente com Encargos Complementares","h",3.956,"Sinapi 93358",14.21,"Sinapi 88316",56.21,{"$f":"SUM(I2346:I2346)","v":56.21}]
[null,null,null,null,null,null,"",null,""]
["SF-00920","Reaterro de vala com compactação mecanizada",null,"m3",null,"Sinapi 93382","",null,""]
[null,null,null,null,null,null,"",null,""]
[null,null,"SERVENTE COM ENCARGOS COMPLEMENTARES","H",0.65,"Sinapi 93382",14.21,"Sinapi 88316",9.24,{"$f":"SUM(I2350:I2353)","v":19.639999999999997}]
[null,null,"COMPACTADOR DE SOLOS DE PERCUSSÃO (SOQUETE) COM MOTOR A GASOLINA 4 TEMPOS, POTÊNCIA 4 CV - CHP DIURNO. AF_08/2015","CHP",0.27400000000000002,"Sinapi 93382",19,"Sinapi 91533",5.21]
[null,null,"COMPACTADOR DE SOLOS DE PERCUSSÃO (SOQUETE) COM MOTOR A GASOLINA 4 TEMPOS, POTÊNCIA 4 CV - CHI DIURNO. AF_08/2015","CHI",0.254,"Sinapi 93382",15.9,"Sinapi 91534",4.04]
[null,null,"UMIDIFICAÇÃO DE MATERIAL PARA VALAS COM CAMINHÃO PIPA 10000L. AF_11/2016","M3",1,"Sinapi 93382",1.1499999999999999,"Sinapi 95606",1.1499999999999999]
[null,null,null,null,null,null,"",null,""]
["SF-00921","Aterro de vala com compactação mecanizada",null,"m3",null,"Sinapi 94319 + Sinapi 97914 Adaptada","",null,""]
[null,null,null,null,null,null,"",null,""]
[null,null,"CAMINHÃO PIPA 10.000 L TRUCADO, PESO BRUTO TOTAL 23.000 KG, CARGA ÚTIL MÁXIMA 15.935 KG, DISTÂNCIA ENTRE EIXOS 4,8 M, POTÊNCIA 230 CV, INCLUSIVE TANQUE DE AÇO PARA TRANSPORTE DE ÁGUA - CHP DIURNO. AF_06/2014","CHP",6.0000000000000001E-3,"Sinapi 94319",153.97,"Sinapi 5901",0.92,{"$f":"SUM(I2357:I2363)","v":65.710000000000008}]
[null,null,"CAMINHÃO PIPA 10.000 L TRUCADO, PESO BRUTO TOTAL 23.000 KG, CARGA ÚTIL MÁXIMA 15.935 KG, DISTÂNCIA ENTRE EIXOS 4,8 M, POTÊNCIA 230 CV, INCLUSIVE TANQUE DE AÇO PARA TRANSPORTE DE ÁGUA - CHI DIURNO. AF_06/2014","CHI",3.0000000000000001E-3,"Sinapi 94319",31.68,"Sinapi 5903",0.1]
[null,null,"ARGILA, ARGILA VERMELHA OU ARGILA ARENOSA (RETIRADA NA JAZIDA, SEM TRANSPORTE)","M3",1.25,"Sinapi 94319",7.86,"Sinapi 6079",9.83]
[null,null,"SERVENTE COM ENCARGOS COMPLEMENTARES","H",0.65900000000000003,"Sinapi 94319",14.21,"Sinapi 88316",9.36]
[null,null,"COMPACTADOR DE SOLOS DE PERCUSSÃO (SOQUETE) COM MOTOR A GASOLINA 4 TEMPOS, POTÊNCIA 4 CV - CHP DIURNO. AF_08/2015","CHP",0.27400000000000002,"Sinapi 94319",19,"Sinapi 91533",5.21]
[null,null,"COMPACTADOR DE SOLOS DE PERCUSSÃO (SOQUETE) COM MOTOR A GASOLINA 4 TEMPOS, POTÊNCIA 4 CV - CHI DIURNO. AF_08/2015","CHI",0.254,"Sinapi 94319",15.9,"Sinapi 91534",4.04]
[null,null,"TRANSPORTE COM CAMINHÃO BASCULANTE DE 6 M3, EM VIA URBANA PAVIMENTADA, DMT ATÉ 30 KM (UNIDADE: M3XKM). AF_01/2018","m3xkm",{"$f":"1.25*20","v":25},"Sinapi 97914",1.45,"Sinapi 97914",36.25]
[null,null,null,null,null,null,"",null,""]
[null,null,"Obs.: Considerando fornecedor de argila a 20 km do Senado Federal.",null,null,null,"",null,""]
[null,null,null,null,null,null,"",null,""]
["SF-00922","Tubo de cobre classe \"E\" 22mm",null,"m",null,"Sinapi 92306","",null,{"$f":"IF(ISNUMBER(G2367),ROUND(E2367*G2367,2),\"\")","v":""}]
[null,null,null,null,null,null,"",null,""]
[null,null,"TUBO DE COBRE CLASSE \"E\", DN = 22 MM, PARA INSTALACAO HIDRAULICA PREDIAL","M",1.0210999999999999,"Sinapi 92306",27.48,"Sinapi 12743",28.06,{"$f":"SUM(I2369:I2371)","v":32.919999999999995}]
[null,null,"AUXILIAR DE ENCANADOR OU BOMBEIRO HIDRÁULICO COM ENCARGOS COMPLEMENTARES","H",0.14399999999999999,"Sinapi 92306",14.78,"Sinapi 88248",2.13]
[null,null,"ENCANADOR OU BOMBEIRO HIDRÁULICO COM ENCARGOS COMPLEMENTARES","H",0.14399999999999999,"Sinapi 92306",18.95,"Sinapi 88267",2.73]
[null,null,null,null,null,null,"",null,""]
["SF-00923","Tubo de cobre classe \"E\" 28 mm",null,"m",null,{"$f":"F2375","v":"Sinapi 92307"},"",null,""]
[null,null,null,null,null,null,"",null,""]
[null,null,"TUBO DE COBRE CLASSE \"E\", DN = 28 MM, PARA INSTALACAO HIDRAULICA PREDIAL","M",1.0210999999999999,"Sinapi 92307",34.880000000000003,"Sinapi 12744",35.619999999999997,{"$f":"SUM(I2375:I2377)","v":41.01}]
[null,null,"AUXILIAR DE ENCANADOR OU BOMBEIRO HIDRÁULICO COM ENCARGOS COMPLEMENTARES","H",0.16,"Sinapi 92307",14.78,"Sinapi 88248",2.36]
[null,null,"ENCANADOR OU BOMBEIRO HIDRÁULICO COM ENCARGOS COMPLEMENTARES","H",0.16,"Sinapi 92307",18.95,"Sinapi 88267",3.03]
[null,null,null,null,null,null,"",null,""]
["SF-00924","Tubo de cobre classe \"E\" 42mm",null,"m",null,{"$f":"F2381","v":"Sinapi 92278"},"",null,""]
[null,null,null,null,null,null,"",null,""]
[null,null,"TUBO DE COBRE CLASSE \"E\", DN = 42 MM, PARA INSTALACAO HIDRAULICA PREDIAL","M",1.0210999999999999,"Sinapi 92278",68.39,"Sinapi 12746",69.83,{"$f":"SUM(I2381:I2383)","v":72.39}]
[null,null,"AUXILIAR DE ENCANADOR OU BOMBEIRO HIDRÁULICO COM ENCARGOS COMPLEMENTARES","H",7.5999999999999998E-2,"Sinapi 92278",14.78,"Sinapi 88248",1.1200000000000001]
[null,null,"ENCANADOR OU BOMBEIRO HIDRÁULICO COM ENCARGOS COMPLEMENTARES","H",7.5999999999999998E-2,"Sinapi 92278",18.95,"Sinapi 88267",1.44]
[null,null,null,null,null,null,"",null,""]
["SF-00925","Bacia convencional - Linha Acessibilidade",null,"un",null,"Sinapi 95471 Adaptada","",null,""]
[null,null,null,null,null,null,"",null,""]
[null,null,"PARAFUSO NIQUELADO COM ACABAMENTO CROMADO PARA FIXAR PECA SANITARIA, INCLUI PORCA CEGA, ARRUELA E BUCHA DE NYLON TAMANHO S-10","UN",2,"Sinapi 95471",14.96,"Sinapi 4384",29.92,{"$f":"SUM(I2387:I2393)","v":599.53}]
[null,null,"VEDACAO PVC, 100 MM, PARA SAIDA VASO SANITARIO","UN",1,"Sinapi 95471",1.7,"Sinapi 6138",1.7]
[null,null,"BACIA SANITARIA (VASO) CONVENCIONAL PARA PCD SEM FURO FRONTAL, DE LOUCA BRANCA, SEM ASSENTO","UN",1,"Sinapi 95471",488.03,"Sinapi 36520",488.03]
[null,null,"REJUNTE EPOXI BRANCO","KG",0.1469,"Sinapi 95471",30.3,"Sinapi 37329",4.45]
[null,null,"ENCANADOR OU BOMBEIRO HIDRÁULICO COM ENCARGOS COMPLEMENTARES","H",0.78,"Sinapi 95471",18.95,"Sinapi 88267",14.78]
[null,null,"SERVENTE COM ENCARGOS COMPLEMENTARES","H",0.44,"Sinapi 95471",14.21,"Sinapi 88316",6.25]
[null,null,"Tubo de ligação para bacia sanitária em PVC, com acabamento cromado, ajustável ou não. Ref.: DECA 1968C ou equivalente","un",1,"Sinapi 95472",54.4,"Pesquisa de Preços",54.4]
[null,null,null,null,null,null,"",null,""]
["SF-00926","Assento para bacia convencional - Linha Acessibilidade",null,"un",null,"Orse 02056 Adaptada","",null,""]
[null,null,null,null,null,null,"",null,""]
[null,null,"Assento poliéster, mod.: Vogue plus, cor branca, com fixação cromada. AP.51 ref: DECA ou equivalente","un ",1,"Orse 02056",730,"Pesquisa de Preços",730,{"$f":"SUM(I2397:I2398)","v":731.42}]
[null,null,"Servente Com Encargos Complementares","h",0.1,"Orse 02056",14.21,"Sinapi 88316",1.42]
[null,null,null,null,null,null,"",null,""]
["SF-00927","Base registro de gaveta 1 1/2”",null,"un",null,"Sinapi 94497 Adaptada","",null,""]
[null,null,null,null,null,null,"",null,""]
[null,null,"Registro gaveta em liga de cobre, bitola 1 1/2\" mod:1502.B.112 ref: DECA ou equivalente","un ",1,"Sinapi 94497 ",66.849999999999994,"Pesquisa de Preços",66.849999999999994,{"$f":"SUM(I2402:I2405)","v":93.699999999999989}]
[null,null,"FITA VEDA ROSCA EM ROLOS DE 18 MM X 50 M (L X C)","un ",1.9E-2,"Sinapi 94497 ",12.38,"Sinapi 3148",0.24]
[null,null,"Encanador ou Bombeiro Hidráulico com Encargos Complementares","h",0.78900000000000003,"Sinapi 94497 ",18.95,"Sinapi 88267",14.95]
[null,null,"AUXILIAR DE ENCANADOR OU BOMBEIRO HIDRÁULICO COM ENCARGOS COMPLEMENTARES","h",0.78900000000000003,"Sinapi 94497 ",14.78,"Sinapi 88248",11.66]
[null,null,null,null,null,null,"",null,""]
["SF-00937","Montagem e desmontagem de andaime fachadeiro",null,"m2",null,"Sinapi 97063","",null,""]
[null,null,null,null,null,null,"",null,""]
[null,null,"MONTADOR DE ESTRUTURA METÁLICA COM ENCARGOS COMPLEMENTARES","H",0.29509999999999997,"Sinapi 97063",14.73,"Sinapi 88278",4.3499999999999996,{"$f":"SUM(I2409:I2411)","v":7.42}]
[null,null,"SERVENTE COM ENCARGOS COMPLEMENTARES","H",5.8999999999999997E-2,"Sinapi 97063",14.21,"Sinapi 88316",0.84]
[null,null,"TRANSPORTE HORIZONTAL, TUBOS DE AÇO CARBONO LEVE OU MÉDIO, PRETO OU GALVANIZADO, COM DIÂMETRO MAIOR QUE 40 MM E MENOR OU IGUAL A 65 MM, MANUAL, 30M. AF_06/2015","M",5.5769000000000002,"Sinapi 97063",0.4,"Sinapi 91120",2.23]
[null,null,null,null,null,null,"",null,""]
["SF-00938","Montagem e desmontagem de andaime tubular",null,"m",null,{"$f":"F2415","v":"Sinapi 97064"},"",null,""]
[null,null,null,null,null,null,"",null,""]
[null,null,"MONTADOR DE ESTRUTURA METÁLICA COM ENCARGOS COMPLEMENTARES","H",0.5,"Sinapi 97064",14.73,"Sinapi 88278",7.37,{"$f":"SUM(I2415:I2417)","v":14.149999999999999}]
[null,null,"SERVENTE COM ENCARGOS COMPLEMENTARES","H",0.1,"Sinapi 97064",14.21,"Sinapi 88316",1.42]
[null,null,"TRANSPORTE HORIZONTAL, TUBOS DE AÇO CARBONO LEVE OU MÉDIO, PRETO OU GALVANIZADO, COM DIÂMETRO MAIOR QUE 40 MM E MENOR OU IGUAL A 65 MM, MANUAL, 30M. AF_06/2015","M",13.4,"Sinapi 97064",0.4,"Sinapi 91120",5.36]
[null,null,null,null,null,null,"",null,""]
["SF-00940","Locação de fechamento para andaimes com tela 100% polietileno",null,"m2 x mês",null,"Sinapi 97062 Adaptada","",null,""]
[null,null,null,null,null,null,"",null,""]
[null,null,"ABRACADEIRA DE NYLON PARA AMARRACAO DE CABOS, COMPRIMENTO DE 200 X *4,6* MM","UN",0.89449999999999996,"Sinapi 97062",0.17,"Sinapi 411",0.15,{"$f":"SUM(I2421:I2424)","v":3.1099999999999994}]
[null,null,"TELA FACHADEIRA EM POLIETILENO, ROLO DE 3 X 100 M (L X C), COR BRANCA, SEM LOGOMARCA - PARA PROTECAO DE OBRAS","M2",{"$f":"1.177*(1/5)","v":0.23540000000000003},"Sinapi 97062",1.8,"Sinapi 7170",0.42]
[null,null,"AJUDANTE DE CARPINTEIRO COM ENCARGOS COMPLEMENTARES","H",6.9900000000000004E-2,"Sinapi 97062",16.170000000000002,"Sinapi 88239",1.1299999999999999]
[null,null,"CARPINTEIRO DE FORMAS COM ENCARGOS COMPLEMENTARES","H",7.3400000000000007E-2,"Sinapi 97062",19.18,"Sinapi 88262",1.41]
[null,null,null,null,null,null,"",null,""]
[null,null,"Obs.: Considerou-se aproveitamento de 5x para a tela, já que trata-se de locação.",null,null,null,"",null,""]
[null,null,null,null,null,null,"",null,""]

{"sheet":"Composições Auxiliares","index":2,"n_rows":235,"n_cols":10,"rows_kept":235,"cut":false,"hidden":false,"merged":[[222,0,229,0],[230,0,234,0],[89,0,97,0],[201,0,206,0],[207,0,212,0],[213,0,217,0],[98,0,106,0],[218,0,221,0],[107,0,112,0],[195,0,200,0],[113,0,118,0],[184,0,194,0],[119,0,124,0],[125,0,130,0],[131,0,136,0],[143,0,148,0],[155,0,162,0],[137,0,142,0],[163,0,175,0],[176,0,183,0],[149,0,154,0],[0,1,0,9],[1,1,1,9],[66,0,72,0],[73,0,81,0],[82,0,88,0],[36,0,45,0],[14,0,18,0],[19,0,24,0],[46,0,57,0],[58,0,65,0],[5,0,13,0],[25,0,35,0],[2,1,2,9]]}
["SENADO FEDERAL",{"$f":"Composições!C1","v":"Ata de Registro de Preços para Reformas no SF - 2019/2020"}]
["SECRETARIA DE INFRAESTRUTURA","COMPOSIÇÕES AUXILIARES"]
["SERVIÇO DE ORÇAMENTOS",{"$f":"Composições!C3","v":"Data: Julho de 2019 (data-base: Sinapi jun/2019, Pini jun/2019)"}]
[]
["Discriminação",null,"Especificação do Serviço","Unidade","Coeficiente","Fonte do Coeficiente","Preço unitário","Fonte do Preço","Preço","Total"]
["Argamassa traço 1:3 (cimento e areia média), preparo manual. AF_08/2014",null,"","M3",null,"Sinapi 88629 + Sinapi 97914",null,null,{"$f":"IF(ISNUMBER(G6),ROUND(G6*$E6,2),\"\")","v":""}]
[null,null,"",null,null,null,null,null,{"$f":"IF(ISNUMBER(G7),ROUND(G7*$E7,2),\"\")","v":""}]
[null,{"$f":"IF(RIGHT(C8,27)=\"com encargos complementares\",\"MO\",IF(ISNUMBER(INDEX(#REF!,MATCH(H8,#REF!,0),7)),\"I\",IF(ISNUMBER(INDEX(#REF!,MATCH(H8,#REF!,0),8)),\"C\",IF(ISTEXT(H8),\"I\",\"\"))))","v":"I"},"Areia media - posto jazida/fornecedor (retirado na jazida, sem transporte)","M3",1.1499999999999999,"Sinapi 88629",80.84,"Sinapi 370",92.97,{"$f":"SUM(I8:I11)","v":409.95000000000005}]
[null,{"$f":"IF(RIGHT(C9,27)=\"com encargos complementares\",\"MO\",IF(ISNUMBER(INDEX(#REF!,MATCH(H9,#REF!,0),7)),\"I\",IF(ISNUMBER(INDEX(#REF!,MATCH(H9,#REF!,0),8)),\"C\",IF(ISTEXT(H9),\"I\",\"\"))))","v":"I"},"Cimento Portland composto CP II-32","KG",441.51,"Sinapi 88629",0.37,"Sinapi 1379",163.36000000000001]
[null,{"$f":"IF(RIGHT(C10,27)=\"com encargos complementares\",\"MO\",IF(ISNUMBER(INDEX(#REF!,MATCH(H10,#REF!,0),7)),\"I\",IF(ISNUMBER(INDEX(#REF!,MATCH(H10,#REF!,0),8)),\"C\",IF(ISTEXT(H10),\"I\",\"\"))))","v":"MO"},"Servente com encargos complementares","H",8.48,"Sinapi 88629",14.21,"Sinapi 88316",120.5]
[null,null,"TRANSPORTE COM CAMINHÃO BASCULANTE DE 6 M3, EM VIA URBANA PAVIMENTADA, DMT ATÉ 30 KM (UNIDADE: M3XKM). AF_01/2018","m3xkm",{"$f":"1.15*20","v":23},"Sinapi 97914",1.44,"Sinapi 97914",33.119999999999997]
[null,null,null,null,null,null,"",null,""]
[null,null,"Obs.: Considerando fornecedor de areia a 20 km do Senado Federal.",null,null,null,"",null,""]
[null,{"$f":"IF(RIGHT(C14,27)=\"com encargos complementares\",\"MO\",IF(ISNUMBER(INDEX(#REF!,MATCH(H14,#REF!,0),7)),\"I\",IF(ISNUMBER(INDEX(#REF!,MATCH(H14,#REF!,0),8)),\"C\",IF(ISTEXT(H14),\"I\",\"\"))))","v":""},"",null,null,null,"",null,""]
["Fixação utilizando parafuso e bucha de nylon, somente mão de obra. af_10/2016",{"$f":"IF(RIGHT(C15,27)=\"com encargos complementares\",\"MO\",IF(ISNUMBER(INDEX(#REF!,MATCH(H15,#REF!,0),7)),\"I\",IF(ISNUMBER(INDEX(#REF!,MATCH(H15,#REF!,0),8)),\"C\",IF(ISTEXT(H15),\"I\",\"\"))))","v":""},"","UN.",null,{"$f":"F17","v":"Sinapi 95541"},"",null,""]
[null,{"$f":"IF(RIGHT(C16,27)=\"com encargos complementares\",\"MO\",IF(ISNUMBER(INDEX(#REF!,MATCH(H16,#REF!,0),7)),\"I\",IF(ISNUMBER(INDEX(#REF!,MATCH(H16,#REF!,0),8)),\"C\",IF(ISTEXT(H16),\"I\",\"\"))))","v":""},"",null,null,null,"",null,""]
[null,{"$f":"IF(RIGHT(C17,27)=\"com encargos complementares\",\"MO\",IF(ISNUMBER(INDEX(#REF!,MATCH(H17,#REF!,0),7)),\"I\",IF(ISNUMBER(INDEX(#REF!,MATCH(H17,#REF!,0),8)),\"C\",IF(ISTEXT(H17),\"I\",\"\"))))","v":"MO"},"Auxiliar de encanador ou bombeiro hidráulico com encargos complementares","H",2.2700000000000001E-2,"Sinapi 95541",14.78,"Sinapi 88248",0.34,{"$f":"SUM(I17:I18)","v":3.4099999999999997}]
[null,{"$f":"IF(RIGHT(C18,27)=\"com encargos complementares\",\"MO\",IF(ISNUMBER(INDEX(#REF!,MATCH(H18,#REF!,0),7)),\"I\",IF(ISNUMBER(INDEX(#REF!,MATCH(H18,#REF!,0),8)),\"C\",IF(ISTEXT(H18),\"I\",\"\"))))","v":"MO"},"Encanador ou bombeiro hidráulico com encargos complementares","H",0.16209999999999999,"Sinapi 95541",18.95,"Sinapi 88267",3.07]
[null,{"$f":"IF(RIGHT(C19,27)=\"com encargos complementares\",\"MO\",IF(ISNUMBER(INDEX(#REF!,MATCH(H19,#REF!,0),7)),\"I\",IF(ISNUMBER(INDEX(#REF!,MATCH(H19,#REF!,0),8)),\"C\",IF(ISTEXT(H19),\"I\",\"\"))))","v":""},"",null,null,null,"",null,""]
["Fixação de tubos horizontais de PVC, CPVC ou cobre diâmetros menores ou iguais a 40 mm ou eletrocalhas até 150mm de largura, com abraçadeira metálica rígida tipo d 1/2\u0094, fixada em perfilado em laje. af_05/2015",{"$f":"IF(RIGHT(C20,27)=\"com encargos complementares\",\"MO\",IF(ISNUMBER(INDEX(#REF!,MATCH(H20,#REF!,0),7)),\"I\",IF(ISNUMBER(INDEX(#REF!,MATCH(H20,#REF!,0),8)),\"C\",IF(ISTEXT(H20),\"I\",\"\"))))","v":""},"","UN.",null,{"$f":"F22","v":"Sinapi 91170"},"",null,""]
[null,{"$f":"IF(RIGHT(C21,27)=\"com encargos complementares\",\"MO\",IF(ISNUMBER(INDEX(#REF!,MATCH(H21,#REF!,0),7)),\"I\",IF(ISNUMBER(INDEX(#REF!,MATCH(H21,#REF!,0),8)),\"C\",IF(ISTEXT(H21),\"I\",\"\"))))","v":""},"",null,null,null,"",null,""]
[null,{"$f":"IF(RIGHT(C22,27)=\"com encargos complementares\",\"MO\",IF(ISNUMBER(INDEX(#REF!,MATCH(H22,#REF!,0),7)),\"I\",IF(ISNUMBER(INDEX(#REF!,MATCH(H22,#REF!,0),8)),\"C\",IF(ISTEXT(H22),\"I\",\"\"))))","v":"I"},"Abracadeira em aco para amarracao de eletrodutos, tipo D, com 1/2\" e parafuso de fixacao","UN",0.65,"Sinapi 91170",0.9,"Sinapi 392",0.59,{"$f":"SUM(I22:I24)","v":2.0499999999999998}]
[null,{"$f":"IF(RIGHT(C23,27)=\"com encargos complementares\",\"MO\",IF(ISNUMBER(INDEX(#REF!,MATCH(H23,#REF!,0),7)),\"I\",IF(ISNUMBER(INDEX(#REF!,MATCH(H23,#REF!,0),8)),\"C\",IF(ISTEXT(H23),\"I\",\"\"))))","v":"MO"},"Auxiliar de encanador ou bombeiro hidráulico com encargos complementares","H",0.01,"Sinapi 91170",14.78,"Sinapi 88248",0.15]
[null,{"$f":"IF(RIGHT(C24,27)=\"com encargos complementares\",\"MO\",IF(ISNUMBER(INDEX(#REF!,MATCH(H24,#REF!,0),7)),\"I\",IF(ISNUMBER(INDEX(#REF!,MATCH(H24,#REF!,0),8)),\"C\",IF(ISTEXT(H24),\"I\",\"\"))))","v":"MO"},"Encanador ou bombeiro hidráulico com encargos complementares","H",6.9000000000000006E-2,"Sinapi 91170",18.95,"Sinapi 88267",1.31]
[null,{"$f":"IF(RIGHT(C25,27)=\"com encargos complementares\",\"MO\",IF(ISNUMBER(INDEX(#REF!,MATCH(H25,#REF!,0),7)),\"I\",IF(ISNUMBER(INDEX(#REF!,MATCH(H25,#REF!,0),8)),\"C\",IF(ISTEXT(H25),\"I\",\"\"))))","v":""},"",null,null,null,"",null,""]
["Fabricação de fôrma para vigas, em chapa de madeira compensada resinada, E = 17 mm. AF_12/2015",{"$f":"IF(RIGHT(C26,27)=\"com encargos complementares\",\"MO\",IF(ISNUMBER(INDEX(#REF!,MATCH(H26,#REF!,0),7)),\"I\",IF(ISNUMBER(INDEX(#REF!,MATCH(H26,#REF!,0),8)),\"C\",IF(ISTEXT(H26),\"I\",\"\"))))","v":""},"","M2",null,{"$f":"F28","v":"Sinapi 92265"},"",null,""]
[null,{"$f":"IF(RIGHT(C27,27)=\"com encargos complementares\",\"MO\",IF(ISNUMBER(INDEX(#REF!,MATCH(H27,#REF!,0),7)),\"I\",IF(ISNUMBER(INDEX(#REF!,MATCH(H27,#REF!,0),8)),\"C\",IF(ISTEXT(H27),\"I\",\"\"))))","v":""},"",null,null,null,"",null,""]
[null,{"$f":"IF(RIGHT(C28,27)=\"com encargos complementares\",\"MO\",IF(ISNUMBER(INDEX(#REF!,MATCH(H28,#REF!,0),7)),\"I\",IF(ISNUMBER(INDEX(#REF!,MATCH(H28,#REF!,0),8)),\"C\",IF(ISTEXT(H28),\"I\",\"\"))))","v":"I"},"Chapa de madeira compensada resinada para forma de concreto, de *2,2 x 1,1* m, e = 17 mm","M2",1.19,"Sinapi 92265",21.59,"Sinapi 1358",25.69,{"$f":"SUM(I28:I35)","v":65.14}]
[null,{"$f":"IF(RIGHT(C29,27)=\"com encargos complementares\",\"MO\",IF(ISNUMBER(INDEX(#REF!,MATCH(H29,#REF!,0),7)),\"I\",IF(ISNUMBER(INDEX(#REF!,MATCH(H29,#REF!,0),8)),\"C\",IF(ISTEXT(H29),\"I\",\"\"))))","v":"I"},"PONTALETE DE MADEIRA NAO APARELHADA *7,5 X 7,5* CM (3 X 3 \") PINUS, MISTA OU EQUIVALENTE DA REGIAO","M",0.16200000000000001,"Sinapi 92265",3.29,"Sinapi 4491",0.53]
[null,{"$f":"IF(RIGHT(C30,27)=\"com encargos complementares\",\"MO\",IF(ISNUMBER(INDEX(#REF!,MATCH(H30,#REF!,0),7)),\"I\",IF(ISNUMBER(INDEX(#REF!,MATCH(H30,#REF!,0),8)),\"C\",IF(ISTEXT(H30),\"I\",\"\"))))","v":"I"},"SARRAFO DE MADEIRA NAO APARELHADA *2,5 X 7,5* CM (1 X 3 \") PINUS, MISTA OU EQUIVALENTE DA REGIAO","M",7.734,"Sinapi 92265",1.18,"Sinapi 4517",9.1300000000000008]
[null,{"$f":"IF(RIGHT(C31,27)=\"com encargos complementares\",\"MO\",IF(ISNUMBER(INDEX(#REF!,MATCH(H31,#REF!,0),7)),\"I\",IF(ISNUMBER(INDEX(#REF!,MATCH(H31,#REF!,0),8)),\"C\",IF(ISTEXT(H31),\"I\",\"\"))))","v":"I"},"Prego de aco polido com cabeca 17 x 21 (2 x 11)","KG",0.155,"Sinapi 92265",9.11,"Sinapi 5068",1.41]
[null,{"$f":"IF(RIGHT(C32,27)=\"com encargos complementares\",\"MO\",IF(ISNUMBER(INDEX(#REF!,MATCH(H32,#REF!,0),7)),\"I\",IF(ISNUMBER(INDEX(#REF!,MATCH(H32,#REF!,0),8)),\"C\",IF(ISTEXT(H32),\"I\",\"\"))))","v":"MO"},"Ajudante de carpinteiro com encargos complementares","H",0.222,"Sinapi 92265",16.170000000000002,"Sinapi 88239",3.59]
[null,{"$f":"IF(RIGHT(C33,27)=\"com encargos complementares\",\"MO\",IF(ISNUMBER(INDEX(#REF!,MATCH(H33,#REF!,0),7)),\"I\",IF(ISNUMBER(INDEX(#REF!,MATCH(H33,#REF!,0),8)),\"C\",IF(ISTEXT(H33),\"I\",\"\"))))","v":"MO"},"Carpinteiro de formas com encargos complementares","H",1.111,"Sinapi 92265",19.18,"Sinapi 88262",21.31]
[null,{"$f":"IF(RIGHT(C34,27)=\"com encargos complementares\",\"MO\",IF(ISNUMBER(INDEX(#REF!,MATCH(H34,#REF!,0),7)),\"I\",IF(ISNUMBER(INDEX(#REF!,MATCH(H34,#REF!,0),8)),\"C\",IF(ISTEXT(H34),\"I\",\"\"))))","v":"I"},"Serra circular de bancada com motor elétrico potência de 5HP, com coifa para disco 10\" - CHP diurno. af_08/2015","CHP",5.3999999999999999E-2,"Sinapi 92265",17.04,"Sinapi 91692",0.92]
[null,{"$f":"IF(RIGHT(C35,27)=\"com encargos complementares\",\"MO\",IF(ISNUMBER(INDEX(#REF!,MATCH(H35,#REF!,0),7)),\"I\",IF(ISNUMBER(INDEX(#REF!,MATCH(H35,#REF!,0),8)),\"C\",IF(ISTEXT(H35),\"I\",\"\"))))","v":"I"},"Serra circular de bancada com motor elétrico potência de 5HP, com coifa para disco 10\" - CHI diurno. af_08/2015","CHI",0.16900000000000001,"Sinapi 92265",15.15,"Sinapi 91693",2.56]
[null,{"$f":"IF(RIGHT(C36,27)=\"com encargos complementares\",\"MO\",IF(ISNUMBER(INDEX(#REF!,MATCH(H36,#REF!,0),7)),\"I\",IF(ISNUMBER(INDEX(#REF!,MATCH(H36,#REF!,0),8)),\"C\",IF(ISTEXT(H36),\"I\",\"\"))))","v":""},"",null,null,null,"",null,""]
["Fabricação de escoras de viga do tipo garfo, em madeira. af_12/2015",{"$f":"IF(RIGHT(C37,27)=\"com encargos complementares\",\"MO\",IF(ISNUMBER(INDEX(#REF!,MATCH(H37,#REF!,0),7)),\"I\",IF(ISNUMBER(INDEX(#REF!,MATCH(H37,#REF!,0),8)),\"C\",IF(ISTEXT(H37),\"I\",\"\"))))","v":""},"","M",null,{"$f":"F39","v":"Sinapi 92272"},"",null,""]
[null,{"$f":"IF(RIGHT(C38,27)=\"com encargos complementares\",\"MO\",IF(ISNUMBER(INDEX(#REF!,MATCH(H38,#REF!,0),7)),\"I\",IF(ISNUMBER(INDEX(#REF!,MATCH(H38,#REF!,0),8)),\"C\",IF(ISTEXT(H38),\"I\",\"\"))))","v":""},"",null,null,null,"",null,""]
[null,{"$f":"IF(RIGHT(C39,27)=\"com encargos complementares\",\"MO\",IF(ISNUMBER(INDEX(#REF!,MATCH(H39,#REF!,0),7)),\"I\",IF(ISNUMBER(INDEX(#REF!,MATCH(H39,#REF!,0),8)),\"C\",IF(ISTEXT(H39),\"I\",\"\"))))","v":"I"},"Chapa de madeira compensada plastificada para forma de concreto, de 2,20 x 1,10 m, e = 18 mm","M2",0.126,"Sinapi 92272",33.78,"Sinapi 1345",4.26,{"$f":"SUM(I39:I45)","v":16.28}]
[null,{"$f":"IF(RIGHT(C40,27)=\"com encargos complementares\",\"MO\",IF(ISNUMBER(INDEX(#REF!,MATCH(H40,#REF!,0),7)),\"I\",IF(ISNUMBER(INDEX(#REF!,MATCH(H40,#REF!,0),8)),\"C\",IF(ISTEXT(H40),\"I\",\"\"))))","v":"I"},"PONTALETE DE MADEIRA NAO APARELHADA *7,5 X 7,5* CM (3 X 3 \") PINUS, MISTA OU EQUIVALENTE DA REGIAO","M",2.27,"Sinapi 92272",3.29,"Sinapi 4491",7.47]
[null,{"$f":"IF(RIGHT(C41,27)=\"com encargos complementares\",\"MO\",IF(ISNUMBER(INDEX(#REF!,MATCH(H41,#REF!,0),7)),\"I\",IF(ISNUMBER(INDEX(#REF!,MATCH(H41,#REF!,0),8)),\"C\",IF(ISTEXT(H41),\"I\",\"\"))))","v":"I"},"Prego de aco polido com cabeca 17 x 21 (2 x 11)","KG",1.7000000000000001E-2,"Sinapi 92272",9.11,"Sinapi 5068",0.15]
[null,{"$f":"IF(RIGHT(C42,27)=\"com encargos complementares\",\"MO\",IF(ISNUMBER(INDEX(#REF!,MATCH(H42,#REF!,0),7)),\"I\",IF(ISNUMBER(INDEX(#REF!,MATCH(H42,#REF!,0),8)),\"C\",IF(ISTEXT(H42),\"I\",\"\"))))","v":"MO"},"Ajudante de carpinteiro com encargos complementares","H",3.4000000000000002E-2,"Sinapi 92272",16.170000000000002,"Sinapi 88239",0.55000000000000004]
[null,{"$f":"IF(RIGHT(C43,27)=\"com encargos complementares\",\"MO\",IF(ISNUMBER(INDEX(#REF!,MATCH(H43,#REF!,0),7)),\"I\",IF(ISNUMBER(INDEX(#REF!,MATCH(H43,#REF!,0),8)),\"C\",IF(ISTEXT(H43),\"I\",\"\"))))","v":"MO"},"Carpinteiro de formas com encargos complementares","H",0.17199999999999999,"Sinapi 92272",19.18,"Sinapi 88262",3.3]
[null,{"$f":"IF(RIGHT(C44,27)=\"com encargos complementares\",\"MO\",IF(ISNUMBER(INDEX(#REF!,MATCH(H44,#REF!,0),7)),\"I\",IF(ISNUMBER(INDEX(#REF!,MATCH(H44,#REF!,0),8)),\"C\",IF(ISTEXT(H44),\"I\",\"\"))))","v":"I"},"Serra circular de bancada com motor elétrico potência de 5HP, com coifa para disco 10\" - CHP diurno. af_08/2015","CHP",0.02,"Sinapi 92272",17.04,"Sinapi 91692",0.34]
[null,{"$f":"IF(RIGHT(C45,27)=\"com encargos complementares\",\"MO\",IF(ISNUMBER(INDEX(#REF!,MATCH(H45,#REF!,0),7)),\"I\",IF(ISNUMBER(INDEX(#REF!,MATCH(H45,#REF!,0),8)),\"C\",IF(ISTEXT(H45),\"I\",\"\"))))","v":"I"},"Serra circular de bancada com motor elétrico potência de 5HP, com coifa para disco 10\" - CHI diurno. af_08/2015","CHI",1.4E-2,"Sinapi 92272",15.15,"Sinapi 91693",0.21]
[null,{"$f":"IF(RIGHT(C46,27)=\"com encargos complementares\",\"MO\",IF(ISNUMBER(INDEX(#REF!,MATCH(H46,#REF!,0),7)),\"I\",IF(ISNUMBER(INDEX(#REF!,MATCH(H46,#REF!,0),8)),\"C\",IF(ISTEXT(H46),\"I\",\"\"))))","v":""},"",null,null,null,"",null,""]
["Argamassa Traço 1:2:8 (Cimento, Cal E Areia Média) Para Emboço/Massa Única/Assentamento De Alvenaria De Vedação, Preparo Mecânico Com Betoneira 400 L. Af_06/2014",{"$f":"IF(RIGHT(C47,27)=\"com encargos complementares\",\"MO\",IF(ISNUMBER(INDEX(#REF!,MATCH(H47,#REF!,0),7)),\"I\",IF(ISNUMBER(INDEX(#REF!,MATCH(H47,#REF!,0),8)),\"C\",IF(ISTEXT(H47),\"I\",\"\"))))","v":""},"","M3",null,"Sinapi 87292 + Sinapi 97914","",null,""]
[null,{"$f":"IF(RIGHT(C48,27)=\"com encargos complementares\",\"MO\",IF(ISNUMBER(INDEX(#REF!,MATCH(H48,#REF!,0),7)),\"I\",IF(ISNUMBER(INDEX(#REF!,MATCH(H48,#REF!,0),8)),\"C\",IF(ISTEXT(H48),\"I\",\"\"))))","v":""},"",null,null,null,"",null,""]
[null,{"$f":"IF(RIGHT(C49,27)=\"com encargos complementares\",\"MO\",IF(ISNUMBER(INDEX(#REF!,MATCH(H49,#REF!,0),7)),\"I\",IF(ISNUMBER(INDEX(#REF!,MATCH(H49,#REF!,0),8)),\"C\",IF(ISTEXT(H49),\"I\",\"\"))))","v":"I"},"Areia media - posto jazida/fornecedor (retirado na jazida, sem transporte)","M3",1.29,"Sinapi 87292",80.84,"Sinapi 370",104.28,{"$f":"SUM(I49:I55)","v":400.75999999999993}]
[null,{"$f":"IF(RIGHT(C50,27)=\"com encargos complementares\",\"MO\",IF(ISNUMBER(INDEX(#REF!,MATCH(H50,#REF!,0),7)),\"I\",IF(ISNUMBER(INDEX(#REF!,MATCH(H50,#REF!,0),8)),\"C\",IF(ISTEXT(H50),\"I\",\"\"))))","v":"I"},"Cal hidratada CH-I para argamassas","KG",193.7,"Sinapi 87292",0.62,"Sinapi 1106",120.09]
[null,{"$f":"IF(RIGHT(C51,27)=\"com encargos complementares\",\"MO\",IF(ISNUMBER(INDEX(#REF!,MATCH(H51,#REF!,0),7)),\"I\",IF(ISNUMBER(INDEX(#REF!,MATCH(H51,#REF!,0),8)),\"C\",IF(ISTEXT(H51),\"I\",\"\"))))","v":"I"},"Cimento Portland composto CP II-32","KG",185.63,"Sinapi 87292",0.37,"Sinapi 1379",68.680000000000007]
[null,{"$f":"IF(RIGHT(C52,27)=\"com encargos complementares\",\"MO\",IF(ISNUMBER(INDEX(#REF!,MATCH(H52,#REF!,0),7)),\"I\",IF(ISNUMBER(INDEX(#REF!,MATCH(H52,#REF!,0),8)),\"C\",IF(ISTEXT(H52),\"I\",\"\"))))","v":"MO"},"Operador de betoneira estacionária/misturador com encargos complementares","H",4.75,"Sinapi 87292",14.41,"Sinapi 88377",68.45]
[null,{"$f":"IF(RIGHT(C53,27)=\"com encargos complementares\",\"MO\",IF(ISNUMBER(INDEX(#REF!,MATCH(H53,#REF!,0),7)),\"I\",IF(ISNUMBER(INDEX(#REF!,MATCH(H53,#REF!,0),8)),\"C\",IF(ISTEXT(H53),\"I\",\"\"))))","v":"I"},"Betoneira capacidade nominal de 400 L, capacidade de mistura 280 L, motor elétrico trifásico potência de 2 cv, sem carregador - CHP diurno. af_10/2014","CHP",1.1100000000000001,"Sinapi 87292",1.1399999999999999,"Sinapi 88830",1.27]
[null,{"$f":"IF(RIGHT(C54,27)=\"com encargos complementares\",\"MO\",IF(ISNUMBER(INDEX(#REF!,MATCH(H54,#REF!,0),7)),\"I\",IF(ISNUMBER(INDEX(#REF!,MATCH(H54,#REF!,0),8)),\"C\",IF(ISTEXT(H54),\"I\",\"\"))))","v":"I"},"Betoneira capacidade nominal de 400 L, capacidade de mistura 280 L, motor elétrico trifásico potência de 2 cv, sem carregador - CHI diurno. af_10/2014","CHI",3.64,"Sinapi 87292",0.23,"Sinapi 88831",0.84]
[null,null,"TRANSPORTE COM CAMINHÃO BASCULANTE DE 6 M3, EM VIA URBANA PAVIMENTADA, DMT ATÉ 30 KM (UNIDADE: M3XKM). AF_01/2018","m3xkm",{"$f":"1.29*20","v":25.8},"Sinapi 97914",1.44,"Sinapi 97914",37.15]
[null,null,null,null,null,null,"",null,""]
[null,null,"Obs.: Considerando fornecedor de areia a 20 km do Senado Federal.",null,null,null,"",null,""]
[null,{"$f":"IF(RIGHT(C58,27)=\"com encargos complementares\",\"MO\",IF(ISNUMBER(INDEX(#REF!,MATCH(H58,#REF!,0),7)),\"I\",IF(ISNUMBER(INDEX(#REF!,MATCH(H58,#REF!,0),8)),\"C\",IF(ISTEXT(H58),\"I\",\"\"))))","v":""},"",null,null,null,"",null,""]
["Contrapiso em argamassa traço 1:4 (cimento e areia), preparo mecânico com betoneira 400 l, aplicado em áreas secas sobre laje, aderido, espessura 3cm. AF_06/2014",{"$f":"IF(RIGHT(C59,27)=\"com encargos complementares\",\"MO\",IF(ISNUMBER(INDEX(#REF!,MATCH(H59,#REF!,0),7)),\"I\",IF(ISNUMBER(INDEX(#REF!,MATCH(H59,#REF!,0),8)),\"C\",IF(ISTEXT(H59),\"I\",\"\"))))","v":""},"","M2",null,{"$f":"F61","v":"Sinapi 87630"},"",null,""]
[null,{"$f":"IF(RIGHT(C60,27)=\"com encargos complementares\",\"MO\",IF(ISNUMBER(INDEX(#REF!,MATCH(H60,#REF!,0),7)),\"I\",IF(ISNUMBER(INDEX(#REF!,MATCH(H60,#REF!,0),8)),\"C\",IF(ISTEXT(H60),\"I\",\"\"))))","v":""},"",null,null,null,"",null,""]
[null,{"$f":"IF(RIGHT(C61,27)=\"com encargos complementares\",\"MO\",IF(ISNUMBER(INDEX(#REF!,MATCH(H61,#REF!,0),7)),\"I\",IF(ISNUMBER(INDEX(#REF!,MATCH(H61,#REF!,0),8)),\"C\",IF(ISTEXT(H61),\"I\",\"\"))))","v":"I"},"Cimento Portland composto CP II-32","KG",0.5,"Sinapi 87630",0.37,"Sinapi 1379",0.19,{"$f":"SUM(I61:I65)","v":30.74}]
[null,{"$f":"IF(RIGHT(C62,27)=\"com encargos complementares\",\"MO\",IF(ISNUMBER(INDEX(#REF!,MATCH(H62,#REF!,0),7)),\"I\",IF(ISNUMBER(INDEX(#REF!,MATCH(H62,#REF!,0),8)),\"C\",IF(ISTEXT(H62),\"I\",\"\"))))","v":"I"},"Aditivo adesivo liquido para argamassas de revestimentos cimenticios","L",0.435,"Sinapi 87630",9.9,"Sinapi 7334",4.3099999999999996]
[null,{"$f":"IF(RIGHT(C63,27)=\"com encargos complementares\",\"MO\",IF(ISNUMBER(INDEX(#REF!,MATCH(H63,#REF!,0),7)),\"I\",IF(ISNUMBER(INDEX(#REF!,MATCH(H63,#REF!,0),8)),\"C\",IF(ISTEXT(H63),\"I\",\"\"))))","v":"I"},"Argamassa traço 1:4 (cimento e areia média) para contrapiso, preparo mecânico com betoneira 400 L. af_06/2014","M3",4.3099999999999999E-2,"Sinapi 87630",406.59,"Sinapi 87301",17.52]
[null,{"$f":"IF(RIGHT(C64,27)=\"com encargos complementares\",\"MO\",IF(ISNUMBER(INDEX(#REF!,MATCH(H64,#REF!,0),7)),\"I\",IF(ISNUMBER(INDEX(#REF!,MATCH(H64,#REF!,0),8)),\"C\",IF(ISTEXT(H64),\"I\",\"\"))))","v":"MO"},"Pedreiro com encargos complementares","H",0.33,"Sinapi 87630",19.32,"Sinapi 88309",6.38]
[null,{"$f":"IF(RIGHT(C65,27)=\"com encargos complementares\",\"MO\",IF(ISNUMBER(INDEX(#REF!,MATCH(H65,#REF!,0),7)),\"I\",IF(ISNUMBER(INDEX(#REF!,MATCH(H65,#REF!,0),8)),\"C\",IF(ISTEXT(H65),\"I\",\"\"))))","v":"MO"},"Servente com encargos complementares","H",0.16500000000000001,"Sinapi 87630",14.21,"Sinapi 88316",2.34]
[null,{"$f":"IF(RIGHT(C66,27)=\"com encargos complementares\",\"MO\",IF(ISNUMBER(INDEX(#REF!,MATCH(H66,#REF!,0),7)),\"I\",IF(ISNUMBER(INDEX(#REF!,MATCH(H66,#REF!,0),8)),\"C\",IF(ISTEXT(H66),\"I\",\"\"))))","v":""},"",null,null,null,"",null,""]
["Reboco com argamassa pre-fabricada, espessura 0,5cm, preparo mecanico da argamassa",{"$f":"IF(RIGHT(C67,27)=\"com encargos complementares\",\"MO\",IF(ISNUMBER(INDEX(#REF!,MATCH(H67,#REF!,0),7)),\"I\",IF(ISNUMBER(INDEX(#REF!,MATCH(H67,#REF!,0),8)),\"C\",IF(ISTEXT(H67),\"I\",\"\"))))","v":""},"","M2",null,{"$f":"F69","v":"Sinapi 84027"},"",null,""]
[null,{"$f":"IF(RIGHT(C68,27)=\"com encargos complementares\",\"MO\",IF(ISNUMBER(INDEX(#REF!,MATCH(H68,#REF!,0),7)),\"I\",IF(ISNUMBER(INDEX(#REF!,MATCH(H68,#REF!,0),8)),\"C\",IF(ISTEXT(H68),\"I\",\"\"))))","v":""},"",null,null,null,"",null,""]
[null,{"$f":"IF(RIGHT(C69,27)=\"com encargos complementares\",\"MO\",IF(ISNUMBER(INDEX(#REF!,MATCH(H69,#REF!,0),7)),\"I\",IF(ISNUMBER(INDEX(#REF!,MATCH(H69,#REF!,0),8)),\"C\",IF(ISTEXT(H69),\"I\",\"\"))))","v":"I"},"Cimento Portland composto CP II-32","KG",1,"Sinapi 84027",0.37,"Sinapi 1379",0.37,{"$f":"SUM(I69:I72)","v":29.25}]
[null,{"$f":"IF(RIGHT(C70,27)=\"com encargos complementares\",\"MO\",IF(ISNUMBER(INDEX(#REF!,MATCH(H70,#REF!,0),7)),\"I\",IF(ISNUMBER(INDEX(#REF!,MATCH(H70,#REF!,0),8)),\"C\",IF(ISTEXT(H70),\"I\",\"\"))))","v":"MO"},"Pedreiro com encargos complementares","H",0.8,"Sinapi 84027",19.32,"Sinapi 88309",15.46]
[null,{"$f":"IF(RIGHT(C71,27)=\"com encargos complementares\",\"MO\",IF(ISNUMBER(INDEX(#REF!,MATCH(H71,#REF!,0),7)),\"I\",IF(ISNUMBER(INDEX(#REF!,MATCH(H71,#REF!,0),8)),\"C\",IF(ISTEXT(H71),\"I\",\"\"))))","v":"MO"},"Servente com encargos complementares","H",0.8,"Sinapi 84027",14.21,"Sinapi 88316",{"$f":"IF(ISNUMBER(G71),ROUND(G71*$E71,2),\"\")","v":11.37}]
[null,{"$f":"IF(RIGHT(C72,27)=\"com encargos complementares\",\"MO\",IF(ISNUMBER(INDEX(#REF!,MATCH(H72,#REF!,0),7)),\"I\",IF(ISNUMBER(INDEX(#REF!,MATCH(H72,#REF!,0),8)),\"C\",IF(ISTEXT(H72),\"I\",\"\"))))","v":"I"},"Argamassa traço 1:3 (cimento e areia média), preparo manual. af_08/2014","M3",5.0000000000000001E-3,"Sinapi 84027",409.51,"Sinapi 88629",2.0499999999999998]
[null,{"$f":"IF(RIGHT(C73,27)=\"com encargos complementares\",\"MO\",IF(ISNUMBER(INDEX(#REF!,MATCH(H73,#REF!,0),7)),\"I\",IF(ISNUMBER(INDEX(#REF!,MATCH(H73,#REF!,0),8)),\"C\",IF(ISTEXT(H73),\"I\",\"\"))))","v":""},"",null,null,null,"",null,""]
["Argamassa traço 1:3 (cimento e areia grossa) para chapisco convencional, preparo manual. AF_06/2014",{"$f":"IF(RIGHT(C74,27)=\"com encargos complementares\",\"MO\",IF(ISNUMBER(INDEX(#REF!,MATCH(H74,#REF!,0),7)),\"I\",IF(ISNUMBER(INDEX(#REF!,MATCH(H74,#REF!,0),8)),\"C\",IF(ISTEXT(H74),\"I\",\"\"))))","v":""},"","M3",null,"Sinapi 87377 + Sinapi 97914","",null,""]
[null,{"$f":"IF(RIGHT(C75,27)=\"com encargos complementares\",\"MO\",IF(ISNUMBER(INDEX(#REF!,MATCH(H75,#REF!,0),7)),\"I\",IF(ISNUMBER(INDEX(#REF!,MATCH(H75,#REF!,0),8)),\"C\",IF(ISTEXT(H75),\"I\",\"\"))))","v":""},"",null,null,null,"",null,""]
[null,{"$f":"IF(RIGHT(C76,27)=\"com encargos complementares\",\"MO\",IF(ISNUMBER(INDEX(#REF!,MATCH(H76,#REF!,0),7)),\"I\",IF(ISNUMBER(INDEX(#REF!,MATCH(H76,#REF!,0),8)),\"C\",IF(ISTEXT(H76),\"I\",\"\"))))","v":"I"},"Areia grossa - posto jazida/fornecedor (retirado na jazida, sem transporte)","M3",1.05,"Sinapi 87377",104.72,"Sinapi 367",109.96,{"$f":"SUM(I76:I79)","v":443.35}]
[null,{"$f":"IF(RIGHT(C77,27)=\"com encargos complementares\",\"MO\",IF(ISNUMBER(INDEX(#REF!,MATCH(H77,#REF!,0),7)),\"I\",IF(ISNUMBER(INDEX(#REF!,MATCH(H77,#REF!,0),8)),\"C\",IF(ISTEXT(H77),\"I\",\"\"))))","v":"I"},"Cimento Portland composto CP II-32","KG",401.09,"Sinapi 87377",0.37,"Sinapi 1379",148.4]
[null,{"$f":"IF(RIGHT(C78,27)=\"com encargos complementares\",\"MO\",IF(ISNUMBER(INDEX(#REF!,MATCH(H78,#REF!,0),7)),\"I\",IF(ISNUMBER(INDEX(#REF!,MATCH(H78,#REF!,0),8)),\"C\",IF(ISTEXT(H78),\"I\",\"\"))))","v":"MO"},"Servente com encargos complementares","H",10.89,"Sinapi 87377",14.21,"Sinapi 88316",154.75]
[null,null,"TRANSPORTE COM CAMINHÃO BASCULANTE DE 6 M3, EM VIA URBANA PAVIMENTADA, DMT ATÉ 30 KM (UNIDADE: M3XKM). AF_01/2018","m3xkm",{"$f":"1.05*20","v":21},"Sinapi 97914",1.44,"Sinapi 97914",30.24]
[null,null,null,null,null,null,"",null,""]
[null,null,"Obs.: Considerando fornecedor de areia a 20 km do Senado Federal.",null,null,null,"",null,""]
[null,{"$f":"IF(RIGHT(C82,27)=\"com encargos complementares\",\"MO\",IF(ISNUMBER(INDEX(#REF!,MATCH(H82,#REF!,0),7)),\"I\",IF(ISNUMBER(INDEX(#REF!,MATCH(H82,#REF!,0),8)),\"C\",IF(ISTEXT(H82),\"I\",\"\"))))","v":""},"",null,null,null,"",null,""]
["Argamassa industrializada para chapisco colante, preparo com misturador de eixo horizontal de 300 kg. AF_06/2014",{"$f":"IF(RIGHT(C83,27)=\"com encargos complementares\",\"MO\",IF(ISNUMBER(INDEX(#REF!,MATCH(H83,#REF!,0),7)),\"I\",IF(ISNUMBER(INDEX(#REF!,MATCH(H83,#REF!,0),8)),\"C\",IF(ISTEXT(H83),\"I\",\"\"))))","v":""},"","M3",null,{"$f":"F85","v":"Sinapi 87396"},"",null,""]
[null,{"$f":"IF(RIGHT(C84,27)=\"com encargos complementares\",\"MO\",IF(ISNUMBER(INDEX(#REF!,MATCH(H84,#REF!,0),7)),\"I\",IF(ISNUMBER(INDEX(#REF!,MATCH(H84,#REF!,0),8)),\"C\",IF(ISTEXT(H84),\"I\",\"\"))))","v":""},"",null,null,null,"",null,""]
[null,{"$f":"IF(RIGHT(C85,27)=\"com encargos complementares\",\"MO\",IF(ISNUMBER(INDEX(#REF!,MATCH(H85,#REF!,0),7)),\"I\",IF(ISNUMBER(INDEX(#REF!,MATCH(H85,#REF!,0),8)),\"C\",IF(ISTEXT(H85),\"I\",\"\"))))","v":"I"},"Argamassa industrializada para chapisco colante","KG",1991.07,"Sinapi 87396",1.1599999999999999,"Sinapi 37553",2309.64,{"$f":"SUM(I85:I88)","v":2392.31}]
[null,{"$f":"IF(RIGHT(C86,27)=\"com encargos complementares\",\"MO\",IF(ISNUMBER(INDEX(#REF!,MATCH(H86,#REF!,0),7)),\"I\",IF(ISNUMBER(INDEX(#REF!,MATCH(H86,#REF!,0),8)),\"C\",IF(ISTEXT(H86),\"I\",\"\"))))","v":"MO"},"Operador de betoneira estacionária/misturador com encargos complementares","H",5.29,"Sinapi 87396",14.41,"Sinapi 88377",76.23]
[null,{"$f":"IF(RIGHT(C87,27)=\"com encargos complementares\",\"MO\",IF(ISNUMBER(INDEX(#REF!,MATCH(H87,#REF!,0),7)),\"I\",IF(ISNUMBER(INDEX(#REF!,MATCH(H87,#REF!,0),8)),\"C\",IF(ISTEXT(H87),\"I\",\"\"))))","v":"I"},"Misturador de argamassa, eixo horizontal, capacidade de mistura 300 kg, motor elétrico potência 5 cv - CHP diurno. af_06/2014","CHP",1.23,"Sinapi 87396",3.12,"Sinapi 88386",3.84]
[null,{"$f":"IF(RIGHT(C88,27)=\"com encargos complementares\",\"MO\",IF(ISNUMBER(INDEX(#REF!,MATCH(H88,#REF!,0),7)),\"I\",IF(ISNUMBER(INDEX(#REF!,MATCH(H88,#REF!,0),8)),\"C\",IF(ISTEXT(H88),\"I\",\"\"))))","v":"I"},"Misturador de argamassa, eixo horizontal, capacidade de mistura 300 kg, motor elétrico potência 5 cv - CHI diurno. af_06/2014","CHI",4.0599999999999996,"Sinapi 87396",0.64,"Sinapi 88392",2.6]
[null,{"$f":"IF(RIGHT(C89,27)=\"com encargos complementares\",\"MO\",IF(ISNUMBER(INDEX(#REF!,MATCH(H89,#REF!,0),7)),\"I\",IF(ISNUMBER(INDEX(#REF!,MATCH(H89,#REF!,0),8)),\"C\",IF(ISTEXT(H89),\"I\",\"\"))))","v":""},"",null,null,null,"",null,""]
["Argamassa traço 1:4 (cimento e areia média) para contrapiso, preparo manual. AF_06/2014",{"$f":"IF(RIGHT(C90,27)=\"com encargos complementares\",\"MO\",IF(ISNUMBER(INDEX(#REF!,MATCH(H90,#REF!,0),7)),\"I\",IF(ISNUMBER(INDEX(#REF!,MATCH(H90,#REF!,0),8)),\"C\",IF(ISTEXT(H90),\"I\",\"\"))))","v":""},"","M3",null,"Sinapi 87373 + Sinapi 97914","",null,""]
[null,{"$f":"IF(RIGHT(C91,27)=\"com encargos complementares\",\"MO\",IF(ISNUMBER(INDEX(#REF!,MATCH(H91,#REF!,0),7)),\"I\",IF(ISNUMBER(INDEX(#REF!,MATCH(H91,#REF!,0),8)),\"C\",IF(ISTEXT(H91),\"I\",\"\"))))","v":""},"",null,null,null,"",null,""]
[null,{"$f":"IF(RIGHT(C92,27)=\"com encargos complementares\",\"MO\",IF(ISNUMBER(INDEX(#REF!,MATCH(H92,#REF!,0),7)),\"I\",IF(ISNUMBER(INDEX(#REF!,MATCH(H92,#REF!,0),8)),\"C\",IF(ISTEXT(H92),\"I\",\"\"))))","v":"I"},"Areia media - posto jazida/fornecedor (retirado na jazida, sem transporte)","M3",1.51,"Sinapi 87373",80.84,"Sinapi 370",122.07,{"$f":"SUM(I92:I95)","v":489.78999999999996}]
[null,{"$f":"IF(RIGHT(C93,27)=\"com encargos complementares\",\"MO\",IF(ISNUMBER(INDEX(#REF!,MATCH(H93,#REF!,0),7)),\"I\",IF(ISNUMBER(INDEX(#REF!,MATCH(H93,#REF!,0),8)),\"C\",IF(ISTEXT(H93),\"I\",\"\"))))","v":"I"},"Cimento Portland composto CP II-32","KG",435.03,"Sinapi 87373",0.37,"Sinapi 1379",160.96]
[null,{"$f":"IF(RIGHT(C94,27)=\"com encargos complementares\",\"MO\",IF(ISNUMBER(INDEX(#REF!,MATCH(H94,#REF!,0),7)),\"I\",IF(ISNUMBER(INDEX(#REF!,MATCH(H94,#REF!,0),8)),\"C\",IF(ISTEXT(H94),\"I\",\"\"))))","v":"MO"},"Servente com encargos complementares","H",11.49,"Sinapi 87373",14.21,"Sinapi 88316",163.27000000000001]
[null,null,"TRANSPORTE COM CAMINHÃO BASCULANTE DE 6 M3, EM VIA URBANA PAVIMENTADA, DMT ATÉ 30 KM (UNIDADE: M3XKM). AF_01/2018","m3xkm",{"$f":"1.51*20","v":30.2},"Sinapi 97914",1.44,"Sinapi 97914",43.49]
[null,null,null,null,null,null,"",null,""]
[null,null,"Obs.: Considerando fornecedor de areia a 20 km do Senado Federal.",null,null,null,"",null,""]
[null,{"$f":"IF(RIGHT(C98,27)=\"com encargos complementares\",\"MO\",IF(ISNUMBER(INDEX(#REF!,MATCH(H98,#REF!,0),7)),\"I\",IF(ISNUMBER(INDEX(#REF!,MATCH(H98,#REF!,0),8)),\"C\",IF(ISTEXT(H98),\"I\",\"\"))))","v":""},"",null,null,null,"",null,""]
["Argamassa traço 1:4 (cimento e areia média), preparo manual. AF_08/2014",{"$f":"IF(RIGHT(C99,27)=\"com encargos complementares\",\"MO\",IF(ISNUMBER(INDEX(#REF!,MATCH(H99,#REF!,0),7)),\"I\",IF(ISNUMBER(INDEX(#REF!,MATCH(H99,#REF!,0),8)),\"C\",IF(ISTEXT(H99),\"I\",\"\"))))","v":""},"","M3",null,"Sinapi 88631 + Sinapi 97914","",null,""]
[null,{"$f":"IF(RIGHT(C100,27)=\"com encargos complementares\",\"MO\",IF(ISNUMBER(INDEX(#REF!,MATCH(H100,#REF!,0),7)),\"I\",IF(ISNUMBER(INDEX(#REF!,MATCH(H100,#REF!,0),8)),\"C\",IF(ISTEXT(H100),\"I\",\"\"))))","v":""},"",null,null,null,"",null,""]
[null,{"$f":"IF(RIGHT(C101,27)=\"com encargos complementares\",\"MO\",IF(ISNUMBER(INDEX(#REF!,MATCH(H101,#REF!,0),7)),\"I\",IF(ISNUMBER(INDEX(#REF!,MATCH(H101,#REF!,0),8)),\"C\",IF(ISTEXT(H101),\"I\",\"\"))))","v":"I"},"Areia media - posto jazida/fornecedor (retirado na jazida, sem transporte)","M3",1.23,"Sinapi 88631",80.84,"Sinapi 370",99.43,{"$f":"SUM(I101:I104)","v":396.34000000000003}]
[null,{"$f":"IF(RIGHT(C102,27)=\"com encargos complementares\",\"MO\",IF(ISNUMBER(INDEX(#REF!,MATCH(H102,#REF!,0),7)),\"I\",IF(ISNUMBER(INDEX(#REF!,MATCH(H102,#REF!,0),8)),\"C\",IF(ISTEXT(H102),\"I\",\"\"))))","v":"I"},"Cimento Portland composto CP II-32","KG",355.04,"Sinapi 88631",0.37,"Sinapi 1379",131.36000000000001]
[null,{"$f":"IF(RIGHT(C103,27)=\"com encargos complementares\",\"MO\",IF(ISNUMBER(INDEX(#REF!,MATCH(H103,#REF!,0),7)),\"I\",IF(ISNUMBER(INDEX(#REF!,MATCH(H103,#REF!,0),8)),\"C\",IF(ISTEXT(H103),\"I\",\"\"))))","v":"MO"},"Servente com encargos complementares","H",8.59,"Sinapi 88631",14.21,"Sinapi 88316",122.06]
[null,null,"TRANSPORTE COM CAMINHÃO BASCULANTE DE 6 M3, EM VIA URBANA PAVIMENTADA, DMT ATÉ 30 KM (UNIDADE: M3XKM). AF_01/2018","m3xkm",{"$f":"1.51*20","v":30.2},"Sinapi 97914",1.44,"Sinapi 97914",43.49]
[null,null,null,null,null,null,"",null,""]
[null,null,"Obs.: Considerando fornecedor de areia a 20 km do Senado Federal.",null,null,null,"",null,""]
[null,{"$f":"IF(RIGHT(C107,27)=\"com encargos complementares\",\"MO\",IF(ISNUMBER(INDEX(#REF!,MATCH(H107,#REF!,0),7)),\"I\",IF(ISNUMBER(INDEX(#REF!,MATCH(H107,#REF!,0),8)),\"C\",IF(ISTEXT(H107),\"I\",\"\"))))","v":""},"",null,null,null,"",null,""]
["Fixação de tubos verticais de PPR diâmetros menores ou iguais a 40 mm com abraçadeira metálica rígida tipo D 1/2\", fixada em perfilado em alvenaria. af_05/2015",{"$f":"IF(RIGHT(C108,27)=\"com encargos complementares\",\"MO\",IF(ISNUMBER(INDEX(#REF!,MATCH(H108,#REF!,0),7)),\"I\",IF(ISNUMBER(INDEX(#REF!,MATCH(H108,#REF!,0),8)),\"C\",IF(ISTEXT(H108),\"I\",\"\"))))","v":""},"","M",null,{"$f":"F110","v":"Sinapi 91173"},"",null,""]
[null,{"$f":"IF(RIGHT(C109,27)=\"com encargos complementares\",\"MO\",IF(ISNUMBER(INDEX(#REF!,MATCH(H109,#REF!,0),7)),\"I\",IF(ISNUMBER(INDEX(#REF!,MATCH(H109,#REF!,0),8)),\"C\",IF(ISTEXT(H109),\"I\",\"\"))))","v":""},"",null,null,null,"",null,""]
[null,{"$f":"IF(RIGHT(C110,27)=\"com encargos complementares\",\"MO\",IF(ISNUMBER(INDEX(#REF!,MATCH(H110,#REF!,0),7)),\"I\",IF(ISNUMBER(INDEX(#REF!,MATCH(H110,#REF!,0),8)),\"C\",IF(ISTEXT(H110),\"I\",\"\"))))","v":"I"},"Abracadeira em aco para amarracao de eletrodutos, tipo D, com 1/2\" e parafuso de fixacao","UN",0.33300000000000002,"Sinapi 91173",0.9,"Sinapi 392",0.3,{"$f":"SUM(I110:I112)","v":1.03}]
[null,{"$f":"IF(RIGHT(C111,27)=\"com encargos complementares\",\"MO\",IF(ISNUMBER(INDEX(#REF!,MATCH(H111,#REF!,0),7)),\"I\",IF(ISNUMBER(INDEX(#REF!,MATCH(H111,#REF!,0),8)),\"C\",IF(ISTEXT(H111),\"I\",\"\"))))","v":"MO"},"Auxiliar de encanador ou bombeiro hidráulico com encargos complementares","H",5.0000000000000001E-3,"Sinapi 91173",14.78,"Sinapi 88248",7.0000000000000007E-2]
[null,{"$f":"IF(RIGHT(C112,27)=\"com encargos complementares\",\"MO\",IF(ISNUMBER(INDEX(#REF!,MATCH(H112,#REF!,0),7)),\"I\",IF(ISNUMBER(INDEX(#REF!,MATCH(H112,#REF!,0),8)),\"C\",IF(ISTEXT(H112),\"I\",\"\"))))","v":"MO"},"Encanador ou bombeiro hidráulico com encargos complementares","H",3.5000000000000003E-2,"Sinapi 91173",18.95,"Sinapi 88267",0.66]
[null,{"$f":"IF(RIGHT(C113,27)=\"com encargos complementares\",\"MO\",IF(ISNUMBER(INDEX(#REF!,MATCH(H113,#REF!,0),7)),\"I\",IF(ISNUMBER(INDEX(#REF!,MATCH(H113,#REF!,0),8)),\"C\",IF(ISTEXT(H113),\"I\",\"\"))))","v":""},"",null,null,null,"",null,""]
["Luva de emenda para eletroduto, aço galvanizado, DN 20 mm (3/4''), aparente, instalada em parede - fornecimento e instalação. af_11/2016_p",{"$f":"IF(RIGHT(C114,27)=\"com encargos complementares\",\"MO\",IF(ISNUMBER(INDEX(#REF!,MATCH(H114,#REF!,0),7)),\"I\",IF(ISNUMBER(INDEX(#REF!,MATCH(H114,#REF!,0),8)),\"C\",IF(ISTEXT(H114),\"I\",\"\"))))","v":""},"","UN.",null,{"$f":"F116","v":"Sinapi 95757"},"",null,""]
[null,{"$f":"IF(RIGHT(C115,27)=\"com encargos complementares\",\"MO\",IF(ISNUMBER(INDEX(#REF!,MATCH(H115,#REF!,0),7)),\"I\",IF(ISNUMBER(INDEX(#REF!,MATCH(H115,#REF!,0),8)),\"C\",IF(ISTEXT(H115),\"I\",\"\"))))","v":""},"",null,null,null,"",null,""]
[null,{"$f":"IF(RIGHT(C116,27)=\"com encargos complementares\",\"MO\",IF(ISNUMBER(INDEX(#REF!,MATCH(H116,#REF!,0),7)),\"I\",IF(ISNUMBER(INDEX(#REF!,MATCH(H116,#REF!,0),8)),\"C\",IF(ISTEXT(H116),\"I\",\"\"))))","v":"I"},"Luva para eletroduto, em aco galvanizado eletrolitico, diametro de 20 mm (3/4\")","UN",1,"Sinapi 95757",1.51,"Sinapi 2637",1.51,{"$f":"SUM(I116:I118)","v":7.8599999999999994}]
[null,{"$f":"IF(RIGHT(C117,27)=\"com encargos complementares\",\"MO\",IF(ISNUMBER(INDEX(#REF!,MATCH(H117,#REF!,0),7)),\"I\",IF(ISNUMBER(INDEX(#REF!,MATCH(H117,#REF!,0),8)),\"C\",IF(ISTEXT(H117),\"I\",\"\"))))","v":"MO"},"Auxiliar de eletricista com encargos complementares","H",0.1827,"Sinapi 95757",15.22,"Sinapi 88247",2.78]
[null,{"$f":"IF(RIGHT(C118,27)=\"com encargos complementares\",\"MO\",IF(ISNUMBER(INDEX(#REF!,MATCH(H118,#REF!,0),7)),\"I\",IF(ISNUMBER(INDEX(#REF!,MATCH(H118,#REF!,0),8)),\"C\",IF(ISTEXT(H118),\"I\",\"\"))))","v":"MO"},"Eletricista com encargos complementares","H",0.1827,"Sinapi 95757",19.55,"Sinapi 88264",3.57]
[null,{"$f":"IF(RIGHT(C119,27)=\"com encargos complementares\",\"MO\",IF(ISNUMBER(INDEX(#REF!,MATCH(H119,#REF!,0),7)),\"I\",IF(ISNUMBER(INDEX(#REF!,MATCH(H119,#REF!,0),8)),\"C\",IF(ISTEXT(H119),\"I\",\"\"))))","v":""},"",null,null,null,"",null,""]
["Luva de emenda para eletroduto, aço galvanizado, DN 25 mm (1''), aparente, instalada em parede - fornecimento e instalação. af_11/2016_p",{"$f":"IF(RIGHT(C120,27)=\"com encargos complementares\",\"MO\",IF(ISNUMBER(INDEX(#REF!,MATCH(H120,#REF!,0),7)),\"I\",IF(ISNUMBER(INDEX(#REF!,MATCH(H120,#REF!,0),8)),\"C\",IF(ISTEXT(H120),\"I\",\"\"))))","v":""},"","UN.",null,{"$f":"F122","v":"Sinapi 95758"},"",null,""]
[null,{"$f":"IF(RIGHT(C121,27)=\"com encargos complementares\",\"MO\",IF(ISNUMBER(INDEX(#REF!,MATCH(H121,#REF!,0),7)),\"I\",IF(ISNUMBER(INDEX(#REF!,MATCH(H121,#REF!,0),8)),\"C\",IF(ISTEXT(H121),\"I\",\"\"))))","v":""},"",null,null,null,"",null,""]
[null,{"$f":"IF(RIGHT(C122,27)=\"com encargos complementares\",\"MO\",IF(ISNUMBER(INDEX(#REF!,MATCH(H122,#REF!,0),7)),\"I\",IF(ISNUMBER(INDEX(#REF!,MATCH(H122,#REF!,0),8)),\"C\",IF(ISTEXT(H122),\"I\",\"\"))))","v":"I"},"Luva para eletroduto, em aco galvanizado eletrolitico, diametro de 25 mm (1\")","UN",1,"Sinapi 95758",1.76,"Sinapi 2638",1.76,{"$f":"SUM(I122:I124)","v":8.82}]
[null,{"$f":"IF(RIGHT(C123,27)=\"com encargos complementares\",\"MO\",IF(ISNUMBER(INDEX(#REF!,MATCH(H123,#REF!,0),7)),\"I\",IF(ISNUMBER(INDEX(#REF!,MATCH(H123,#REF!,0),8)),\"C\",IF(ISTEXT(H123),\"I\",\"\"))))","v":"MO"},"Auxiliar de eletricista com encargos complementares","H",0.20330000000000001,"Sinapi 95758",15.22,"Sinapi 88247",3.09]
[null,{"$f":"IF(RIGHT(C124,27)=\"com encargos complementares\",\"MO\",IF(ISNUMBER(INDEX(#REF!,MATCH(H124,#REF!,0),7)),\"I\",IF(ISNUMBER(INDEX(#REF!,MATCH(H124,#REF!,0),8)),\"C\",IF(ISTEXT(H124),\"I\",\"\"))))","v":"MO"},"Eletricista com encargos complementares","H",0.20330000000000001,"Sinapi 95758",19.55,"Sinapi 88264",3.97]
[null,{"$f":"IF(RIGHT(C125,27)=\"com encargos complementares\",\"MO\",IF(ISNUMBER(INDEX(#REF!,MATCH(H125,#REF!,0),7)),\"I\",IF(ISNUMBER(INDEX(#REF!,MATCH(H125,#REF!,0),8)),\"C\",IF(ISTEXT(H125),\"I\",\"\"))))","v":""},"",null,null,null,"",null,""]
["Luva de emenda para eletroduto, aço galvanizado, DN 32 mm (1 1/4''), aparente, instalada em parede - fornecimento e instalação. af_11/2016_p",{"$f":"IF(RIGHT(C126,27)=\"com encargos complementares\",\"MO\",IF(ISNUMBER(INDEX(#REF!,MATCH(H126,#REF!,0),7)),\"I\",IF(ISNUMBER(INDEX(#REF!,MATCH(H126,#REF!,0),8)),\"C\",IF(ISTEXT(H126),\"I\",\"\"))))","v":""},"","UN.",null,{"$f":"F128","v":"Sinapi 95759"},"",null,""]
[null,{"$f":"IF(RIGHT(C127,27)=\"com encargos complementares\",\"MO\",IF(ISNUMBER(INDEX(#REF!,MATCH(H127,#REF!,0),7)),\"I\",IF(ISNUMBER(INDEX(#REF!,MATCH(H127,#REF!,0),8)),\"C\",IF(ISTEXT(H127),\"I\",\"\"))))","v":""},"",null,null,null,"",null,""]
[null,{"$f":"IF(RIGHT(C128,27)=\"com encargos complementares\",\"MO\",IF(ISNUMBER(INDEX(#REF!,MATCH(H128,#REF!,0),7)),\"I\",IF(ISNUMBER(INDEX(#REF!,MATCH(H128,#REF!,0),8)),\"C\",IF(ISTEXT(H128),\"I\",\"\"))))","v":"I"},"Luva para eletroduto, em aco galvanizado eletrolitico, diametro de 32 mm (1 1/4\")","UN",1,"Sinapi 95759",3.13,"Sinapi 2639",3.13,{"$f":"SUM(I128:I130)","v":11.2}]
[null,{"$f":"IF(RIGHT(C129,27)=\"com encargos complementares\",\"MO\",IF(ISNUMBER(INDEX(#REF!,MATCH(H129,#REF!,0),7)),\"I\",IF(ISNUMBER(INDEX(#REF!,MATCH(H129,#REF!,0),8)),\"C\",IF(ISTEXT(H129),\"I\",\"\"))))","v":"MO"},"Auxiliar de eletricista com encargos complementares","H",0.23219999999999999,"Sinapi 95759",15.22,"Sinapi 88247",3.53]
[null,{"$f":"IF(RIGHT(C130,27)=\"com encargos complementares\",\"MO\",IF(ISNUMBER(INDEX(#REF!,MATCH(H130,#REF!,0),7)),\"I\",IF(ISNUMBER(INDEX(#REF!,MATCH(H130,#REF!,0),8)),\"C\",IF(ISTEXT(H130),\"I\",\"\"))))","v":"MO"},"Eletricista com encargos complementares","H",0.23219999999999999,"Sinapi 95759",19.55,"Sinapi 88264",4.54]
[null,{"$f":"IF(RIGHT(C131,27)=\"com encargos complementares\",\"MO\",IF(ISNUMBER(INDEX(#REF!,MATCH(H131,#REF!,0),7)),\"I\",IF(ISNUMBER(INDEX(#REF!,MATCH(H131,#REF!,0),8)),\"C\",IF(ISTEXT(H131),\"I\",\"\"))))","v":""},"",null,null,null,"",null,""]
["Luva de emenda para eletroduto, aço galvanizado, DN 40 mm (1 1/2''), aparente, instalada em parede - fornecimento e instalação. af_11/2016_p",{"$f":"IF(RIGHT(C132,27)=\"com encargos complementares\",\"MO\",IF(ISNUMBER(INDEX(#REF!,MATCH(H132,#REF!,0),7)),\"I\",IF(ISNUMBER(INDEX(#REF!,MATCH(H132,#REF!,0),8)),\"C\",IF(ISTEXT(H132),\"I\",\"\"))))","v":""},"","UN.",null,"Sinapi 95760","",null,""]
[null,{"$f":"IF(RIGHT(C133,27)=\"com encargos complementares\",\"MO\",IF(ISNUMBER(INDEX(#REF!,MATCH(H133,#REF!,0),7)),\"I\",IF(ISNUMBER(INDEX(#REF!,MATCH(H133,#REF!,0),8)),\"C\",IF(ISTEXT(H133),\"I\",\"\"))))","v":""},"",null,null,null,"",null,""]
[null,{"$f":"IF(RIGHT(C134,27)=\"com encargos complementares\",\"MO\",IF(ISNUMBER(INDEX(#REF!,MATCH(H134,#REF!,0),7)),\"I\",IF(ISNUMBER(INDEX(#REF!,MATCH(H134,#REF!,0),8)),\"C\",IF(ISTEXT(H134),\"I\",\"\"))))","v":"I"},"Luva para eletroduto, em aco galvanizado eletrolitico, diametro de 40 mm (1 1/2\")","UN",1,"Sinapi 95760",4.53,"Sinapi 2644",4.53,{"$f":"SUM(I134:I136)","v":13.74}]
[null,{"$f":"IF(RIGHT(C135,27)=\"com encargos complementares\",\"MO\",IF(ISNUMBER(INDEX(#REF!,MATCH(H135,#REF!,0),7)),\"I\",IF(ISNUMBER(INDEX(#REF!,MATCH(H135,#REF!,0),8)),\"C\",IF(ISTEXT(H135),\"I\",\"\"))))","v":"MO"},"Auxiliar de eletricista com encargos complementares","H",0.2651,"Sinapi 95760",15.22,"Sinapi 88247",{"$f":"IF(ISNUMBER(G135),ROUND(G135*$E135,2),\"\")","v":4.03}]
[null,{"$f":"IF(RIGHT(C136,27)=\"com encargos complementares\",\"MO\",IF(ISNUMBER(INDEX(#REF!,MATCH(H136,#REF!,0),7)),\"I\",IF(ISNUMBER(INDEX(#REF!,MATCH(H136,#REF!,0),8)),\"C\",IF(ISTEXT(H136),\"I\",\"\"))))","v":"MO"},"Eletricista com encargos complementares","H",0.2651,"Sinapi 95760",19.55,"Sinapi 88264",5.18]
[null,{"$f":"IF(RIGHT(C137,27)=\"com encargos complementares\",\"MO\",IF(ISNUMBER(INDEX(#REF!,MATCH(H137,#REF!,0),7)),\"I\",IF(ISNUMBER(INDEX(#REF!,MATCH(H137,#REF!,0),8)),\"C\",IF(ISTEXT(H137),\"I\",\"\"))))","v":""},"",null,null,null,"",null,""]
["Luva de emenda para eletroduto, aço galvanizado, DN 50 mm (2''), aparente, instalada em parede - fornecimento e instalação. af_11/2016_p",{"$f":"IF(RIGHT(C138,27)=\"com encargos complementares\",\"MO\",IF(ISNUMBER(INDEX(#REF!,MATCH(H138,#REF!,0),7)),\"I\",IF(ISNUMBER(INDEX(#REF!,MATCH(H138,#REF!,0),8)),\"C\",IF(ISTEXT(H138),\"I\",\"\"))))","v":""},"","UN.",null,"Sinapi 95760 Adaptada","",null,""]
[null,{"$f":"IF(RIGHT(C139,27)=\"com encargos complementares\",\"MO\",IF(ISNUMBER(INDEX(#REF!,MATCH(H139,#REF!,0),7)),\"I\",IF(ISNUMBER(INDEX(#REF!,MATCH(H139,#REF!,0),8)),\"C\",IF(ISTEXT(H139),\"I\",\"\"))))","v":""},"",null,null,null,"",null,""]
[null,{"$f":"IF(RIGHT(C140,27)=\"com encargos complementares\",\"MO\",IF(ISNUMBER(INDEX(#REF!,MATCH(H140,#REF!,0),7)),\"I\",IF(ISNUMBER(INDEX(#REF!,MATCH(H140,#REF!,0),8)),\"C\",IF(ISTEXT(H140),\"I\",\"\"))))","v":"I"},"Luva para eletroduto, em aco galvanizado eletrolitico, diametro de 50 mm (2\")","UN",1,"Sinapi 95760",6.32,"Sinapi 2643",6.32,{"$f":"SUM(I140:I142)","v":15.530000000000001}]
[null,{"$f":"IF(RIGHT(C141,27)=\"com encargos complementares\",\"MO\",IF(ISNUMBER(INDEX(#REF!,MATCH(H141,#REF!,0),7)),\"I\",IF(ISNUMBER(INDEX(#REF!,MATCH(H141,#REF!,0),8)),\"C\",IF(ISTEXT(H141),\"I\",\"\"))))","v":"MO"},"Auxiliar de eletricista com encargos complementares","H",0.2651,"Sinapi 95760",15.22,"Sinapi 88247",4.03]
[null,{"$f":"IF(RIGHT(C142,27)=\"com encargos complementares\",\"MO\",IF(ISNUMBER(INDEX(#REF!,MATCH(H142,#REF!,0),7)),\"I\",IF(ISNUMBER(INDEX(#REF!,MATCH(H142,#REF!,0),8)),\"C\",IF(ISTEXT(H142),\"I\",\"\"))))","v":"MO"},"Eletricista com encargos complementares","H",0.2651,"Sinapi 95760",19.55,"Sinapi 88264",5.18]
[null,{"$f":"IF(RIGHT(C143,27)=\"com encargos complementares\",\"MO\",IF(ISNUMBER(INDEX(#REF!,MATCH(H143,#REF!,0),7)),\"I\",IF(ISNUMBER(INDEX(#REF!,MATCH(H143,#REF!,0),8)),\"C\",IF(ISTEXT(H143),\"I\",\"\"))))","v":""},"",null,null,null,"",null,""]
["Fixação de tubos verticais de PPR diâmetros maiores que 40 mm e menores ou iguais a 75 mm com abraçadeira metálica rígida tipo D 1 1/2\", fixada em perfilado em alvenaria. af_05/2015",{"$f":"IF(RIGHT(C144,27)=\"com encargos complementares\",\"MO\",IF(ISNUMBER(INDEX(#REF!,MATCH(H144,#REF!,0),7)),\"I\",IF(ISNUMBER(INDEX(#REF!,MATCH(H144,#REF!,0),8)),\"C\",IF(ISTEXT(H144),\"I\",\"\"))))","v":""},"","UN.",null,{"$f":"F146","v":"Sinapi 91174"},"",null,""]
[null,{"$f":"IF(RIGHT(C145,27)=\"com encargos complementares\",\"MO\",IF(ISNUMBER(INDEX(#REF!,MATCH(H145,#REF!,0),7)),\"I\",IF(ISNUMBER(INDEX(#REF!,MATCH(H145,#REF!,0),8)),\"C\",IF(ISTEXT(H145),\"I\",\"\"))))","v":""},"",null,null,null,"",null,""]
[null,{"$f":"IF(RIGHT(C146,27)=\"com encargos complementares\",\"MO\",IF(ISNUMBER(INDEX(#REF!,MATCH(H146,#REF!,0),7)),\"I\",IF(ISNUMBER(INDEX(#REF!,MATCH(H146,#REF!,0),8)),\"C\",IF(ISTEXT(H146),\"I\",\"\"))))","v":"I"},"Abracadeira em aco para amarracao de eletrodutos, tipo D, com 1 1/2\" e parafuso de fixacao","UN",0.33300000000000002,"Sinapi 91174",1.85,"Sinapi 394",0.62,{"$f":"SUM(I146:I148)","v":2.02}]
[null,{"$f":"IF(RIGHT(C147,27)=\"com encargos complementares\",\"MO\",IF(ISNUMBER(INDEX(#REF!,MATCH(H147,#REF!,0),7)),\"I\",IF(ISNUMBER(INDEX(#REF!,MATCH(H147,#REF!,0),8)),\"C\",IF(ISTEXT(H147),\"I\",\"\"))))","v":"MO"},"Auxiliar de encanador ou bombeiro hidráulico com encargos complementares","H",8.9999999999999993E-3,"Sinapi 91174",14.78,"Sinapi 88248",0.13]
[null,{"$f":"IF(RIGHT(C148,27)=\"com encargos complementares\",\"MO\",IF(ISNUMBER(INDEX(#REF!,MATCH(H148,#REF!,0),7)),\"I\",IF(ISNUMBER(INDEX(#REF!,MATCH(H148,#REF!,0),8)),\"C\",IF(ISTEXT(H148),\"I\",\"\"))))","v":"MO"},"Encanador ou bombeiro hidráulico com encargos complementares","H",6.7000000000000004E-2,"Sinapi 91174",18.95,"Sinapi 88267",1.27]
[null,{"$f":"IF(RIGHT(C149,27)=\"com encargos complementares\",\"MO\",IF(ISNUMBER(INDEX(#REF!,MATCH(H149,#REF!,0),7)),\"I\",IF(ISNUMBER(INDEX(#REF!,MATCH(H149,#REF!,0),8)),\"C\",IF(ISTEXT(H149),\"I\",\"\"))))","v":""},"",null,null,null,"",null,""]
["Fixação de tubos verticais de PPR diâmetros maiores que 40 mm e menores ou iguais a 75 mm com abraçadeira metálica rígida tipo D 2\", fixada em perfilado em alvenaria. af_05/2015",{"$f":"IF(RIGHT(C150,27)=\"com encargos complementares\",\"MO\",IF(ISNUMBER(INDEX(#REF!,MATCH(H150,#REF!,0),7)),\"I\",IF(ISNUMBER(INDEX(#REF!,MATCH(H150,#REF!,0),8)),\"C\",IF(ISTEXT(H150),\"I\",\"\"))))","v":""},"","UN.",null,"Sinapi 91174 Adaptada","",null,""]
[null,{"$f":"IF(RIGHT(C151,27)=\"com encargos complementares\",\"MO\",IF(ISNUMBER(INDEX(#REF!,MATCH(H151,#REF!,0),7)),\"I\",IF(ISNUMBER(INDEX(#REF!,MATCH(H151,#REF!,0),8)),\"C\",IF(ISTEXT(H151),\"I\",\"\"))))","v":""},"",null,null,null,"",null,""]
[null,{"$f":"IF(RIGHT(C152,27)=\"com encargos complementares\",\"MO\",IF(ISNUMBER(INDEX(#REF!,MATCH(H152,#REF!,0),7)),\"I\",IF(ISNUMBER(INDEX(#REF!,MATCH(H152,#REF!,0),8)),\"C\",IF(ISTEXT(H152),\"I\",\"\"))))","v":"I"},"Abracadeira em aco para amarracao de eletrodutos, tipo D, com 2\" e parafuso de fixacao","UN",0.33300000000000002,"Sinapi 91174",2.06,"Sinapi 396",0.69,{"$f":"SUM(I152:I154)","v":2.09}]
[null,{"$f":"IF(RIGHT(C153,27)=\"com encargos complementares\",\"MO\",IF(ISNUMBER(INDEX(#REF!,MATCH(H153,#REF!,0),7)),\"I\",IF(ISNUMBER(INDEX(#REF!,MATCH(H153,#REF!,0),8)),\"C\",IF(ISTEXT(H153),\"I\",\"\"))))","v":"MO"},"Auxiliar de encanador ou bombeiro hidráulico com encargos complementares","H",8.9999999999999993E-3,"Sinapi 91174",14.78,"Sinapi 88248",0.13]
[null,{"$f":"IF(RIGHT(C154,27)=\"com encargos complementares\",\"MO\",IF(ISNUMBER(INDEX(#REF!,MATCH(H154,#REF!,0),7)),\"I\",IF(ISNUMBER(INDEX(#REF!,MATCH(H154,#REF!,0),8)),\"C\",IF(ISTEXT(H154),\"I\",\"\"))))","v":"MO"},"Encanador ou bombeiro hidráulico com encargos complementares","H",6.7000000000000004E-2,"Sinapi 91174",18.95,"Sinapi 88267",1.27]
[null,{"$f":"IF(RIGHT(C155,27)=\"com encargos complementares\",\"MO\",IF(ISNUMBER(INDEX(#REF!,MATCH(H155,#REF!,0),7)),\"I\",IF(ISNUMBER(INDEX(#REF!,MATCH(H155,#REF!,0),8)),\"C\",IF(ISTEXT(H155),\"I\",\"\"))))","v":""},"",null,null,null,"",null,""]
["Aduela / marco / batente para porta de 90x210cm, padrão médio - fornecimento e montagem. AF_08/2015",{"$f":"IF(RIGHT(C156,27)=\"com encargos complementares\",\"MO\",IF(ISNUMBER(INDEX(#REF!,MATCH(H156,#REF!,0),7)),\"I\",IF(ISNUMBER(INDEX(#REF!,MATCH(H156,#REF!,0),8)),\"C\",IF(ISTEXT(H156),\"I\",\"\"))))","v":""},"","UN.",null,{"$f":"F158","v":"Sinapi 90803"},"",null,""]
[null,{"$f":"IF(RIGHT(C157,27)=\"com encargos complementares\",\"MO\",IF(ISNUMBER(INDEX(#REF!,MATCH(H157,#REF!,0),7)),\"I\",IF(ISNUMBER(INDEX(#REF!,MATCH(H157,#REF!,0),8)),\"C\",IF(ISTEXT(H157),\"I\",\"\"))))","v":""},"",null,null,null,"",null,""]
[null,{"$f":"IF(RIGHT(C158,27)=\"com encargos complementares\",\"MO\",IF(ISNUMBER(INDEX(#REF!,MATCH(H158,#REF!,0),7)),\"I\",IF(ISNUMBER(INDEX(#REF!,MATCH(H158,#REF!,0),8)),\"C\",IF(ISTEXT(H158),\"I\",\"\"))))","v":"I"},"Batente/ portal/ aduela/ marco macico, e= *3 cm, l= *13 cm, *60 cm a 120* cm x *210 cm,  em cedrinho/ angelim comercial/ eucalipto/ curupixa/ peroba/ cumaru ou equivalente da regiao (nao inclui alizares)","JG",1,"Sinapi 90803",152.1,"Sinapi 183",152.1,{"$f":"SUM(I158:I162)","v":237.24}]
[null,{"$f":"IF(RIGHT(C159,27)=\"com encargos complementares\",\"MO\",IF(ISNUMBER(INDEX(#REF!,MATCH(H159,#REF!,0),7)),\"I\",IF(ISNUMBER(INDEX(#REF!,MATCH(H159,#REF!,0),8)),\"C\",IF(ISTEXT(H159),\"I\",\"\"))))","v":"I"},"Prego de aco polido com cabeca 12 x 12","KG",1.0800000000000001E-2,"Sinapi 90803",12,"Sinapi 5066",0.13]
[null,{"$f":"IF(RIGHT(C160,27)=\"com encargos complementares\",\"MO\",IF(ISNUMBER(INDEX(#REF!,MATCH(H160,#REF!,0),7)),\"I\",IF(ISNUMBER(INDEX(#REF!,MATCH(H160,#REF!,0),8)),\"C\",IF(ISTEXT(H160),\"I\",\"\"))))","v":"I"},"Prego de aco polido com cabeca 18 x 30 (2 3/4 x 10)","KG",2.35E-2,"Sinapi 90803",9.11,"Sinapi 5075",0.21]
[null,{"$f":"IF(RIGHT(C161,27)=\"com encargos complementares\",\"MO\",IF(ISNUMBER(INDEX(#REF!,MATCH(H161,#REF!,0),7)),\"I\",IF(ISNUMBER(INDEX(#REF!,MATCH(H161,#REF!,0),8)),\"C\",IF(ISTEXT(H161),\"I\",\"\"))))","v":"MO"},"Carpinteiro de esquadria com encargos complementares","H",3.2210000000000001,"Sinapi 90803",19.22,"Sinapi 88261",61.91]
[null,{"$f":"IF(RIGHT(C162,27)=\"com encargos complementares\",\"MO\",IF(ISNUMBER(INDEX(#REF!,MATCH(H162,#REF!,0),7)),\"I\",IF(ISNUMBER(INDEX(#REF!,MATCH(H162,#REF!,0),8)),\"C\",IF(ISTEXT(H162),\"I\",\"\"))))","v":"MO"},"Servente com encargos complementares","H",1.611,"Sinapi 90803",14.21,"Sinapi 88316",22.89]
[null,{"$f":"IF(RIGHT(C163,27)=\"com encargos complementares\",\"MO\",IF(ISNUMBER(INDEX(#REF!,MATCH(H163,#REF!,0),7)),\"I\",IF(ISNUMBER(INDEX(#REF!,MATCH(H163,#REF!,0),8)),\"C\",IF(ISTEXT(H163),\"I\",\"\"))))","v":""},"",null,null,null,"",null,""]
["Argamassa traço 1:2:9 (cimento, cal e areia média) para emboço/massa única/assentamento de alvenaria de vedação, preparo mecânico com betoneira 600 L. af_06/2014",{"$f":"IF(RIGHT(C164,27)=\"com encargos complementares\",\"MO\",IF(ISNUMBER(INDEX(#REF!,MATCH(H164,#REF!,0),7)),\"I\",IF(ISNUMBER(INDEX(#REF!,MATCH(H164,#REF!,0),8)),\"C\",IF(ISTEXT(H164),\"I\",\"\"))))","v":""},"","M3",null,"Sinapi 87294 + Sinapi 97914","",null,""]
[null,{"$f":"IF(RIGHT(C165,27)=\"com encargos complementares\",\"MO\",IF(ISNUMBER(INDEX(#REF!,MATCH(H165,#REF!,0),7)),\"I\",IF(ISNUMBER(INDEX(#REF!,MATCH(H165,#REF!,0),8)),\"C\",IF(ISTEXT(H165),\"I\",\"\"))))","v":""},"",null,null,null,"",null,""]
[null,{"$f":"IF(RIGHT(C166,27)=\"com encargos complementares\",\"MO\",IF(ISNUMBER(INDEX(#REF!,MATCH(H166,#REF!,0),7)),\"I\",IF(ISNUMBER(INDEX(#REF!,MATCH(H166,#REF!,0),8)),\"C\",IF(ISTEXT(H166),\"I\",\"\"))))","v":"I"},"Areia media - posto jazida/fornecedor (retirado na jazida, sem transporte)","M3",1.31,"Sinapi 87294",80.84,"Sinapi 370",105.9,{"$f":"SUM(I166:I173)","v":386.37}]
[null,{"$f":"IF(RIGHT(C167,27)=\"com encargos complementares\",\"MO\",IF(ISNUMBER(INDEX(#REF!,MATCH(H167,#REF!,0),7)),\"I\",IF(ISNUMBER(INDEX(#REF!,MATCH(H167,#REF!,0),8)),\"C\",IF(ISTEXT(H167),\"I\",\"\"))))","v":"I"},"Cal hidratada CH-I para argamassas","KG",174.87,"Sinapi 87294",0.62,"Sinapi 1106",108.42]
[null,{"$f":"IF(RIGHT(C168,27)=\"com encargos complementares\",\"MO\",IF(ISNUMBER(INDEX(#REF!,MATCH(H168,#REF!,0),7)),\"I\",IF(ISNUMBER(INDEX(#REF!,MATCH(H168,#REF!,0),8)),\"C\",IF(ISTEXT(H168),\"I\",\"\"))))","v":"I"},"Cimento Portland composto CP II-32","KG",167.58,"Sinapi 87294",0.37,"Sinapi 1379",62]
[null,{"$f":"IF(RIGHT(C169,27)=\"com encargos complementares\",\"MO\",IF(ISNUMBER(INDEX(#REF!,MATCH(H169,#REF!,0),7)),\"I\",IF(ISNUMBER(INDEX(#REF!,MATCH(H169,#REF!,0),8)),\"C\",IF(ISTEXT(H169),\"I\",\"\"))))","v":"MO"},"Servente com encargos complementares","H",0.88,"Sinapi 87294",14.21,"Sinapi 88316",12.5]
[null,{"$f":"IF(RIGHT(C170,27)=\"com encargos complementares\",\"MO\",IF(ISNUMBER(INDEX(#REF!,MATCH(H170,#REF!,0),7)),\"I\",IF(ISNUMBER(INDEX(#REF!,MATCH(H170,#REF!,0),8)),\"C\",IF(ISTEXT(H170),\"I\",\"\"))))","v":"MO"},"Operador de betoneira estacionária/misturador com encargos complementares","H",3.76,"Sinapi 87294",14.41,"Sinapi 88377",54.18]
[null,{"$f":"IF(RIGHT(C171,27)=\"com encargos complementares\",\"MO\",IF(ISNUMBER(INDEX(#REF!,MATCH(H171,#REF!,0),7)),\"I\",IF(ISNUMBER(INDEX(#REF!,MATCH(H171,#REF!,0),8)),\"C\",IF(ISTEXT(H171),\"I\",\"\"))))","v":"I"},"Betoneira capacidade nominal de 600 L, capacidade de mistura 360 L, motor elétrico trifásico potência de 4 cv, sem carregador - CHP diurno. af_11/2014","CHP",0.88,"Sinapi 87294",3.2,"Sinapi 89225",2.82]
[null,{"$f":"IF(RIGHT(C172,27)=\"com encargos complementares\",\"MO\",IF(ISNUMBER(INDEX(#REF!,MATCH(H172,#REF!,0),7)),\"I\",IF(ISNUMBER(INDEX(#REF!,MATCH(H172,#REF!,0),8)),\"C\",IF(ISTEXT(H172),\"I\",\"\"))))","v":"I"},"Betoneira capacidade nominal de 600 L, capacidade de mistura 360 L, motor elétrico trifásico potência de 4 cv, sem carregador - CHI diurno. af_11/2014","CHI",2.88,"Sinapi 87294",0.98,"Sinapi 89226",2.82]
[null,null,"TRANSPORTE COM CAMINHÃO BASCULANTE DE 6 M3, EM VIA URBANA PAVIMENTADA, DMT ATÉ 30 KM (UNIDADE: M3XKM). AF_01/2018","m3xkm",{"$f":"1.31*20","v":26.200000000000003},"Sinapi 97914",1.44,"Sinapi 97914",37.729999999999997]
[null,null,null,null,null,null,"",null,""]
[null,null,"Obs.: Considerando fornecedor de areia a 20 km do Senado Federal.",null,null,null,"",null,""]
[null,{"$f":"IF(RIGHT(C176,27)=\"com encargos complementares\",\"MO\",IF(ISNUMBER(INDEX(#REF!,MATCH(H176,#REF!,0),7)),\"I\",IF(ISNUMBER(INDEX(#REF!,MATCH(H176,#REF!,0),8)),\"C\",IF(ISTEXT(H176),\"I\",\"\"))))","v":""},null,null,null,null,"",null,""]
["PINTURA A OLEO BRILHANTE SOBRE SUPERFICIE METALICA, UMA DEMAO INCLUSO UMA DEMAO DE FUNDO ANTICORROSIVO",{"$f":"IF(RIGHT(C177,27)=\"com encargos complementares\",\"MO\",IF(ISNUMBER(INDEX(#REF!,MATCH(H177,#REF!,0),7)),\"I\",IF(ISNUMBER(INDEX(#REF!,MATCH(H177,#REF!,0),8)),\"C\",IF(ISTEXT(H177),\"I\",\"\"))))","v":""},"","M3",null,{"$f":"F179","v":"Sinapi 79498/1"},"",null,""]
[null,{"$f":"IF(RIGHT(C178,27)=\"com encargos complementares\",\"MO\",IF(ISNUMBER(INDEX(#REF!,MATCH(H178,#REF!,0),7)),\"I\",IF(ISNUMBER(INDEX(#REF!,MATCH(H178,#REF!,0),8)),\"C\",IF(ISTEXT(H178),\"I\",\"\"))))","v":""},"",null,null,null,"",null,""]
[null,{"$f":"IF(RIGHT(C179,27)=\"com encargos complementares\",\"MO\",IF(ISNUMBER(INDEX(#REF!,MATCH(H179,#REF!,0),7)),\"I\",IF(ISNUMBER(INDEX(#REF!,MATCH(H179,#REF!,0),8)),\"C\",IF(ISTEXT(H179),\"I\",\"\"))))","v":"I"},"LIXA EM FOLHA PARA FERRO, NUMERO 150","UN",0.5,"Sinapi 79498/1",2.64,"Sinapi 3768",1.32,{"$f":"SUM(I179:I183)","v":14.76}]
[null,{"$f":"IF(RIGHT(C180,27)=\"com encargos complementares\",\"MO\",IF(ISNUMBER(INDEX(#REF!,MATCH(H180,#REF!,0),7)),\"I\",IF(ISNUMBER(INDEX(#REF!,MATCH(H180,#REF!,0),8)),\"C\",IF(ISTEXT(H180),\"I\",\"\"))))","v":"I"},"TINTA A OLEO BRILHANTE PARA MADEIRA E METAIS","GL",0.03,"Sinapi 79498/1",68.31,"Sinapi 7287",2.0499999999999998]
[null,{"$f":"IF(RIGHT(C181,27)=\"com encargos complementares\",\"MO\",IF(ISNUMBER(INDEX(#REF!,MATCH(H181,#REF!,0),7)),\"I\",IF(ISNUMBER(INDEX(#REF!,MATCH(H181,#REF!,0),8)),\"C\",IF(ISTEXT(H181),\"I\",\"\"))))","v":"I"},"FUNDO ANTICORROSIVO PARA METAIS FERROSOS (ZARCAO)","L",0.108,"Sinapi 79498/1",22.29,"Sinapi 7307",2.41]
[null,{"$f":"IF(RIGHT(C182,27)=\"com encargos complementares\",\"MO\",IF(ISNUMBER(INDEX(#REF!,MATCH(H182,#REF!,0),7)),\"I\",IF(ISNUMBER(INDEX(#REF!,MATCH(H182,#REF!,0),8)),\"C\",IF(ISTEXT(H182),\"I\",\"\"))))","v":"MO"},"PINTOR COM ENCARGOS COMPLEMENTARES","H",0.33,"Sinapi 79498/1",20.32,"Sinapi 88310",6.71]
[null,{"$f":"IF(RIGHT(C183,27)=\"com encargos complementares\",\"MO\",IF(ISNUMBER(INDEX(#REF!,MATCH(H183,#REF!,0),7)),\"I\",IF(ISNUMBER(INDEX(#REF!,MATCH(H183,#REF!,0),8)),\"C\",IF(ISTEXT(H183),\"I\",\"\"))))","v":"MO"},"SERVENTE COM ENCARGOS COMPLEMENTARES","H",0.16,"Sinapi 79498/1",14.21,"Sinapi 88316",2.27]
[null,{"$f":"IF(RIGHT(C184,27)=\"com encargos complementares\",\"MO\",IF(ISNUMBER(INDEX(#REF!,MATCH(H184,#REF!,0),7)),\"I\",IF(ISNUMBER(INDEX(#REF!,MATCH(H184,#REF!,0),8)),\"C\",IF(ISTEXT(H184),\"I\",\"\"))))","v":""},null,null,null,null,"",null,""]
["Argamassa traço 1:4 (cimento e areia média) para contrapiso, preparo mecânico com betoneira 400 L. af_06/2014",{"$f":"IF(RIGHT(C185,27)=\"com encargos complementares\",\"MO\",IF(ISNUMBER(INDEX(#REF!,MATCH(H185,#REF!,0),7)),\"I\",IF(ISNUMBER(INDEX(#REF!,MATCH(H185,#REF!,0),8)),\"C\",IF(ISTEXT(H185),\"I\",\"\"))))","v":""},"","M3",null,"Sinapi 87301 + Sinapi 97914","",null,""]
[null,{"$f":"IF(RIGHT(C186,27)=\"com encargos complementares\",\"MO\",IF(ISNUMBER(INDEX(#REF!,MATCH(H186,#REF!,0),7)),\"I\",IF(ISNUMBER(INDEX(#REF!,MATCH(H186,#REF!,0),8)),\"C\",IF(ISTEXT(H186),\"I\",\"\"))))","v":""},"",null,null,null,"",null,""]
[null,{"$f":"IF(RIGHT(C187,27)=\"com encargos complementares\",\"MO\",IF(ISNUMBER(INDEX(#REF!,MATCH(H187,#REF!,0),7)),\"I\",IF(ISNUMBER(INDEX(#REF!,MATCH(H187,#REF!,0),8)),\"C\",IF(ISTEXT(H187),\"I\",\"\"))))","v":"I"},"Areia media - posto jazida/fornecedor (retirado na jazida, sem transporte)","M3",1.54,"Sinapi 87301",80.84,"Sinapi 370",124.49,{"$f":"SUM(I187:I192)","v":407.02000000000004}]
[null,{"$f":"IF(RIGHT(C188,27)=\"com encargos complementares\",\"MO\",IF(ISNUMBER(INDEX(#REF!,MATCH(H188,#REF!,0),7)),\"I\",IF(ISNUMBER(INDEX(#REF!,MATCH(H188,#REF!,0),8)),\"C\",IF(ISTEXT(H188),\"I\",\"\"))))","v":"I"},"Cimento Portland composto CP II-32","KG",442.22,"Sinapi 87301",0.37,"Sinapi 1379",163.62]
[null,{"$f":"IF(RIGHT(C189,27)=\"com encargos complementares\",\"MO\",IF(ISNUMBER(INDEX(#REF!,MATCH(H189,#REF!,0),7)),\"I\",IF(ISNUMBER(INDEX(#REF!,MATCH(H189,#REF!,0),8)),\"C\",IF(ISTEXT(H189),\"I\",\"\"))))","v":"MO"},"Operador de betoneira estacionária/misturador com encargos complementares","H",5.0199999999999996,"Sinapi 87301",14.41,"Sinapi 88377",72.34]
[null,{"$f":"IF(RIGHT(C190,27)=\"com encargos complementares\",\"MO\",IF(ISNUMBER(INDEX(#REF!,MATCH(H190,#REF!,0),7)),\"I\",IF(ISNUMBER(INDEX(#REF!,MATCH(H190,#REF!,0),8)),\"C\",IF(ISTEXT(H190),\"I\",\"\"))))","v":"I"},"Betoneira capacidade nominal de 400 L, capacidade de mistura 280 L, motor elétrico trifásico potência de 2 cv, sem carregador - CHP diurno. af_10/2014","CHP",1.17,"Sinapi 87301",1.1399999999999999,"Sinapi 88830",1.33]
[null,{"$f":"IF(RIGHT(C191,27)=\"com encargos complementares\",\"MO\",IF(ISNUMBER(INDEX(#REF!,MATCH(H191,#REF!,0),7)),\"I\",IF(ISNUMBER(INDEX(#REF!,MATCH(H191,#REF!,0),8)),\"C\",IF(ISTEXT(H191),\"I\",\"\"))))","v":"I"},"Betoneira capacidade nominal de 400 L, capacidade de mistura 280 L, motor elétrico trifásico potência de 2 cv, sem carregador - CHI diurno. af_10/2014","CHI",3.85,"Sinapi 87301",0.23,"Sinapi 88831",0.89]
[null,null,"TRANSPORTE COM CAMINHÃO BASCULANTE DE 6 M3, EM VIA URBANA PAVIMENTADA, DMT ATÉ 30 KM (UNIDADE: M3XKM). AF_01/2018","m3xkm",{"$f":"1.54*20","v":30.8},"Sinapi 97914",1.44,"Sinapi 97914",44.35]
[null,null,null,null,null,null,"",null,""]
[null,null,"Obs.: Considerando fornecedor de areia a 20 km do Senado Federal.",null,null,null,"",null,""]
[null,{"$f":"IF(RIGHT(C195,27)=\"com encargos complementares\",\"MO\",IF(ISNUMBER(INDEX(#REF!,MATCH(H195,#REF!,0),7)),\"I\",IF(ISNUMBER(INDEX(#REF!,MATCH(H195,#REF!,0),8)),\"C\",IF(ISTEXT(H195),\"I\",\"\"))))","v":""},null,null,null,null,"",null,""]
["UMIDIFICAÇÃO DE MATERIAL PARA VALAS COM CAMINHÃO PIPA 10000L. AF_11/2016",{"$f":"IF(RIGHT(C196,27)=\"com encargos complementares\",\"MO\",IF(ISNUMBER(INDEX(#REF!,MATCH(H196,#REF!,0),7)),\"I\",IF(ISNUMBER(INDEX(#REF!,MATCH(H196,#REF!,0),8)),\"C\",IF(ISTEXT(H196),\"I\",\"\"))))","v":""},"","M3",null,{"$f":"F198","v":"Sinapi 95606"},"",null,""]
[null,{"$f":"IF(RIGHT(C197,27)=\"com encargos complementares\",\"MO\",IF(ISNUMBER(INDEX(#REF!,MATCH(H197,#REF!,0),7)),\"I\",IF(ISNUMBER(INDEX(#REF!,MATCH(H197,#REF!,0),8)),\"C\",IF(ISTEXT(H197),\"I\",\"\"))))","v":""},"",null,null,null,"",null,""]
[null,{"$f":"IF(RIGHT(C198,27)=\"com encargos complementares\",\"MO\",IF(ISNUMBER(INDEX(#REF!,MATCH(H198,#REF!,0),7)),\"I\",IF(ISNUMBER(INDEX(#REF!,MATCH(H198,#REF!,0),8)),\"C\",IF(ISTEXT(H198),\"I\",\"\"))))","v":"I"},"CAMINHÃO PIPA 10.000 L TRUCADO, PESO BRUTO TOTAL 23.000 KG, CARGA ÚTIL MÁXIMA 15.935 KG, DISTÂNCIA ENTRE EIXOS 4,8 M, POTÊNCIA 230 CV, INCLUSIVE TANQUE DE AÇO PARA TRANSPORTE DE ÁGUA - CHP DIURNO. AF_06/2014","CHP","0,0060000","Sinapi 95606",153.97,"Sinapi 5901",0.92,{"$f":"SUM(I198:I200)","v":1.1499999999999999}]
[null,{"$f":"IF(RIGHT(C199,27)=\"com encargos complementares\",\"MO\",IF(ISNUMBER(INDEX(#REF!,MATCH(H199,#REF!,0),7)),\"I\",IF(ISNUMBER(INDEX(#REF!,MATCH(H199,#REF!,0),8)),\"C\",IF(ISTEXT(H199),\"I\",\"\"))))","v":"I"},"CAMINHÃO PIPA 10.000 L TRUCADO, PESO BRUTO TOTAL 23.000 KG, CARGA ÚTIL MÁXIMA 15.935 KG, DISTÂNCIA ENTRE EIXOS 4,8 M, POTÊNCIA 230 CV, INCLUSIVE TANQUE DE AÇO PARA TRANSPORTE DE ÁGUA - CHI DIURNO. AF_06/2014","CHI","0,0030000","Sinapi 95606",31.68,"Sinapi 5903",{"$f":"IF(ISNUMBER(G199),ROUND(G199*$E199,2),\"\")","v":0.1}]
[null,{"$f":"IF(RIGHT(C200,27)=\"com encargos complementares\",\"MO\",IF(ISNUMBER(INDEX(#REF!,MATCH(H200,#REF!,0),7)),\"I\",IF(ISNUMBER(INDEX(#REF!,MATCH(H200,#REF!,0),8)),\"C\",IF(ISTEXT(H200),\"I\",\"\"))))","v":"MO"},"SERVENTE COM ENCARGOS COMPLEMENTARES","H","0,0090000","Sinapi 95606",14.21,"Sinapi 88316",0.13]
[null,{"$f":"IF(RIGHT(C201,27)=\"com encargos complementares\",\"MO\",IF(ISNUMBER(INDEX(#REF!,MATCH(H201,#REF!,0),7)),\"I\",IF(ISNUMBER(INDEX(#REF!,MATCH(H201,#REF!,0),8)),\"C\",IF(ISTEXT(H201),\"I\",\"\"))))","v":""},null,null,null,null,"",null,""]
["CORTE E DOBRA DE AÇO CA-50, DIÂMETRO DE 8,0 MM, UTILIZADO EM ESTRUTURAS DIVERSAS, EXCETO LAJES. AF_12/2015",{"$f":"IF(RIGHT(C202,27)=\"com encargos complementares\",\"MO\",IF(ISNUMBER(INDEX(#REF!,MATCH(H202,#REF!,0),7)),\"I\",IF(ISNUMBER(INDEX(#REF!,MATCH(H202,#REF!,0),8)),\"C\",IF(ISTEXT(H202),\"I\",\"\"))))","v":""},"","M3",null,"Sinapi 92793","",null,""]
[null,{"$f":"IF(RIGHT(C203,27)=\"com encargos complementares\",\"MO\",IF(ISNUMBER(INDEX(#REF!,MATCH(H203,#REF!,0),7)),\"I\",IF(ISNUMBER(INDEX(#REF!,MATCH(H203,#REF!,0),8)),\"C\",IF(ISTEXT(H203),\"I\",\"\"))))","v":""},"",null,null,null,"",null,""]
[null,{"$f":"IF(RIGHT(C204,27)=\"com encargos complementares\",\"MO\",IF(ISNUMBER(INDEX(#REF!,MATCH(H204,#REF!,0),7)),\"I\",IF(ISNUMBER(INDEX(#REF!,MATCH(H204,#REF!,0),8)),\"C\",IF(ISTEXT(H204),\"I\",\"\"))))","v":"I"},"ACO CA-50, 8,0 MM, VERGALHAO","KG","1,1100000","Sinapi 92793",5.1100000000000003,"Sinapi 33",5.67,{"$f":"SUM(I204:I206)","v":6.1499999999999995}]
[null,{"$f":"IF(RIGHT(C205,27)=\"com encargos complementares\",\"MO\",IF(ISNUMBER(INDEX(#REF!,MATCH(H205,#REF!,0),7)),\"I\",IF(ISNUMBER(INDEX(#REF!,MATCH(H205,#REF!,0),8)),\"C\",IF(ISTEXT(H205),\"I\",\"\"))))","v":"MO"},"AJUDANTE DE ARMADOR COM ENCARGOS COMPLEMENTARES","H","0,0032000","Sinapi 92793",14.9,"Sinapi 88238",0.05]
[null,{"$f":"IF(RIGHT(C206,27)=\"com encargos complementares\",\"MO\",IF(ISNUMBER(INDEX(#REF!,MATCH(H206,#REF!,0),7)),\"I\",IF(ISNUMBER(INDEX(#REF!,MATCH(H206,#REF!,0),8)),\"C\",IF(ISTEXT(H206),\"I\",\"\"))))","v":"MO"},"ARMADOR COM ENCARGOS COMPLEMENTARES","H","0,0224000","Sinapi 92793",19.22,"Sinapi 88245",0.43]
[null,{"$f":"IF(RIGHT(C207,27)=\"com encargos complementares\",\"MO\",IF(ISNUMBER(INDEX(#REF!,MATCH(H207,#REF!,0),7)),\"I\",IF(ISNUMBER(INDEX(#REF!,MATCH(H207,#REF!,0),8)),\"C\",IF(ISTEXT(H207),\"I\",\"\"))))","v":""},"",null,null,null,"",null,""]
["CORTE E DOBRA DE AÇO CA-50, DIÂMETRO DE 12,5 MM, UTILIZADO EM ESTRUTURAS DIVERSAS, EXCETO LAJES. AF_12/2015",{"$f":"IF(RIGHT(C208,27)=\"com encargos complementares\",\"MO\",IF(ISNUMBER(INDEX(#REF!,MATCH(H208,#REF!,0),7)),\"I\",IF(ISNUMBER(INDEX(#REF!,MATCH(H208,#REF!,0),8)),\"C\",IF(ISTEXT(H208),\"I\",\"\"))))","v":""},"","M3",null,"Sinapi 92795","",null,""]
[null,{"$f":"IF(RIGHT(C209,27)=\"com encargos complementares\",\"MO\",IF(ISNUMBER(INDEX(#REF!,MATCH(H209,#REF!,0),7)),\"I\",IF(ISNUMBER(INDEX(#REF!,MATCH(H209,#REF!,0),8)),\"C\",IF(ISTEXT(H209),\"I\",\"\"))))","v":""},"",null,null,null,"",null,""]
[null,{"$f":"IF(RIGHT(C210,27)=\"com encargos complementares\",\"MO\",IF(ISNUMBER(INDEX(#REF!,MATCH(H210,#REF!,0),7)),\"I\",IF(ISNUMBER(INDEX(#REF!,MATCH(H210,#REF!,0),8)),\"C\",IF(ISTEXT(H210),\"I\",\"\"))))","v":"I"},"ACO CA-50, 12,5 MM, VERGALHAO","KG","1,1100000","Sinapi 92795",4.1399999999999997,"Sinapi 31",4.5999999999999996,{"$f":"SUM(I210:I212)","v":4.7399999999999993}]
[null,{"$f":"IF(RIGHT(C211,27)=\"com encargos complementares\",\"MO\",IF(ISNUMBER(INDEX(#REF!,MATCH(H211,#REF!,0),7)),\"I\",IF(ISNUMBER(INDEX(#REF!,MATCH(H211,#REF!,0),8)),\"C\",IF(ISTEXT(H211),\"I\",\"\"))))","v":"MO"},"AJUDANTE DE ARMADOR COM ENCARGOS COMPLEMENTARES","H","0,0010000","Sinapi 92795",14.9,"Sinapi 88238",0.01]
[null,{"$f":"IF(RIGHT(C212,27)=\"com encargos complementares\",\"MO\",IF(ISNUMBER(INDEX(#REF!,MATCH(H212,#REF!,0),7)),\"I\",IF(ISNUMBER(INDEX(#REF!,MATCH(H212,#REF!,0),8)),\"C\",IF(ISTEXT(H212),\"I\",\"\"))))","v":"MO"},"ARMADOR COM ENCARGOS COMPLEMENTARES","H","0,0070000","Sinapi 92795",19.22,"Sinapi 88245",0.13]
[null,{"$f":"IF(RIGHT(C213,27)=\"com encargos complementares\",\"MO\",IF(ISNUMBER(INDEX(#REF!,MATCH(H213,#REF!,0),7)),\"I\",IF(ISNUMBER(INDEX(#REF!,MATCH(H213,#REF!,0),8)),\"C\",IF(ISTEXT(H213),\"I\",\"\"))))","v":""},"",null,null,null,"",null,""]
["CORTE E DOBRA DE AÇO CA-50, DIÂMETRO DE 20,0 MM, UTILIZADO EM ESTRUTURAS DIVERSAS, EXCETO LAJES. AF_12/2015",{"$f":"IF(RIGHT(C214,27)=\"com encargos complementares\",\"MO\",IF(ISNUMBER(INDEX(#REF!,MATCH(H214,#REF!,0),7)),\"I\",IF(ISNUMBER(INDEX(#REF!,MATCH(H214,#REF!,0),8)),\"C\",IF(ISTEXT(H214),\"I\",\"\"))))","v":""},"","M3",null,"Sinapi 92797","",null,""]
[null,{"$f":"IF(RIGHT(C215,27)=\"com encargos complementares\",\"MO\",IF(ISNUMBER(INDEX(#REF!,MATCH(H215,#REF!,0),7)),\"I\",IF(ISNUMBER(INDEX(#REF!,MATCH(H215,#REF!,0),8)),\"C\",IF(ISTEXT(H215),\"I\",\"\"))))","v":""},"",null,null,null,"",null,""]
[null,{"$f":"IF(RIGHT(C216,27)=\"com encargos complementares\",\"MO\",IF(ISNUMBER(INDEX(#REF!,MATCH(H216,#REF!,0),7)),\"I\",IF(ISNUMBER(INDEX(#REF!,MATCH(H216,#REF!,0),8)),\"C\",IF(ISTEXT(H216),\"I\",\"\"))))","v":"I"},"ACO CA-50, 20,0 MM, VERGALHAO","KG","1,1400000","Sinapi 92797",3.87,"Sinapi 29",4.41,{"$f":"SUM(I216:I217)","v":4.45}]
[null,{"$f":"IF(RIGHT(C217,27)=\"com encargos complementares\",\"MO\",IF(ISNUMBER(INDEX(#REF!,MATCH(H217,#REF!,0),7)),\"I\",IF(ISNUMBER(INDEX(#REF!,MATCH(H217,#REF!,0),8)),\"C\",IF(ISTEXT(H217),\"I\",\"\"))))","v":"MO"},"ARMADOR COM ENCARGOS COMPLEMENTARES","H","0,0020000","Sinapi 92797",19.22,"Sinapi 88245",0.04]
[null,{"$f":"IF(RIGHT(C218,27)=\"com encargos complementares\",\"MO\",IF(ISNUMBER(INDEX(#REF!,MATCH(H218,#REF!,0),7)),\"I\",IF(ISNUMBER(INDEX(#REF!,MATCH(H218,#REF!,0),8)),\"C\",IF(ISTEXT(H218),\"I\",\"\"))))","v":""},"",null,null,null,"",null,""]
["TRANSPORTE HORIZONTAL, TUBOS DE AÇO CARBONO LEVE OU MÉDIO, PRETO OU GALVANIZADO, COM DIÂMETRO MAIOR QUE 40 MM E MENOR OU IGUAL A 65 MM, MANUAL, 30M. AF_06/2015",{"$f":"IF(RIGHT(C219,27)=\"com encargos complementares\",\"MO\",IF(ISNUMBER(INDEX(#REF!,MATCH(H219,#REF!,0),7)),\"I\",IF(ISNUMBER(INDEX(#REF!,MATCH(H219,#REF!,0),8)),\"C\",IF(ISTEXT(H219),\"I\",\"\"))))","v":""},"","M3",null,"Sinapi 91120","",null,""]
[null,{"$f":"IF(RIGHT(C220,27)=\"com encargos complementares\",\"MO\",IF(ISNUMBER(INDEX(#REF!,MATCH(H220,#REF!,0),7)),\"I\",IF(ISNUMBER(INDEX(#REF!,MATCH(H220,#REF!,0),8)),\"C\",IF(ISTEXT(H220),\"I\",\"\"))))","v":""},"",null,null,null,"",null,""]
[null,{"$f":"IF(RIGHT(C221,27)=\"com encargos complementares\",\"MO\",IF(ISNUMBER(INDEX(#REF!,MATCH(H221,#REF!,0),7)),\"I\",IF(ISNUMBER(INDEX(#REF!,MATCH(H221,#REF!,0),8)),\"C\",IF(ISTEXT(H221),\"I\",\"\"))))","v":"MO"},"SERVENTE COM ENCARGOS COMPLEMENTARES","H","0,0277000","Sinapi 91120",14.21,"Sinapi 88316",0.39,{"$f":"SUM(I221:I221)","v":0.39}]
[null,{"$f":"IF(RIGHT(C222,27)=\"com encargos complementares\",\"MO\",IF(ISNUMBER(INDEX(#REF!,MATCH(H222,#REF!,0),7)),\"I\",IF(ISNUMBER(INDEX(#REF!,MATCH(H222,#REF!,0),8)),\"C\",IF(ISTEXT(H222),\"I\",\"\"))))","v":""},"",null,null,null,"",null,""]
["LANÇAMENTO COM USO DE BALDES, ADENSAMENTO E ACABAMENTO DE CONCRETO EM ESTRUTURAS. AF_12/2015",{"$f":"IF(RIGHT(C223,27)=\"com encargos complementares\",\"MO\",IF(ISNUMBER(INDEX(#REF!,MATCH(H223,#REF!,0),7)),\"I\",IF(ISNUMBER(INDEX(#REF!,MATCH(H223,#REF!,0),8)),\"C\",IF(ISTEXT(H223),\"I\",\"\"))))","v":""},"","M3",null,{"$f":"F225","v":"Sinapi 92873"},"",null,""]
[null,{"$f":"IF(RIGHT(C224,27)=\"com encargos complementares\",\"MO\",IF(ISNUMBER(INDEX(#REF!,MATCH(H224,#REF!,0),7)),\"I\",IF(ISNUMBER(INDEX(#REF!,MATCH(H224,#REF!,0),8)),\"C\",IF(ISTEXT(H224),\"I\",\"\"))))","v":""},"",null,null,null,"",null,""]
[null,{"$f":"IF(RIGHT(C225,27)=\"com encargos complementares\",\"MO\",IF(ISNUMBER(INDEX(#REF!,MATCH(H225,#REF!,0),7)),\"I\",IF(ISNUMBER(INDEX(#REF!,MATCH(H225,#REF!,0),8)),\"C\",IF(ISTEXT(H225),\"I\",\"\"))))","v":"MO"},"Carpinteiro de formas com encargos complementares","h",1.8460000000000001,"Sinapi 92873",19.18,"Sinapi 88262",35.409999999999997,{"$f":"SUM(I225:I229)","v":150.85}]
[null,{"$f":"IF(RIGHT(C226,27)=\"com encargos complementares\",\"MO\",IF(ISNUMBER(INDEX(#REF!,MATCH(H226,#REF!,0),7)),\"I\",IF(ISNUMBER(INDEX(#REF!,MATCH(H226,#REF!,0),8)),\"C\",IF(ISTEXT(H226),\"I\",\"\"))))","v":"MO"},"Pedreiro com Encargos Complementares","h",1.8460000000000001,"Sinapi 92873",19.32,"Sinapi 88309",35.659999999999997]
[null,{"$f":"IF(RIGHT(C227,27)=\"com encargos complementares\",\"MO\",IF(ISNUMBER(INDEX(#REF!,MATCH(H227,#REF!,0),7)),\"I\",IF(ISNUMBER(INDEX(#REF!,MATCH(H227,#REF!,0),8)),\"C\",IF(ISTEXT(H227),\"I\",\"\"))))","v":"MO"},"Servente com Encargos Complementares","h",{"$f":"5.538","v":5.5380000000000003},"Sinapi 92873",14.21,"Sinapi 88316",78.69]
[null,{"$f":"IF(RIGHT(C228,27)=\"com encargos complementares\",\"MO\",IF(ISNUMBER(INDEX(#REF!,MATCH(H228,#REF!,0),7)),\"I\",IF(ISNUMBER(INDEX(#REF!,MATCH(H228,#REF!,0),8)),\"C\",IF(ISTEXT(H228),\"I\",\"\"))))","v":"I"},"Vibrador de imersão, diâmetro de ponteira 45mm, motor elétrico trifásico potência de 2 CV - CHP diurno. AF_06/2015","chp",0.67200000000000004,"Sinapi 92873",1.1599999999999999,"Sinapi 90586",0.78]
[null,{"$f":"IF(RIGHT(C229,27)=\"com encargos complementares\",\"MO\",IF(ISNUMBER(INDEX(#REF!,MATCH(H229,#REF!,0),7)),\"I\",IF(ISNUMBER(INDEX(#REF!,MATCH(H229,#REF!,0),8)),\"C\",IF(ISTEXT(H229),\"I\",\"\"))))","v":"I"},"Vibrador de imersão, diâmetro de ponteira 45mm, motor elétrico trifásico potência de 2 CV - CHI diurno. AF_06/2015","chi",1.1739999999999999,"Sinapi 92873",0.26,"Sinapi 90587",0.31]
[null,{"$f":"IF(RIGHT(C230,27)=\"com encargos complementares\",\"MO\",IF(ISNUMBER(INDEX(#REF!,MATCH(H230,#REF!,0),7)),\"I\",IF(ISNUMBER(INDEX(#REF!,MATCH(H230,#REF!,0),8)),\"C\",IF(ISTEXT(H230),\"I\",\"\"))))","v":""},null,null,null,null,"",null,""]
["TRANSPORTE COM CAMINHÃO BASCULANTE DE 6 M3, EM VIA URBANA PAVIMENTADA, DMT ATÉ 30 KM (UNIDADE: M3XKM). AF_01/2018",{"$f":"IF(RIGHT(C231,27)=\"com encargos complementares\",\"MO\",IF(ISNUMBER(INDEX(#REF!,MATCH(H231,#REF!,0),7)),\"I\",IF(ISNUMBER(INDEX(#REF!,MATCH(H231,#REF!,0),8)),\"C\",IF(ISTEXT(H231),\"I\",\"\"))))","v":""},"","M3XKM",null,"Sinapi 97914","",null,""]
[null,{"$f":"IF(RIGHT(C232,27)=\"com encargos complementares\",\"MO\",IF(ISNUMBER(INDEX(#REF!,MATCH(H232,#REF!,0),7)),\"I\",IF(ISNUMBER(INDEX(#REF!,MATCH(H232,#REF!,0),8)),\"C\",IF(ISTEXT(H232),\"I\",\"\"))))","v":""},"",null,null,null,"",null,""]
[null,{"$f":"IF(RIGHT(C233,27)=\"com encargos complementares\",\"MO\",IF(ISNUMBER(INDEX(#REF!,MATCH(H233,#REF!,0),7)),\"I\",IF(ISNUMBER(INDEX(#REF!,MATCH(H233,#REF!,0),8)),\"C\",IF(ISTEXT(H233),\"I\",\"\"))))","v":"I"},"CAMINHÃO BASCULANTE 6 M3 TOCO, PESO BRUTO TOTAL 16.000 KG, CARGA ÚTIL MÁXIMA 11.130 KG, DISTÂNCIA ENTRE EIXOS 5,36 M, POTÊNCIA 185 CV, INCLUSIVE CAÇAMBA METÁLICA - CHP DIURNO. AF_06/2014","CHP",1.042E-2,"Sinapi 97914",131.47,"Sinapi 67826",1.37,{"$f":"SUM(I233:I234)","v":1.4500000000000002}]
[null,{"$f":"IF(RIGHT(C234,27)=\"com encargos complementares\",\"MO\",IF(ISNUMBER(INDEX(#REF!,MATCH(H234,#REF!,0),7)),\"I\",IF(ISNUMBER(INDEX(#REF!,MATCH(H234,#REF!,0),8)),\"C\",IF(ISTEXT(H234),\"I\",\"\"))))","v":"I"},"CAMINHÃO BASCULANTE 6 M3 TOCO, PESO BRUTO TOTAL 16.000 KG, CARGA ÚTIL MÁXIMA 11.130 KG, DISTÂNCIA ENTRE EIXOS 5,36 M, POTÊNCIA 185 CV, INCLUSIVE CAÇAMBA METÁLICA - CHI DIURNO. AF_06/2014","CHI",2.5999999999999999E-3,"Sinapi 97914",29.87,"Sinapi 67827",0.08]
[null,{"$f":"IF(RIGHT(C235,27)=\"com encargos complementares\",\"MO\",IF(ISNUMBER(INDEX(#REF!,MATCH(H235,#REF!,0),7)),\"I\",IF(ISNUMBER(INDEX(#REF!,MATCH(H235,#REF!,0),8)),\"C\",IF(ISTEXT(H235),\"I\",\"\"))))","v":""},"",null,null,null,"",null,""]

{"sheet":"BDI","index":3,"n_rows":47,"n_cols":9,"rows_kept":47,"cut":false,"hidden":false,"merged":[[46,0,46,8],[0,0,0,8],[1,0,1,8],[3,0,3,3],[3,5,3,8],[18,0,18,3],[18,5,18,8],[4,0,5,0],[4,5,5,5]]}
[{"$f":"Orçamentária!A1","v":"Ata de Registro de Preços para Reformas no SF - 2019/2020"}]
["BENEFÍCIOS E DESPESAS INDIRETAS - BDI"]
[]
["BDI Edificações",null,null,null,null,"BDI mero fornecimento"]
["Componentes do BDI","Cálculo sem CPRB","Cálculo com CPRB",null,null,"Componentes do BDI","Cálculo sem CPRB","Cálculo com CPRB"]
[null,"(não-desonerado)","(desonerado)",null,null,null,"(não-desonerado)","(desonerado)"]
[null,"% considerado","% considerado",null,null,null,"% considerado","% considerado"]
["AC",0.04,{"$f":"B8","v":0.04},null,null,"AC",1.6899999999999998E-2,1.6899999999999998E-2]
["S+G",8.0000000000000002E-3,8.0000000000000002E-3,null,null,"S+G",3.0000000000000001E-3,3.0000000000000001E-3]
["R",1.09E-2,1.09E-2,null,null,"R",5.5999999999999999E-3,5.5999999999999999E-3]
["DF",0.01,0.01,null,null,"DF",8.5000000000000006E-3,8.5000000000000006E-3]
["L",6.1600000000000002E-2,6.1600000000000002E-2,null,null,"L",3.5000000000000003E-2,3.5000000000000003E-2]
["PIS",6.4999999999999997E-3,6.4999999999999997E-3,null,null,"PIS",6.4999999999999997E-3,6.4999999999999997E-3]
["COFINS",0.03,0.03,null,null,"COFINS",0.03,0.03]
["CPRB",0,4.4999999999999998E-2,null,null,"CPRB",0,4.4999999999999998E-2]
["ISS",0.02,{"$f":"B16","v":0.02},null,null,"ISS",0,0]
["BDI Edificações",{"$f":"ROUND(((1+B8+B9+B10)*(1+B11)*(1+B12))/(1-(B13+B14+B15+B16))-1,4)","v":0.2034},{"$f":"ROUND(((1+C8+C9+C10)*(1+C11)*(1+C12))/(1-(C13+C14+C15+C16))-1,4)","v":0.2636},null,null,"BDI mero fornecimento",{"$f":"ROUND(((1+G8+G9+G10)*(1+G11)*(1+G12))/(1-(G13+G14+G15+G16))-1,2)","v":0.11},{"$f":"ROUND(((1+H8+H9+H10)*(1+H11)*(1+H12))/(1-(H13+H14+H15+H16))-1,4)","v":0.16539999999999999}]
[]
["Referências TCU - BDI Edificações",null,null,null,null,"Referências TCU - BDI mero fornecimento"]
[null,"1º Quartil","Médio","3º Quartil",null,null,"1º Quartil","Médio","3º Quartil"]
["AC",0.03,0.04,5.5E-2,null,"AC",1.4999999999999999E-2,3.4500000000000003E-2,4.4900000000000002E-2]
["S+G",8.0000000000000002E-3,8.0000000000000002E-3,0.01,null,"S+G",3.0000000000000001E-3,4.7999999999999996E-3,8.2000000000000007E-3]
["R",9.7000000000000003E-3,1.2699999999999999E-2,1.2699999999999999E-2,null,"R",5.5999999999999999E-3,8.5000000000000006E-3,8.8999999999999999E-3]
["DF",5.8999999999999999E-3,1.23E-2,1.3899999999999999E-2,null,"DF",8.5000000000000006E-3,8.5000000000000006E-3,1.11E-2]
["L",6.1600000000000002E-2,7.400000000000001E-2,8.9599999999999999E-2,null,"L",3.5000000000000003E-2,5.11E-2,6.2199999999999998E-2]
[]
["BDI",0.2034,0.22120000000000001,0.25,null,"BDI",0.111,0.14019999999999999,0.16800000000000001]
[]
[]
[]
[]
[]
[]
[]
[]
[]
[]
[]
[]
[]
[]
[]
[]
[]
[]
[]
["Fonte: Acórdãos 2.639/2011-TCU-Plenário e 2.622/2013-TCU-Plenário."]