{"text_format":"1","workbook":"xlsx","n_sheets":4,"sheets":["Orçamentária","Composições","Composições Auxiliares","BDI"],"not_rendered":{"charts":0,"images":4,"macros":0,"external_links":1,"defined_names":88,"comments":1,"pivot_tables":0},"unopened":[],"bounds":{"document_bytes":16777216,"sheet_cells":100000,"rows_first":2000,"rows_last":500,"rows_between":2000,"halvings":0,"cell_chars":16384,"cell_head_chars":4096},"cells_cut":0,"cells_raw":0,"read":"whole","date_system":"1900"}

{"sheet":"Orçamentária","index":0,"n_rows":405,"n_cols":19,"rows_kept":405,"cut":false,"hidden":false,"merged":[[404,0,404,7],[403,0,403,7],[0,0,0,8],[2,0,2,8],[3,0,3,8]]}
["Ata de Registro de Preços para Reformas no SF - 2019/2020"]
[]
["PLANILHA ORÇAMENTÁRIA"]
["Data: Julho de 2019 (data-base: Sinapi jun/2019, Pini jun/2019)"]
["Item","DISCRIMINAÇÃO","UN","QUANT. TOTAL","PREÇO UNITÁRIO","CUSTO DIRETO","BDI (%)","PREÇO UNITÁRIO COM BDI","CUSTO TOTAL",null,"PREÇO UNITÁRIO","Diferença","% alterado","CUSTO DIRETO","Diferença","PREÇO UNITÁRIO COM BDI","Diferença","CUSTO TOTAL","Diferença"]
[null,"GRUPO 1 - SERVIÇOS DE REFORMA",null,null,null,{"$f":"SUBTOTAL(109,F7:F383)","v":9210568.359999992},null,null,{"$f":"SUBTOTAL(109,I7:I383)","v":10762200.439999996}]
["SF-00001","Engenheiro(a) /Arquiteto(a) júnior","hh",3000,{"$f":"OFFSET(INDEX(Composições!A:J,MATCH(B7,Composições!B:B,0),10),2,0)","v":76.03},{"$f":"IF(ISNUMBER(E7),ROUND(D7*E7,2),\"-\")","v":228090},{"$f":"BDI!$B$17","v":0.2034},{"$f":"IF(ISNUMBER(E7),ROUND(E7*(1+G7),2),0)","v":91.49},{"$f":"ROUND(H7*D7,2)","v":274470},null,76.03,{"$f":"IF(E7=K7,\"\",E7-K7)","v":""},{"$f":"IF(ISNUMBER(L7),L7/K7,\"\")","v":""},228090,{"$f":"IF(F7=N7,\"\",F7-N7)","v":""},91.49,{"$f":"IF(H7=P7,\"\",H7-P7)","v":""},274470,{"$f":"IF(I7=R7,\"\",I7-R7)","v":""}]
["SF-00002","Mestre de obras","hh",6000,{"$f":"OFFSET(INDEX(Composições!A:J,MATCH(B8,Composições!B:B,0),10),2,0)","v":23.08},{"$f":"IF(ISNUMBER(E8),ROUND(D8*E8,2),\"-\")","v":138480},{"$f":"BDI!$B$17","v":0.2034},{"$f":"IF(ISNUMBER(E8),ROUND(E8*(1+G8),2),0)","v":27.77},{"$f":"ROUND(H8*D8,2)","v":166620},null,23.08,{"$f":"IF(E8=K8,\"\",E8-K8)","v":""},"",138480,{"$f":"IF(F8=N8,\"\",F8-N8)","v":""},27.77,{"$f":"IF(H8=P8,\"\",H8-P8)","v":""},166620,{"$f":"IF(I8=R8,\"\",I8-R8)","v":""}]
["SF-00003","Planejamento físico-financeiro","un",10,{"$f":"OFFSET(INDEX(Composições!A:J,MATCH(B9,Composições!B:B,0),10),2,0)","v":1382.4},13824,{"$f":"BDI!$B$17","v":0.2034},1663.58,16635.8,null,1382.4,"","",13824,"",1663.58,"",16635.8,""]
["SF-00004","Projetos de segurança do trabalho","un",6,{"$f":"OFFSET(INDEX(Composições!A:J,MATCH(B10,Composições!B:B,0),10),2,0)","v":1954.5},11727,{"$f":"BDI!$B$17","v":0.2034},2352.0500000000002,14112.3,null,1954.5,"","",11727,"",2352.0500000000002,"",14112.3,""]
["SF-00005","Demolição de alvenarias","m3",50,{"$f":"OFFSET(INDEX(Composições!A:J,MATCH(B11,Composições!B:B,0),10),2,0)","v":37.39},1869.5,{"$f":"BDI!$B$17","v":0.2034},45,2250,null,37.39,"","",1869.5,"",45,"",2250,""]
["SF-00006","Demolição de concreto simples","m3",20,{"$f":"OFFSET(INDEX(Composições!A:J,MATCH(B12,Composições!B:B,0),10),2,0)","v":209.85},4197,{"$f":"BDI!$B$17","v":0.2034},252.53,5050.6000000000004,null,209.86,-1.0000000000019327E-2,-4.7650814829025663E-5,4197.2,-0.1999999999998181,252.55,-2.0000000000010232E-2,5051,-0.3999999999996362]
["SF-00007","Demolição de contrapiso","m2",634,{"$f":"OFFSET(INDEX(Composições!A:J,MATCH(B13,Composições!B:B,0),10),2,0)","v":9.9499999999999993},6308.3,{"$f":"BDI!$B$17","v":0.2034},11.97,7588.98,null,9.9499999999999993,"","",6308.3,"",11.97,"",7588.98,""]
["SF-00008","Demolição de fechamento ou parede em gesso acartonado","m2",100,{"$f":"OFFSET(INDEX(Composições!A:J,MATCH(B14,Composições!B:B,0),10),2,0)","v":5.0600000000000005},506,{"$f":"BDI!$B$17","v":0.2034},6.09,609,null,5.0599999999999996,"","",506,"",6.09,"",609,""]
["SF-00009","Demolição de forro de gesso","m2",3300,{"$f":"OFFSET(INDEX(Composições!A:J,MATCH(B15,Composições!B:B,0),10),2,0)","v":1.1000000000000001},3630,{"$f":"BDI!$B$17","v":0.2034},1.32,4356,null,3.36,-2.2599999999999998,-0.67261904761904756,11088,-7458,4.04,-2.7199999999999998,13332,-8976]
["SF-00010","Demolição de infraestrutura elétrica (eletrodutos, eletrocalhas, cabos)","m",5000,{"$f":"OFFSET(INDEX(Composições!A:J,MATCH(B16,Composições!B:B,0),10),2,0)","v":2.2800000000000002},11400,{"$f":"BDI!$B$17","v":0.2034},2.74,13700,null,2.27,1.0000000000000231E-2,4.4052863436124367E-3,11350,50,2.73,1.0000000000000231E-2,13650,50]
["SF-00011","Demolição de revestimento cerâmico, granito, mármore ou granitina","m2",340,{"$f":"OFFSET(INDEX(Composições!A:J,MATCH(B17,Composições!B:B,0),10),2,0)","v":8.25},2805,{"$f":"BDI!$B$17","v":0.2034},9.93,3376.2,null,8.25,"","",2805,"",9.93,"",3376.2,""]
["SF-00012","Demolição de revestimento em argamassa","m2",2000,{"$f":"OFFSET(INDEX(Composições!A:J,MATCH(B18,Composições!B:B,0),10),2,0)","v":2.2199999999999998},4440,{"$f":"BDI!$B$17","v":0.2034},2.67,5340,null,2.21,9.9999999999997868E-3,4.5248868778279576E-3,4420,20,2.66,9.9999999999997868E-3,5320,20]
["SF-00013","Demolição de tubulação hidrossanitária embutida com conexões e acessórios","m",100,{"$f":"OFFSET(INDEX(Composições!A:J,MATCH(B19,Composições!B:B,0),10),2,0)","v":0.33},33,{"$f":"BDI!$B$17","v":0.2034},0.4,40,null,0.34,-1.0000000000000009E-2,-2.9411764705882377E-2,34,-1,0.41,-9.9999999999999534E-3,41,-1]
["SF-00014","Demolição em concreto armado","m3",10,{"$f":"OFFSET(INDEX(Composições!A:J,MATCH(B20,Composições!B:B,0),10),2,0)","v":179.72},1797.2,{"$f":"BDI!$B$17","v":0.2034},216.28,2162.8000000000002,null,179.69,3.0000000000001137E-2,1.6695419889810862E-4,1796.9,0.29999999999995453,216.24,3.9999999999992042E-2,2162.4,0.40000000000009095]
{"$rows_left_out":386}
{"sheet":"Composições","index":1,"n_rows":2427,"n_cols":10,"rows_kept":2427,"cut":false,"hidden":false,"merged":[[2406,0,2411,0],[2406,1,2411,1],[2412,0,2417,0],[2412,1,2417,1],[2316,0,2321,0],[2316,1,2321,1],[2338,0,2342,0],[2338,1,2342,1],[2384,0,2393,0],[2384,1,2393,1],[2394,0,2398,0],[2394,1,2398,1],[2399,0,2405,0],[2399,1,2405,1],[2372,0,2377,0],[2372,1,2377,1],[2354,0,2365,0],[2354,1,2365,1],[2366,0,2371,0],[2366,1,2371,1],[2378,0,2383,0],[1194,0,1200,0],[1194,1,1200,1],[841,0,844,0],[841,1,844,1],[2105,1,2112,1],[2073,0,2080,0],[2073,1,2080,1],[0,2,0,9],[1,2,1,9],[2,2,2,9],[727,1,740,1],[651,0,658,0],[741,0,750,0],[741,1,750,1],[691,0,697,0],[691,1,697,1],[698,1,708,1],[727,0,740,0],[760,0,764,0],[575,1,581,1],[582,0,587,0],[582,1,587,1],[575,0,581,0],[1046,0,1053,0],[2263,0,2267,0],[2263,1,2267,1],[2289,1,2294,1],[2274,0,2281,0],[2274,1,2281,1],[2282,0,2288,0],[2295,0,2301,0],[2295,1,2301,1],[2191,0,2198,0],[2247,0,2252,0],[2247,1,2252,1],[2378,1,2383,1],[2308,0,2315,0],[2308,1,2315,1],[2322,0,2329,0],[2322,1,2329,1],[2330,0,2337,0],[2330,1,2337,1],[2343,0,2346,0],[2343,1,2346,1],[2347,0,2353,0],[2347,1,2353,1],[1979,1,1986,1],[2059,0,2064,0],[2047,0,2052,0],[2047,1,2052,1],[2041,0,2046,0],[2081,0,2088,0],[2097,1,2104,1],[2003,0,2010,0],[2035,0,2040,0],[2035,1,2040,1],[1046,1,1053,1],[0,0,2,0],[760,1,764,1],[765,0,769,0],[765,1,769,1],[651,1,658,1],[643,0,650,0],[643,1,650,1],[635,0,642,0],[635,1,642,1],[755,0,759,0],[755,1,759,1],[709,0,715,0],[679,1,686,1],[698,0,708,0],[596,1,603,1],[536,0,543,0],[604,1,610,1],[611,0,614,0],[611,1,614,1],[615,0,618,0],[615,1,618,1],[588,0,595,0],[588,1,595,1],[619,0,626,0],[619,1,626,1],[596,0,603,0],[449,1,459,1],[460,0,465,0],[424,0,431,0],[424,1,431,1],[466,0,471,0],[466,1,471,1],[492,1,498,1],[520,0,527,0],[520,1,527,1],[492,0,498,0],[552,0,558,0],[552,1,558,1],[528,0,535,0],[528,1,535,1],[544,1,551,1],[506,0,511,0],[506,1,511,1],[499,0,505,0],[499,1,505,1],[567,0,574,0],[2153,0,2158,0],[2153,1,2158,1],[2147,0,2152,0],[2147,1,2152,1],[2134,1,2140,1],[2169,0,2174,0],[2169,1,2174,1],[2241,0,2246,0],[2241,1,2246,1],[2207,0,2214,0],[2207,1,2214,1],[2235,0,2240,0],[2235,1,2240,1],[2215,0,2223,0],[2215,1,2223,1],[2229,0,2234,0],[2229,1,2234,1],[2199,0,2206,0],[2199,1,2206,1],[2134,0,2140,0],[2159,0,2168,0],[2159,1,2168,1],[627,0,634,0],[627,1,634,1],[2141,0,2146,0],[2065,0,2072,0],[2065,1,2072,1],[1963,0,1970,0],[1963,1,1970,1],[1955,0,1962,0],[1955,1,1962,1],[1987,0,1994,0],[1987,1,1994,1],[1971,0,1978,0],[1971,1,1978,1],[1995,0,2002,0],[2089,0,2096,0],[2089,1,2096,1],[2097,0,2104,0],[2053,1,2058,1],[2027,0,2034,0],[2027,1,2034,1],[2019,0,2026,0],[2019,1,2026,1],[2011,0,2018,0],[2011,1,2018,1],[177,0,183,0],[177,1,183,1],[777,0,782,0],[777,1,782,1],[659,0,665,0],[659,1,665,1],[673,0,678,0],[673,1,678,1],[666,0,672,0],[666,1,672,1],[687,0,690,0],[687,1,690,1],[679,0,686,0],[770,0,776,0],[770,1,776,1],[751,0,754,0],[751,1,754,1],[301,0,304,0],[301,1,304,1],[512,0,519,0],[536,1,543,1],[544,0,551,0],[512,1,519,1],[567,1,574,1],[2129,0,2133,0],[2129,1,2133,1],[2059,1,2064,1],[2053,0,2058,0],[1883,0,1889,0],[1883,1,1889,1],[1941,0,1946,0],[1941,1,1946,1],[1934,0,1940,0],[1934,1,1940,1],[1927,0,1933,0],[1927,1,1933,1],[1920,0,1926,0],[1920,1,1926,1],[1913,0,1919,0],[1913,1,1919,1],[1947,0,1954,0],[1947,1,1954,1],[2041,1,2046,1],[2003,1,2010,1],[2081,1,2088,1],[2105,0,2112,0],[1995,1,2002,1],[1979,0,1986,0],[1838,0,1843,0],[1838,1,1843,1],[1844,0,1849,0],[1844,1,1849,1],[1850,0,1854,0],[1850,1,1854,1],[1860,0,1864,0],[1860,1,1864,1],[1855,0,1859,0],[1855,1,1859,1],[1865,0,1870,0],[1865,1,1870,1],[1871,0,1876,0],[1871,1,1876,1],[1877,0,1882,0],[1877,1,1882,1],[1905,0,1912,0],[1905,1,1912,1],[1897,0,1904,0],[1897,1,1904,1],[1890,0,1896,0],[1890,1,1896,1],[1832,0,1837,0],[1832,1,1837,1],[1808,0,1813,0],[1808,1,1813,1],[1826,0,1831,0],[1826,1,1831,1],[1802,0,1807,0],[1802,1,1807,1],[1814,0,1819,0],[1814,1,1819,1],[1820,0,1825,0],[1820,1,1825,1],[1778,0,1783,0],[1778,1,1783,1],[1784,0,1789,0],[1784,1,1789,1],[1771,0,1777,0],[1771,1,1777,1],[1790,0,1795,0],[1790,1,1795,1],[1796,0,1801,0],[1796,1,1801,1],[1616,0,1621,0],[1616,1,1621,1],[1754,0,1758,0],[1754,1,1758,1],[1749,0,1753,0],[1749,1,1753,1],[1759,0,1764,0],[1759,1,1764,1],[1765,0,1770,0],[1765,1,1770,1],[1650,0,1660,0],[1650,1,1660,1],[1661,0,1671,0],[1661,1,1671,1],[1636,0,1641,0],[1636,1,1641,1],[1642,0,1649,0],[1642,1,1649,1],[1622,0,1628,0],[1622,1,1628,1],[1629,0,1635,0],[1629,1,1635,1],[1743,0,1748,0],[1743,1,1748,1],[1447,0,1454,0],[1447,1,1454,1],[1708,0,1714,0],[1708,1,1714,1],[1722,0,1728,0],[1722,1,1728,1],[1736,0,1742,0],[1736,1,1742,1],[1694,0,1700,0],[1694,1,1700,1],[1701,0,1707,0],[1701,1,1707,1],[1715,0,1721,0],[1715,1,1721,1],[1601,0,1605,0],[1601,1,1605,1],[1606,0,1610,0],[1606,1,1610,1],[1595,0,1600,0],[1595,1,1600,1],[1672,0,1682,0],[1672,1,1682,1],[1683,0,1693,0],[1683,1,1693,1],[1432,0,1446,0],[1432,1,1446,1],[1530,0,1535,0],[1530,1,1535,1],[1611,0,1615,0],[1611,1,1615,1],[1387,0,1401,0],[1387,1,1401,1],[1417,0,1431,0],[1417,1,1431,1],[1515,0,1529,0],[1515,1,1529,1],[1494,0,1500,0],[1494,1,1500,1],[1487,0,1493,0],[1487,1,1493,1],[1479,0,1486,0],[1479,1,1486,1],[1463,0,1470,0],[1463,1,1470,1],[1589,0,1594,0],[1589,1,1594,1],[1566,0,1571,0],[1566,1,1571,1],[1536,0,1541,0],[1536,1,1541,1],[1542,0,1547,0],[1542,1,1547,1],[1583,0,1588,0],[1583,1,1588,1],[1455,0,1462,0],[1455,1,1462,1],[1548,0,1554,0],[1548,1,1554,1],[1555,0,1559,0],[1555,1,1559,1],[1572,0,1576,0],[1572,1,1576,1],[1577,0,1582,0],[1577,1,1582,1],[1471,0,1478,0],[1471,1,1478,1],[1508,0,1514,0],[1508,1,1514,1],[1501,0,1507,0],[1501,1,1507,1],[1560,0,1565,0],[1560,1,1565,1],[1402,0,1416,0],[1402,1,1416,1],[1299,0,1304,0],[1299,1,1304,1],[1335,0,1341,0],[1335,1,1341,1],[1323,0,1328,0],[1323,1,1328,1],[1305,0,1310,0],[1305,1,1310,1],[1311,0,1316,0],[1311,1,1316,1],[1317,0,1322,0],[1317,1,1322,1],[1329,0,1334,0],[1329,1,1334,1],[1342,0,1356,0],[1342,1,1356,1],[1372,0,1386,0],[1372,1,1386,1],[1357,0,1371,0],[1357,1,1371,1],[1279,0,1285,0],[1279,1,1285,1],[1292,0,1298,0],[1292,1,1298,1],[1286,0,1291,0],[1286,1,1291,1],[1082,0,1088,0],[1082,1,1088,1],[1103,0,1109,0],[1103,1,1109,1],[1110,0,1116,0],[1110,1,1116,1],[1145,0,1151,0],[1145,1,1151,1],[1269,0,1273,0],[1269,1,1273,1],[1264,0,1268,0],[1264,1,1268,1],[1259,0,1263,0],[1259,1,1263,1],[1221,0,1227,0],[1221,1,1227,1],[1228,0,1234,0],[1228,1,1234,1],[1235,0,1241,0],[1235,1,1241,1],[1274,0,1278,0],[1274,1,1278,1],[1070,0,1074,0],[1070,1,1074,1],[1208,0,1213,0],[1208,1,1213,1],[1242,0,1249,0],[1242,1,1249,1],[1250,0,1258,0],[1250,1,1258,1],[1214,0,1220,0],[1214,1,1220,1],[1166,0,1172,0],[1166,1,1172,1],[1159,0,1165,0],[1159,1,1165,1],[1075,0,1081,0],[1075,1,1081,1],[1096,0,1102,0],[1096,1,1102,1],[1201,0,1207,0],[1201,1,1207,1],[1187,0,1193,0],[1187,1,1193,1],[1089,0,1095,0],[1089,1,1095,1],[1124,0,1130,0],[1124,1,1130,1],[1131,0,1137,0],[1131,1,1137,1],[1138,0,1144,0],[1138,1,1144,1],[1180,0,1186,0],[1180,1,1186,1],[1173,0,1179,0],[1173,1,1179,1],[1117,0,1123,0],[1117,1,1123,1],[1152,0,1158,0],[1152,1,1158,1],[983,1,989,1],[997,0,1003,0],[997,1,1003,1],[1028,0,1035,0],[1028,1,1035,1],[990,0,996,0],[990,1,996,1],[1004,0,1010,0],[1004,1,1010,1],[1020,0,1027,0],[1020,1,1027,1],[1011,0,1019,0],[1011,1,1019,1],[885,1,890,1],[911,0,917,0],[911,1,917,1],[918,0,928,0],[918,1,928,1],[929,0,939,0],[929,1,939,1],[1064,0,1069,0],[1064,1,1069,1],[950,0,958,0],[950,1,958,1],[940,0,944,0],[940,1,944,1],[945,0,949,0],[945,1,949,1],[1059,0,1063,0],[1059,1,1063,1],[1054,0,1058,0],[1054,1,1058,1],[959,0,963,0],[959,1,963,1],[1036,0,1045,0],[1036,1,1045,1],[983,0,989,0],[400,0,411,0],[400,1,411,1],[834,1,840,1],[783,0,787,0],[783,1,787,1],[788,0,793,0],[788,1,793,1],[807,0,814,0],[807,1,814,1],[834,0,840,0],[815,0,821,0],[815,1,821,1],[822,0,828,0],[822,1,828,1],[801,0,806,0],[801,1,806,1],[829,0,833,0],[829,1,833,1],[794,0,800,0],[794,1,800,1],[709,1,715,1],[559,0,566,0],[559,1,566,1],[604,0,610,0],[213,0,217,0],[256,1,263,1],[479,0,485,0],[479,1,485,1],[372,0,378,0],[372,1,378,1],[486,0,491,0],[486,1,491,1],[460,1,465,1],[418,0,423,0],[418,1,423,1],[412,0,417,0],[412,1,417,1],[432,0,441,0],[432,1,441,1],[379,0,392,0],[379,1,392,1],[393,0,399,0],[393,1,399,1],[472,0,478,0],[472,1,478,1],[442,0,448,0],[442,1,448,1],[449,0,459,0],[343,0,348,0],[343,1,348,1],[349,0,357,0],[349,1,357,1],[305,0,319,0],[305,1,319,1],[264,0,270,0],[264,1,270,1],[271,0,277,0],[271,1,277,1],[330,0,342,0],[278,0,289,0],[5,0,8,0],[5,1,8,1],[58,0,62,0],[58,1,62,1],[41,1,45,1],[159,0,163,0],[159,1,163,1],[86,0,90,0],[86,1,90,1],[9,0,12,0],[9,1,12,1],[76,0,80,0],[76,1,80,1],[51,0,57,0],[51,1,57,1],[32,0,35,0],[32,1,35,1],[27,0,31,0],[27,1,31,1],[96,0,100,0],[96,1,100,1],[36,1,40,1],[105,1,109,1],[152,1,158,1],[358,0,371,0],[213,1,217,1],[278,1,289,1],[13,0,16,0],[13,1,16,1],[230,0,238,0],[230,1,238,1],[199,0,203,0],[199,1,203,1],[101,0,104,0],[101,1,104,1],[17,1,21,1],[17,0,21,0],[218,0,221,0],[218,1,221,1],[142,1,146,1],[164,0,168,0],[164,1,168,1],[81,0,85,0],[81,1,85,1],[115,0,118,0],[115,1,118,1],[22,1,26,1],[22,0,26,0],[36,0,40,0],[173,1,176,1],[173,0,176,0],[124,0,128,0],[124,1,128,1],[204,0,207,0],[204,1,207,1],[110,0,114,0],[110,1,114,1],[119,0,123,0],[119,1,123,1],[195,0,198,0],[195,1,198,1],[184,1,190,1],[152,0,158,0],[147,0,151,0],[147,1,151,1],[169,0,172,0],[169,1,172,1],[142,0,146,0],[105,0,109,0],[41,0,45,0],[46,1,50,1],[184,0,190,0],[964,1,973,1],[974,0,982,0],[897,1,903,1],[891,0,896,0],[891,1,896,1],[885,0,890,0],[63,0,67,0],[63,1,67,1],[46,0,50,0],[974,1,982,1],[904,0,910,0],[904,1,910,1],[897,0,903,0],[208,0,212,0],[208,1,212,1],[239,0,249,0],[239,1,249,1],[222,0,225,0],[222,1,225,1],[226,0,229,0],[226,1,229,1],[250,0,255,0],[250,1,255,1],[964,0,973,0],[1729,0,1735,0],[1729,1,1735,1],[191,0,194,0],[191,1,194,1],[68,0,75,0],[68,1,75,1],[133,0,136,0],[133,1,136,1],[137,0,141,0],[137,1,141,1],[91,0,95,0],[91,1,95,1],[129,0,132,0],[129,1,132,1],[716,0,726,0],[716,1,726,1],[358,1,371,1],[330,1,342,1],[290,0,300,0],[290,1,300,1],[320,0,329,0],[320,1,329,1],[256,0,263,0],[845,0,850,0],[845,1,850,1],[851,0,859,0],[851,1,859,1],[876,0,884,0],[876,1,884,1],[867,0,875,0],[867,1,875,1],[860,0,866,0],[860,1,866,1],[2418,0,2426,0],[2418,1,2426,1],[2302,0,2307,0],[2302,1,2307,1],[2289,0,2294,0],[2113,0,2120,0],[2113,1,2120,1],[2121,0,2128,0],[2121,1,2128,1],[2282,1,2288,1],[2268,0,2273,0],[2268,1,2273,1],[2253,0,2257,0],[2253,1,2257,1],[2191,1,2198,1],[2141,1,2146,1],[2258,0,2262,0],[2258,1,2262,1],[2183,0,2190,0],[2183,1,2190,1],[2224,0,2228,0],[2224,1,2228,1],[2175,0,2182,0],[2175,1,2182,1]]}
[null,"SENADO FEDERAL",{"$f":"Orçamentária!A1","v":"Ata de Registro de Preços para Reformas no SF - 2019/2020"}]
[null,"SECRETARIA DE INFRAESTRUTURA","COMPOSIÇÕES"]
[null,"SERVIÇO DE ORÇAMENTOS",{"$f":"Orçamentária!A4","v":"Data: Julho de 2019 (data-base: Sinapi jun/2019, Pini jun/2019)"}]
[]
["Item","Discriminação","Especificação do Serviço","Unidade","Coeficiente","Fonte do Coeficiente","Preço unitário","Fonte do Preço","Preço","TOTAL"]
["SF-00001","Engenheiro(a) /Arquiteto(a) júnior",null,"hh",null,"Sinapi 90777","",null,{"$f":"IF(ISNUMBER(G6),ROUND(E6*G6,2),\"\")","v":""}]
[null,null,null,null,null,null,"",null,""]
[null,null,"Engenheiro civil de obra junior com encargos complementares","h",1,"Sinapi 90777",76.03,"Sinapi 90777",76.03,{"$f":"SUM(I8:I8)","v":76.03}]
[null,null,null,null,null,null,"",null,""]
["SF-00002","Mestre de obras",null,"hh",null,"Sinapi 90780","",null,""]
[null,null,null,null,null,null,"",null,""]
[null,null,"Mestre de obras com encargos complementares","h",1,"Sinapi 90780",23.08,"Sinapi 90780",23.08,{"$f":"SUM(I12:I12)","v":23.08}]
[null,null,null,null,null,null,"",null,""]
["SF-00003","Planejamento físico-financeiro",null,"un",null,"Senado Federal","",null,""]
[null,null,null,null,null,null,"",null,""]
[null,null,"Engenheiro Civil de Obra Pleno com encargos complementares","h",16,"Senado Federal",86.4,"Sinapi 90778",1382.4,{"$f":"SUM(I16:I16)","v":1382.4}]
[null,null,null,null,null,null,"",null,""]
["SF-00004","Projetos de segurança do trabalho",null,"un",null,"Senado Federal","",null,""]
[null,null,null,null,null,null,"",null,""]
[null,null,"Engenheiro Civil de Obra Pleno com encargos complementares","h",20,"Senado Federal",86.4,"Sinapi 90778",1728,{"$f":"SUM(I20:I21)","v":1954.5}]
{"$rows_left_out":2408}
{"sheet":"Composições Auxiliares","index":2,"n_rows":235,"n_cols":10,"rows_kept":235,"cut":false,"hidden":false,"merged":[[222,0,229,0],[230,0,234,0],[89,0,97,0],[201,0,206,0],[207,0,212,0],[213,0,217,0],[98,0,106,0],[218,0,221,0],[107,0,112,0],[195,0,200,0],[113,0,118,0],[184,0,194,0],[119,0,124,0],[125,0,130,0],[131,0,136,0],[143,0,148,0],[155,0,162,0],[137,0,142,0],[163,0,175,0],[176,0,183,0],[149,0,154,0],[0,1,0,9],[1,1,1,9],[66,0,72,0],[73,0,81,0],[82,0,88,0],[36,0,45,0],[14,0,18,0],[19,0,24,0],[46,0,57,0],[58,0,65,0],[5,0,13,0],[25,0,35,0],[2,1,2,9]]}
["SENADO FEDERAL",{"$f":"Composições!C1","v":"Ata de Registro de Preços para Reformas no SF - 2019/2020"}]
["SECRETARIA DE INFRAESTRUTURA","COMPOSIÇÕES AUXILIARES"]
["SERVIÇO DE ORÇAMENTOS",{"$f":"Composições!C3","v":"Data: Julho de 2019 (data-base: Sinapi jun/2019, Pini jun/2019)"}]
[]
["Discriminação",null,"Especificação do Serviço","Unidade","Coeficiente","Fonte do Coeficiente","Preço unitário","Fonte do Preço","Preço","Total"]
["Argamassa traço 1:3 (cimento e areia média), preparo manual. AF_08/2014",null,"","M3",null,"Sinapi 88629 + Sinapi 97914",null,null,{"$f":"IF(ISNUMBER(G6),ROUND(G6*$E6,2),\"\")","v":""}]
[null,null,"",null,null,null,null,null,{"$f":"IF(ISNUMBER(G7),ROUND(G7*$E7,2),\"\")","v":""}]
[null,{"$f":"IF(RIGHT(C8,27)=\"com encargos complementares\",\"MO\",IF(ISNUMBER(INDEX(#REF!,MATCH(H8,#REF!,0),7)),\"I\",IF(ISNUMBER(INDEX(#REF!,MATCH(H8,#REF!,0),8)),\"C\",IF(ISTEXT(H8),\"I\",\"\"))))","v":"I"},"Areia media - posto jazida/fornecedor (retirado na jazida, sem transporte)","M3",1.1499999999999999,"Sinapi 88629",80.84,"Sinapi 370",92.97,{"$f":"SUM(I8:I11)","v":409.95000000000005}]
[null,{"$f":"IF(RIGHT(C9,27)=\"com encargos complementares\",\"MO\",IF(ISNUMBER(INDEX(#REF!,MATCH(H9,#REF!,0),7)),\"I\",IF(ISNUMBER(INDEX(#REF!,MATCH(H9,#REF!,0),8)),\"C\",IF(ISTEXT(H9),\"I\",\"\"))))","v":"I"},"Cimento Portland composto CP II-32","KG",441.51,"Sinapi 88629",0.37,"Sinapi 1379",163.36000000000001]
[null,{"$f":"IF(RIGHT(C10,27)=\"com encargos complementares\",\"MO\",IF(ISNUMBER(INDEX(#REF!,MATCH(H10,#REF!,0),7)),\"I\",IF(ISNUMBER(INDEX(#REF!,MATCH(H10,#REF!,0),8)),\"C\",IF(ISTEXT(H10),\"I\",\"\"))))","v":"MO"},"Servente com encargos complementares","H",8.48,"Sinapi 88629",14.21,"Sinapi 88316",120.5]
[null,null,"TRANSPORTE COM CAMINHÃO BASCULANTE DE 6 M3, EM VIA URBANA PAVIMENTADA, DMT ATÉ 30 KM (UNIDADE: M3XKM). AF_01/2018","m3xkm",{"$f":"1.15*20","v":23},"Sinapi 97914",1.44,"Sinapi 97914",33.119999999999997]
[null,null,null,null,null,null,"",null,""]
[null,null,"Obs.: Considerando fornecedor de areia a 20 km do Senado Federal.",null,null,null,"",null,""]
[null,{"$f":"IF(RIGHT(C14,27)=\"com encargos complementares\",\"MO\",IF(ISNUMBER(INDEX(#REF!,MATCH(H14,#REF!,0),7)),\"I\",IF(ISNUMBER(INDEX(#REF!,MATCH(H14,#REF!,0),8)),\"C\",IF(ISTEXT(H14),\"I\",\"\"))))","v":""},"",null,null,null,"",null,""]
["Fixação utilizando parafuso e bucha de nylon, somente mão de obra. af_10/2016",{"$f":"IF(RIGHT(C15,27)=\"com encargos complementares\",\"MO\",IF(ISNUMBER(INDEX(#REF!,MATCH(H15,#REF!,0),7)),\"I\",IF(ISNUMBER(INDEX(#REF!,MATCH(H15,#REF!,0),8)),\"C\",IF(ISTEXT(H15),\"I\",\"\"))))","v":""},"","UN.",null,{"$f":"F17","v":"Sinapi 95541"},"",null,""]
[null,{"$f":"IF(RIGHT(C16,27)=\"com encargos complementares\",\"MO\",IF(ISNUMBER(INDEX(#REF!,MATCH(H16,#REF!,0),7)),\"I\",IF(ISNUMBER(INDEX(#REF!,MATCH(H16,#REF!,0),8)),\"C\",IF(ISTEXT(H16),\"I\",\"\"))))","v":""},"",null,null,null,"",null,""]
[null,{"$f":"IF(RIGHT(C17,27)=\"com encargos complementares\",\"MO\",IF(ISNUMBER(INDEX(#REF!,MATCH(H17,#REF!,0),7)),\"I\",IF(ISNUMBER(INDEX(#REF!,MATCH(H17,#REF!,0),8)),\"C\",IF(ISTEXT(H17),\"I\",\"\"))))","v":"MO"},"Auxiliar de encanador ou bombeiro hidráulico com encargos complementares","H",2.2700000000000001E-2,"Sinapi 95541",14.78,"Sinapi 88248",0.34,{"$f":"SUM(I17:I18)","v":3.4099999999999997}]
[null,{"$f":"IF(RIGHT(C18,27)=\"com encargos complementares\",\"MO\",IF(ISNUMBER(INDEX(#REF!,MATCH(H18,#REF!,0),7)),\"I\",IF(ISNUMBER(INDEX(#REF!,MATCH(H18,#REF!,0),8)),\"C\",IF(ISTEXT(H18),\"I\",\"\"))))","v":"MO"},"Encanador ou bombeiro hidráulico com encargos complementares","H",0.16209999999999999,"Sinapi 95541",18.95,"Sinapi 88267",3.07]
[null,{"$f":"IF(RIGHT(C19,27)=\"com encargos complementares\",\"MO\",IF(ISNUMBER(INDEX(#REF!,MATCH(H19,#REF!,0),7)),\"I\",IF(ISNUMBER(INDEX(#REF!,MATCH(H19,#REF!,0),8)),\"C\",IF(ISTEXT(H19),\"I\",\"\"))))","v":""},"",null,null,null,"",null,""]
["Fixação de tubos horizontais de PVC, CPVC ou cobre diâmetros menores ou iguais a 40 mm ou eletrocalhas até 150mm de largura, com abraçadeira metálica rígida tipo d 1/2\u0094, fixada em perfilado em laje. af_05/2015",{"$f":"IF(RIGHT(C20,27)=\"com encargos complementares\",\"MO\",IF(ISNUMBER(INDEX(#REF!,MATCH(H20,#REF!,0),7)),\"I\",IF(ISNUMBER(INDEX(#REF!,MATCH(H20,#REF!,0),8)),\"C\",IF(ISTEXT(H20),\"I\",\"\"))))","v":""},"","UN.",null,{"$f":"F22","v":"Sinapi 91170"},"",null,""]
{"$rows_left_out":216}
{"sheet":"BDI","index":3,"n_rows":47,"n_cols":9,"rows_kept":47,"cut":false,"hidden":false,"merged":[[46,0,46,8],[0,0,0,8],[1,0,1,8],[3,0,3,3],[3,5,3,8],[18,0,18,3],[18,5,18,8],[4,0,5,0],[4,5,5,5]]}
[{"$f":"Orçamentária!A1","v":"Ata de Registro de Preços para Reformas no SF - 2019/2020"}]
["BENEFÍCIOS E DESPESAS INDIRETAS - BDI"]
[]
["BDI Edificações",null,null,null,null,"BDI mero fornecimento"]
["Componentes do BDI","Cálculo sem CPRB","Cálculo com CPRB",null,null,"Componentes do BDI","Cálculo sem CPRB","Cálculo com CPRB"]
[null,"(não-desonerado)","(desonerado)",null,null,null,"(não-desonerado)","(desonerado)"]
[null,"% considerado","% considerado",null,null,null,"% considerado","% considerado"]
["AC",0.04,{"$f":"B8","v":0.04},null,null,"AC",1.6899999999999998E-2,1.6899999999999998E-2]
["S+G",8.0000000000000002E-3,8.0000000000000002E-3,null,null,"S+G",3.0000000000000001E-3,3.0000000000000001E-3]
["R",1.09E-2,1.09E-2,null,null,"R",5.5999999999999999E-3,5.5999999999999999E-3]
["DF",0.01,0.01,null,null,"DF",8.5000000000000006E-3,8.5000000000000006E-3]
["L",6.1600000000000002E-2,6.1600000000000002E-2,null,null,"L",3.5000000000000003E-2,3.5000000000000003E-2]
["PIS",6.4999999999999997E-3,6.4999999999999997E-3,null,null,"PIS",6.4999999999999997E-3,6.4999999999999997E-3]
["COFINS",0.03,0.03,null,null,"COFINS",0.03,0.03]
["CPRB",0,4.4999999999999998E-2,null,null,"CPRB",0,4.4999999999999998E-2]
["ISS",0.02,{"$f":"B16","v":0.02},null,null,"ISS",0,0]
["BDI Edificações",{"$f":"ROUND(((1+B8+B9+B10)*(1+B11)*(1+B12))/(1-(B13+B14+B15+B16))-1,4)","v":0.2034},{"$f":"ROUND(((1+C8+C9+C10)*(1+C11)*(1+C12))/(1-(C13+C14+C15+C16))-1,4)","v":0.2636},null,null,"BDI mero fornecimento",{"$f":"ROUND(((1+G8+G9+G10)*(1+G11)*(1+G12))/(1-(G13+G14+G15+G16))-1,2)","v":0.11},{"$f":"ROUND(((1+H8+H9+H10)*(1+H11)*(1+H12))/(1-(H13+H14+H15+H16))-1,4)","v":0.16539999999999999}]
[]
["Referências TCU - BDI Edificações",null,null,null,null,"Referências TCU - BDI mero fornecimento"]
[null,"1º Quartil","Médio","3º Quartil",null,null,"1º Quartil","Médio","3º Quartil"]
{"$rows_left_out":27}