{"text_format":"1","workbook":"xlsx","n_sheets":4,"sheets":["Orçamentária","Composições","Composições Auxiliares","BDI"],"not_rendered":{"charts":0,"images":4,"macros":1,"external_links":0,"defined_names":1009,"comments":1,"pivot_tables":0},"unopened":[],"bounds":{"document_bytes":16777216,"sheet_cells":100000,"rows_first":2000,"rows_last":500,"rows_between":2000,"halvings":0,"cell_chars":16384,"cell_head_chars":4096},"cells_cut":0,"cells_raw":0,"read":"whole","date_system":"1900"}

{"sheet":"Orçamentária","index":0,"n_rows":386,"n_cols":13,"rows_kept":386,"cut":false,"hidden":false,"merged":[[0,1,0,12],[1,1,1,12],[2,1,2,12],[385,8,385,11],[384,1,384,7],[385,1,385,7]]}
[null,"Ata de Registro de Preços para Reformas no SF - 2018/2019"]
[null,"PLANILHA ORÇAMENTÁRIA"]
[null,"Data: Setembro de 2018 (data-base: Sinapi ago/2018, Pini ago/2018 e Orse jul/2018)"]
["-","Número-SF","Grande Área","Categoria","DISCRIMINAÇÃO","UN","QUANT. TOTAL","PREÇO UNITÁRIO","CUSTO DIRETO","BDI (%)","PREÇO UNITÁRIO COM BDI","CUSTO TOTAL","FONTE/CÓD./OBS."]
["-","SF-00001","Serviços de Apoio","Serviços Técnicos","Engenheiro(a) /Arquiteto(a) júnior","hh",3000,{"$f":"OFFSET(INDEX(Composições!A:M,MATCH(E5,Composições!B:B,0),13),2,0)","v":72.150000000000006},{"$f":"IF(ISNUMBER(H5),ROUND(G5*H5,2),\"-\")","v":216450},{"$f":"BDI!$B$17","v":0.20335932421833602},{"$f":"IF(ISNUMBER(H5),ROUND(H5*(1+J5),2),0)","v":86.82},{"$f":"ROUND(K5*G5,2)","v":260460},"Sinapi 90777"]
["-","SF-00002","Serviços de Apoio","Serviços Técnicos","Mestre de obras","hh",6000,{"$f":"OFFSET(INDEX(Composições!A:M,MATCH(E6,Composições!B:B,0),13),2,0)","v":21.75},{"$f":"IF(ISNUMBER(H6),ROUND(G6*H6,2),\"-\")","v":130500},{"$f":"BDI!$B$17","v":0.20335932421833602},{"$f":"IF(ISNUMBER(H6),ROUND(H6*(1+J6),2),0)","v":26.17},{"$f":"ROUND(K6*G6,2)","v":157020},"Sinapi 90780"]
["-","SF-00003","Serviços de Apoio","Serviços Técnicos","Planejamento físico-financeiro","un",10,{"$f":"OFFSET(INDEX(Composições!A:M,MATCH(E7,Composições!B:B,0),13),2,0)","v":1313.14},13131.4,{"$f":"BDI!$B$17","v":0.20335932421833602},1580.18,15801.8,"Senado Federal"]
["-","SF-00004","Serviços de Apoio","Serviços Técnicos","Projetos de segurança do trabalho","un",5,{"$f":"OFFSET(INDEX(Composições!A:M,MATCH(E8,Composições!B:B,0),13),2,0)","v":1838.1100000000001},9190.5499999999993,{"$f":"BDI!$B$17","v":0.20335932421833602},2211.91,11059.55,"Senado Federal"]
[null,"SF-00005","Serviços de Apoio","Serviços Preliminares","Demolição de alvenarias","m3",8,{"$f":"OFFSET(INDEX(Composições!A:M,MATCH(E9,Composições!B:B,0),13),2,0)","v":34.69},277.52,{"$f":"BDI!$B$17","v":0.20335932421833602},41.74,333.92,"Sinapi 97622"]
[null,"SF-00006","Serviços de Apoio","Serviços Preliminares","Demolição de concreto simples","m3",20,{"$f":"OFFSET(INDEX(Composições!A:M,MATCH(E10,Composições!B:B,0),13),2,0)","v":194.72},3894.4,{"$f":"BDI!$B$17","v":0.20335932421833602},234.32,4686.3999999999996,"Seinfra C1049 Adaptada"]
[null,"SF-00007","Serviços de Apoio","Serviços Preliminares","Demolição de contrapiso","m2",500,{"$f":"OFFSET(INDEX(Composições!A:M,MATCH(E11,Composições!B:B,0),13),2,0)","v":9.2200000000000006},4610,{"$f":"BDI!$B$17","v":0.20335932421833602},11.09,5545,"SCO/RJ - SC 05.05.0800 Adaptada"]
[null,"SF-00008","Serviços de Apoio","Serviços Preliminares","Demolição de fechamento ou divisória em gesso acartonado","m2",100,{"$f":"OFFSET(INDEX(Composições!A:M,MATCH(E12,Composições!B:B,0),13),2,0)","v":4.6399999999999997},464,{"$f":"BDI!$B$17","v":0.20335932421833602},5.58,558,"Sinapi 97638"]
[null,"SF-00009","Serviços de Apoio","Serviços Preliminares","Demolição de forro de gesso","m2",3300,{"$f":"OFFSET(INDEX(Composições!A:M,MATCH(E13,Composições!B:B,0),13),2,0)","v":3.14},10362,{"$f":"BDI!$B$17","v":0.20335932421833602},3.78,12474,"Sinapi 97641"]
[null,"SF-00010","Serviços de Apoio","Serviços Preliminares","Demolição de infraestrutura elétrica (eletrodutos, eletrocalhas, cabos)","m",5000,{"$f":"OFFSET(INDEX(Composições!A:M,MATCH(E14,Composições!B:B,0),13),2,0)","v":2.12},10600,{"$f":"BDI!$B$17","v":0.20335932421833602},2.5499999999999998,12750,"Sinapi 97661 Adaptada"]
[null,"SF-00011","Serviços de Apoio","Serviços Preliminares","Demolição de revestimento cerâmico, granito, mármore ou granitina","m2",340,{"$f":"OFFSET(INDEX(Composições!A:M,MATCH(E15,Composições!B:B,0),13),2,0)","v":7.72},2624.8,{"$f":"BDI!$B$17","v":0.20335932421833602},9.2899999999999991,3158.6,"Sinapi 97634"]
[null,"SF-00012","Serviços de Apoio","Serviços Preliminares","Demolição de revestimento em argamassa","m2",2000,{"$f":"OFFSET(INDEX(Composições!A:M,MATCH(E16,Composições!B:B,0),13),2,0)","v":2.0699999999999998},4140,{"$f":"BDI!$B$17","v":0.20335932421833602},2.4900000000000002,4980,"Sinapi 97631"]
[null,"SF-00013","Serviços de Apoio","Serviços Preliminares","Demolição de tubulação hidrossanitária embutida com conexões e acessórios","m",100,{"$f":"OFFSET(INDEX(Composições!A:M,MATCH(E17,Composições!B:B,0),13),2,0)","v":0.31},31,{"$f":"BDI!$B$17","v":0.20335932421833602},0.37,37,"Sinapi 97662"]
[null,"SF-00014","Serviços de Apoio","Serviços Preliminares","Demolição em concreto armado","m3",10,{"$f":"OFFSET(INDEX(Composições!A:M,MATCH(E18,Composições!B:B,0),13),2,0)","v":167.94},1679.4,{"$f":"BDI!$B$17","v":0.20335932421833602},202.09,2020.9,"Sinapi 97627"]
[null,"SF-00015","Serviços de Apoio","Serviços Preliminares","Locação de caçambas","un",110,330,36300,{"$f":"BDI!$B$17","v":0.20335932421833602},397.11,43682.1,"Pesquisa Simples"]
[null,"SF-00016","Serviços de Apoio","Serviços Preliminares","Remoção de armários","m2",240,{"$f":"OFFSET(INDEX(Composições!A:M,MATCH(E20,Composições!B:B,0),13),2,0)","v":10.93},2623.2,{"$f":"BDI!$B$17","v":0.20335932421833602},13.15,3156,"SCO/RJ - SC 05.05.1750 Adaptada"]
[null,"SF-00017","Serviços de Apoio","Serviços Preliminares","Remoção de bancadas","m2",40,{"$f":"OFFSET(INDEX(Composições!A:M,MATCH(E21,Composições!B:B,0),13),2,0)","v":15.89},635.6,{"$f":"BDI!$B$17","v":0.20335932421833602},19.12,764.8,"Orse 8387 Adaptada"]
[null,"SF-00018","Serviços de Apoio","Serviços Preliminares","Remoção de batentes de madeira","un",20,{"$f":"OFFSET(INDEX(Composições!A:M,MATCH(E22,Composições!B:B,0),13),2,0)","v":4.05},81,{"$f":"BDI!$B$17","v":0.20335932421833602},4.87,97.4,"Sinapi 97644 Adaptada"]
[null,"SF-00019","Serviços de Apoio","Serviços Preliminares","Remoção de canaleta em alumínio","m",300,{"$f":"OFFSET(INDEX(Composições!A:M,MATCH(E23,Composições!B:B,0),13),2,0)","v":3.34},1002,{"$f":"BDI!$B$17","v":0.20335932421833602},4.0199999999999996,1206,"Orse 010276 Adaptada"]
[null,"SF-00020","Serviços de Apoio","Serviços Preliminares","Remoção de carpete","m2",400,{"$f":"OFFSET(INDEX(Composições!A:M,MATCH(E24,Composições!B:B,0),13),2,0)","v":1.49},596,{"$f":"BDI!$B$17","v":0.20335932421833602},1.79,716,"Pini 02.102.000043.SER Adaptada"]
[null,"SF-00021","Serviços de Apoio","Serviços Preliminares","Remoção de cortinas","m",50,{"$f":"OFFSET(INDEX(Composições!A:M,MATCH(E25,Composições!B:B,0),13),2,0)","v":2.68},134,{"$f":"BDI!$B$17","v":0.20335932421833602},3.23,161.5,"SBC 022086"]
[null,"SF-00022","Serviços de Apoio","Serviços Preliminares","Remoção de difusores, grelhas e acessórios de climatização","un",120,{"$f":"OFFSET(INDEX(Composições!A:M,MATCH(E26,Composições!B:B,0),13),2,0)","v":16.36},1963.2,{"$f":"BDI!$B$17","v":0.20335932421833602},19.690000000000001,2362.8000000000002,"Orse 08857 Adaptada"]
[null,"SF-00023","Serviços de Apoio","Serviços Preliminares","Remoção de divisória de mármore ou granito","m2",60,{"$f":"OFFSET(INDEX(Composições!A:M,MATCH(E27,Composições!B:B,0),13),2,0)","v":24.770000000000003},1486.2,{"$f":"BDI!$B$17","v":0.20335932421833602},29.81,1788.6,"Seinfra C1051 Adaptada"]
[null,"SF-00024","Serviços de Apoio","Serviços Preliminares","Remoção de divisórias de MDF e gesso acartonado","m2",250,{"$f":"OFFSET(INDEX(Composições!A:M,MATCH(E28,Composições!B:B,0),13),2,0)","v":21.65},5412.5,{"$f":"BDI!$B$17","v":0.20335932421833602},26.05,6512.5,"Sinapi 72178"]
["-","SF-00025","Serviços de Apoio","Serviços Preliminares","Remoção de dutos/tubulações","m",2000,{"$f":"OFFSET(INDEX(Composições!A:M,MATCH(E29,Composições!B:B,0),13),2,0)","v":7.12},14240,{"$f":"BDI!$B$17","v":0.20335932421833602},8.57,17140,"Seinfra C3389 Adaptada"]
[null,"SF-00026","Serviços de Apoio","Serviços Preliminares","Remoção de esquadrias metálicas","m2",100,{"$f":"OFFSET(INDEX(Composições!A:M,MATCH(E30,Composições!B:B,0),13),2,0)","v":7.5},750,{"$f":"BDI!$B$17","v":0.20335932421833602},9.0299999999999994,903,"Pini 02.102.000031.SER Adaptada"]
[null,"SF-00027","Serviços de Apoio","Serviços Preliminares","Remoção de exaustor","un",20,{"$f":"OFFSET(INDEX(Composições!A:M,MATCH(E31,Composições!B:B,0),13),2,0)","v":15.65},313,{"$f":"BDI!$B$17","v":0.20335932421833602},18.829999999999998,376.6,"Orse 11102 Adaptada"]
[null,"SF-00028","Serviços de Apoio","Serviços Preliminares","Remoção de ferragens de porta","un",100,{"$f":"OFFSET(INDEX(Composições!A:M,MATCH(E32,Composições!B:B,0),13),2,0)","v":4.51},451,{"$f":"BDI!$B$17","v":0.20335932421833602},5.43,543,"Orse 04859 Adaptada"]
[null,"SF-00029","Serviços de Apoio","Serviços Preliminares","Remoção de folha de porta","un",60,{"$f":"OFFSET(INDEX(Composições!A:M,MATCH(E33,Composições!B:B,0),13),2,0)","v":5.7899999999999991},347.4,{"$f":"BDI!$B$17","v":0.20335932421833602},6.97,418.2,"Sinapi 97644"]
[null,"SF-00030","Serviços de Apoio","Serviços Preliminares","Remoção de laminado melamínico (LDAP), em PVC ou vinílico","m2",1000,{"$f":"OFFSET(INDEX(Composições!A:M,MATCH(E34,Composições!B:B,0),13),2,0)","v":13.48},13480,{"$f":"BDI!$B$17","v":0.20335932421833602},16.22,16220,"Pini 02.102.000044.SER Adaptada"]
[null,"SF-00031","Serviços de Apoio","Serviços Preliminares","Remoção de louças","un",120,{"$f":"OFFSET(INDEX(Composições!A:M,MATCH(E35,Composições!B:B,0),13),2,0)","v":7.72},926.4,{"$f":"BDI!$B$17","v":0.20335932421833602},9.2899999999999991,1114.8,"Sinapi 97663"]
[null,"SF-00032","Serviços de Apoio","Serviços Preliminares","Remoção de luminária","un",500,{"$f":"OFFSET(INDEX(Composições!A:M,MATCH(E36,Composições!B:B,0),13),2,0)","v":4.0399999999999991},2020,{"$f":"BDI!$B$17","v":0.20335932421833602},4.8600000000000003,2430,"Sinapi 97665 Adaptada"]
[null,"SF-00033","Serviços de Apoio","Serviços Preliminares","Remoção de metais e acessórios","un",300,{"$f":"OFFSET(INDEX(Composições!A:M,MATCH(E37,Composições!B:B,0),13),2,0)","v":5.62},1686,{"$f":"BDI!$B$17","v":0.20335932421833602},6.76,2028,"Sinapi 97666"]
[null,"SF-00034","Serviços de Apoio","Serviços Preliminares","Remoção de painéis de vidro temperado","m2",460,{"$f":"OFFSET(INDEX(Composições!A:M,MATCH(E38,Composições!B:B,0),13),2,0)","v":10.96},5041.6000000000004,{"$f":"BDI!$B$17","v":0.20335932421833602},13.19,6067.4,"Orse 4715 Adaptada"]
[null,"SF-00035","Serviços de Apoio","Serviços Preliminares","Remoção de película","m2",80,18,1440,{"$f":"BDI!$B$17","v":0.20335932421833602},21.66,1732.8,"Pesquisa Simples"]
[null,"SF-00036","Serviços de Apoio","Serviços Preliminares","Remoção de persianas","m",150,{"$f":"OFFSET(INDEX(Composições!A:M,MATCH(E40,Composições!B:B,0),13),2,0)","v":2.6399999999999997},396,{"$f":"BDI!$B$17","v":0.20335932421833602},3.18,477,"Senado Federal"]
[null,"SF-00037","Serviços de Apoio","Serviços Preliminares","Remoção de pintura ou textura","m2",5800,{"$f":"OFFSET(INDEX(Composições!A:M,MATCH(E41,Composições!B:B,0),13),2,0)","v":5.27},30566,{"$f":"BDI!$B$17","v":0.20335932421833602},6.34,36772,"Orse 7725 Adaptada"]
[null,"SF-00038","Serviços de Apoio","Serviços Preliminares","Remoção de placas de forro","m2",200,{"$f":"OFFSET(INDEX(Composições!A:M,MATCH(E42,Composições!B:B,0),13),2,0)","v":3.12},624,{"$f":"BDI!$B$17","v":0.20335932421833602},3.75,750,"Sinapi 97640 Adaptada"]
[null,"SF-00039","Serviços de Apoio","Serviços Preliminares","Remoção de quadros de elétricos ou de telecomunicações","un",30,{"$f":"OFFSET(INDEX(Composições!A:M,MATCH(E43,Composições!B:B,0),13),2,0)","v":47.47},1424.1,{"$f":"BDI!$B$17","v":0.20335932421833602},57.12,1713.6,"Senado Federal"]
[null,"SF-00040","Serviços de Apoio","Serviços Preliminares","Remoção de revestimento acústico","m2",440,{"$f":"OFFSET(INDEX(Composições!A:M,MATCH(E44,Composições!B:B,0),13),2,0)","v":2.6399999999999997},1161.5999999999999,{"$f":"BDI!$B$17","v":0.20335932421833602},3.18,1399.2,"Senado Federal"]
[null,"SF-00041","Serviços de Apoio","Serviços Preliminares","Remoção de rodapé de mármore ou granito","m",100,{"$f":"OFFSET(INDEX(Composições!A:M,MATCH(E45,Composições!B:B,0),13),2,0)","v":5.75},575,{"$f":"BDI!$B$17","v":0.20335932421833602},6.92,692,"Orse 4858 Adaptada"]
[null,"SF-00042","Serviços de Apoio","Serviços Preliminares","Remoção de rodapés de madeira","m2",10,{"$f":"OFFSET(INDEX(Composições!A:M,MATCH(E46,Composições!B:B,0),13),2,0)","v":4.83},48.3,{"$f":"BDI!$B$17","v":0.20335932421833602},5.81,58.1,"Orse 10235 Adaptada"]
[null,"SF-00043","Serviços de Apoio","Serviços Preliminares","Remoção de soleira de mármore ou granito","m",20,{"$f":"OFFSET(INDEX(Composições!A:M,MATCH(E47,Composições!B:B,0),13),2,0)","v":7.25},145,{"$f":"BDI!$B$17","v":0.20335932421833602},8.7200000000000006,174.4,"Pini 02.102.000042.SER Adaptada"]
[null,"SF-00044","Serviços de Apoio","Serviços Preliminares","Remoção de split/fancolete (equipamento unitário)","un",200,{"$f":"OFFSET(INDEX(Composições!A:M,MATCH(E48,Composições!B:B,0),13),2,0)","v":33.07},6614,{"$f":"BDI!$B$17","v":0.20335932421833602},39.799999999999997,7960,"Senado Federal"]
[null,"SF-00045","Serviços de Apoio","Serviços Preliminares","Remoção de vidro comum","m2",40,{"$f":"OFFSET(INDEX(Composições!A:M,MATCH(E49,Composições!B:B,0),13),2,0)","v":11.02},440.8,{"$f":"BDI!$B$17","v":0.20335932421833602},13.26,530.4,"Sinapi 85421"]
[null,"SF-00046","Serviços de Apoio","Serviços Preliminares","Retirada de entulhos","m3",410,{"$f":"OFFSET(INDEX(Composições!A:M,MATCH(E50,Composições!B:B,0),13),2,0)","v":13.17},5399.7,{"$f":"BDI!$B$17","v":0.20335932421833602},15.85,6498.5,"Orse 0026 Adaptada"]
[null,"SF-00047","Serviços de Apoio","Segurança do Trabalho","Absorvedor de energia","un",5,544.32000000000005,2721.6,{"$f":"BDI!$B$17","v":0.20335932421833602},655.01,3275.05,"Pesquisa Simples"]
[null,"SF-00048","Serviços de Apoio","Segurança do Trabalho","Andaime fachadeiro","m2/mês",350,3.99,1396.5,{"$f":"BDI!$B$17","v":0.20335932421833602},4.8,1680,"Sinapi 20193"]
[null,"SF-00049","Serviços de Apoio","Segurança do Trabalho","Andaime tubular (aluguel/mês)","m/mês",70,10.130000000000001,709.1,{"$f":"BDI!$B$17","v":0.20335932421833602},12.19,853.3,"Pesquisa Simples"]
[null,"SF-00050","Serviços de Apoio","Segurança do Trabalho","Cabo de aço com 8 mm de diâmetro galvanizado","m",280,5.0199999999999996,1405.6,{"$f":"BDI!$B$17","v":0.20335932421833602},6.04,1691.2,"Pesquisa Simples"]
[null,"SF-00051","Serviços de Apoio","Segurança do Trabalho","Corda de poliamida 12 mm tipo bombeiro, para trabalho em altura","m",84,4.5199999999999996,379.68,{"$f":"BDI!$B$17","v":0.20335932421833602},5.44,456.96,"Sinapi 38200"]
[null,"SF-00052","Serviços de Apoio","Segurança do Trabalho","Ensaio de ponto de ancoragem existente","un",28,30.52,854.56,{"$f":"BDI!$B$17","v":0.20335932421833602},36.729999999999997,1028.44,"Pesquisa Simples"]
["-","SF-00053","Serviços de Apoio","Segurança do Trabalho","Escadas de acesso para andaime tubular","m/mês",40,7.67,306.8,{"$f":"BDI!$B$17","v":0.20335932421833602},9.23,369.2,"Pesquisa Simples"]
[null,"SF-00054","Serviços de Apoio","Segurança do Trabalho","Esticador de cabo de aço","un",5,104.83,524.15,{"$f":"BDI!$B$17","v":0.20335932421833602},126.15,630.75,"Pesquisa Simples"]
[null,"SF-00055","Serviços de Apoio","Segurança do Trabalho","Guarda-corpo com rodapé para andaime tubular","m/mês",50,6.49,324.5,{"$f":"BDI!$B$17","v":0.20335932421833602},7.81,390.5,"Pesquisa Simples"]
[null,"SF-00056","Serviços de Apoio","Segurança do Trabalho","Indicador de tensão","un",5,808.81,4044.05,{"$f":"BDI!$B$17","v":0.20335932421833602},973.29,4866.45,"Pesquisa Simples"]
[null,"SF-00057","Serviços de Apoio","Segurança do Trabalho","Isolamento de obra com tela plástica com malha de 5mm e estrutura de madeira pontaleteada","m2",280,{"$f":"OFFSET(INDEX(Composições!A:M,MATCH(E61,Composições!B:B,0),13),2,0)","v":19.05},5334,{"$f":"BDI!$B$17","v":0.20335932421833602},22.92,6417.6,"Sinapi 85424"]
[null,"SF-00058","Serviços de Apoio","Segurança do Trabalho","Kit de curva","un",5,915.58,4577.8999999999996,{"$f":"BDI!$B$17","v":0.20335932421833602},1101.77,5508.85,"Pesquisa Simples"]
[null,"SF-00059","Serviços de Apoio","Segurança do Trabalho","Kit de linha de vida para escada de marinheiro","un",4,799.99,3199.96,{"$f":"BDI!$B$17","v":0.20335932421833602},962.68,3850.72,"Pesquisa Simples"]
[null,"SF-00060","Serviços de Apoio","Segurança do Trabalho","Kit para montagem de dois olhais","un",5,140.5,702.5,{"$f":"BDI!$B$17","v":0.20335932421833602},169.07,845.35,"Pesquisa Simples"]
[null,"SF-00061","Serviços de Apoio","Segurança do Trabalho","Manilha com travamento por porca e cupilha","un",14,39.29,550.05999999999995,{"$f":"BDI!$B$17","v":0.20335932421833602},47.28,661.92,"Pesquisa Simples"]
[null,"SF-00062","Serviços de Apoio","Segurança do Trabalho","Pilar de ancoragem","un",14,610.38,8545.32,{"$f":"BDI!$B$17","v":0.20335932421833602},734.51,10283.14,"Pesquisa Simples"]
[null,"SF-00063","Serviços de Apoio","Segurança do Trabalho","Piso metálico para andaime tubular","m2/mês",50,8.77,438.5,{"$f":"BDI!$B$17","v":0.20335932421833602},10.55,527.5,"Pesquisa Simples"]
[null,"SF-00064","Serviços de Apoio","Segurança do Trabalho","Placa de ancoragem para extremidade","un",10,296.95999999999998,2969.6,{"$f":"BDI!$B$17","v":0.20335932421833602},357.35,3573.5,"Pesquisa Simples"]
[null,"SF-00065","Serviços de Apoio","Segurança do Trabalho","Placa de ancoragem para montagem no pilar","un",10,133,1330,{"$f":"BDI!$B$17","v":0.20335932421833602},160.05000000000001,1600.5,"Pesquisa Simples"]
[null,"SF-00066","Serviços de Apoio","Segurança do Trabalho","Ponto de ancoragem","un",32,116.1,{"$f":"IF(ISNUMBER(H70),ROUND(G70*H70,2),\"-\")","v":3715.2},{"$f":"BDI!$B$17","v":0.20335932421833602},{"$f":"IF(ISNUMBER(H70),ROUND(H70*(1+J70),2),0)","v":139.71},{"$f":"ROUND(K70*G70,2)","v":4470.72},"Pesquisa Simples"]
[null,"SF-00067","Serviços de Apoio","Segurança do Trabalho","Sapatas e rodízios para andaime tubular","mês",25,21.04,526,{"$f":"BDI!$B$17","v":0.20335932421833602},25.32,633,"Pesquisa Simples"]
[null,"SF-00068","Serviços de Apoio","Segurança do Trabalho","Sistema Guarda-corpo-Rodapé (GcR) metálico","m/mês",315,9.16,2885.4,{"$f":"BDI!$B$17","v":0.20335932421833602},11.02,3471.3,"Pesquisa Simples"]
[null,"SF-00069","Serviços de Apoio","Segurança do Trabalho","Suporte intermediário","un",17,252.01,4284.17,{"$f":"BDI!$B$17","v":0.20335932421833602},303.26,5155.42,"Pesquisa Simples"]
[null,"SF-00070","Serviços de Apoio","Segurança do Trabalho","Tapume","m2",30,{"$f":"OFFSET(INDEX(Composições!A:M,MATCH(E74,Composições!B:B,0),13),2,0)","v":48.779999999999994},1463.4,{"$f":"BDI!$B$17","v":0.20335932421833602},58.7,1761,"Sinapi 74220/1"]
[null,"SF-00071","Serviços de Apoio","Segurança do Trabalho","Trole com mosquetão","un",5,645.19000000000005,3225.95,{"$f":"BDI!$B$17","v":0.20335932421833602},776.4,3882,"Pesquisa Simples"]
[null,"SF-00072","Serviços de Apoio","Segurança do Trabalho","Trole para travaqueda retrátil","un",3,1644.74,4934.22,{"$f":"BDI!$B$17","v":0.20335932421833602},1979.21,5937.63,"Pesquisa Simples"]
[null,"SF-00073","Serviços de Apoio","Limpeza","Limpeza final de obra","m2",3400,{"$f":"OFFSET(INDEX(Composições!A:M,MATCH(E77,Composições!B:B,0),13),2,0)","v":1.82},6188,{"$f":"BDI!$B$17","v":0.20335932421833602},2.19,7446,"ORSE 02450 Adaptada"]
[null,"SF-00074","Civil","Furos, Rasgos e Escariação","Abertura/fechamento rasgo em alvenaria","m",3000,{"$f":"OFFSET(INDEX(Composições!A:M,MATCH(E78,Composições!B:B,0),13),2,0)","v":13.37},40110,{"$f":"BDI!$B$17","v":0.20335932421833602},16.09,48270,"Sinapi 90447 + Sinapi 90466"]
[null,"SF-00075","Civil","Furos, Rasgos e Escariação","Furo em concreto de até 75mm de diâmetro","un",20,{"$f":"OFFSET(INDEX(Composições!A:M,MATCH(E79,Composições!B:B,0),13),2,0)","v":67.62},1352.4,{"$f":"BDI!$B$17","v":0.20335932421833602},81.37,1627.4,"Sinapi 90440"]
[null,"SF-00076","Civil","Furos, Rasgos e Escariação","Furo em concreto para diâmetros maiores que 75mm","un",20,{"$f":"OFFSET(INDEX(Composições!A:M,MATCH(E80,Composições!B:B,0),13),2,0)","v":86.360000000000014},1727.2,{"$f":"BDI!$B$17","v":0.20335932421833602},103.92,2078.4,"Sinapi 90441"]
[null,"SF-00077","Civil","Estrutural","Concreto virado em betoneira, Fck = 15 MPa","m3",10,{"$f":"OFFSET(INDEX(Composições!A:M,MATCH(E81,Composições!B:B,0),13),2,0)","v":401.51},4015.1,{"$f":"BDI!$B$17","v":0.20335932421833602},483.16,4831.6000000000004,"Sinapi 92873 + Sinapi 94963"]
[null,"SF-00078","Civil","Estrutural","Concreto virado em betoneira, fck = 25MPa","m3",10,{"$f":"OFFSET(INDEX(Composições!A:M,MATCH(E82,Composições!B:B,0),13),2,0)","v":428.38},4283.8,{"$f":"BDI!$B$17","v":0.20335932421833602},515.5,5155,"Sinapi 92873 + Sinapi 94965"]
[null,"SF-00079","Civil","Estrutural","Escoramento metálico ","m2",100,{"$f":"OFFSET(INDEX(Composições!A:M,MATCH(E83,Composições!B:B,0),13),2,0)","v":18.25},1825,{"$f":"BDI!$B$17","v":0.20335932421833602},21.96,2196,"Orse 07629 Adaptada"]
[null,"SF-00080","Civil","Estrutural","Estrutura metálica em aço ","kg",103,{"$f":"OFFSET(INDEX(Composições!A:M,MATCH(E84,Composições!B:B,0),13),2,0)","v":13.01},1340.03,{"$f":"BDI!$B$17","v":0.20335932421833602},15.66,1612.98,"SCO/RJ ET 25.05.0180 (B) Adaptada"]
[null,"SF-00081","Civil","Estrutural","Forma para estruturas de concreto ","m2",100,{"$f":"OFFSET(INDEX(Composições!A:M,MATCH(E85,Composições!B:B,0),13),2,0)","v":100.55000000000001},10055,{"$f":"BDI!$B$17","v":0.20335932421833602},121,12100,"Sinapi 92451"]
[null,"SF-00082","Civil","Estrutural","Verga/contraverga/cinta em bloco de concreto canaleta 11,5 x 19 x 39 cm","m",20,{"$f":"OFFSET(INDEX(Composições!A:M,MATCH(E86,Composições!B:B,0),13),2,0)","v":21.39},427.8,{"$f":"BDI!$B$17","v":0.20335932421833602},25.74,514.79999999999995,"Pini 06.103.000505.SER Adaptada"]
[null,"SF-00083","Civil","Impermeabilização","Impermeabilização de superfície com revestimento bicomponente semi flexível","m2",500,{"$f":"OFFSET(INDEX(Composições!A:M,MATCH(E87,Composições!B:B,0),13),2,0)","v":25.17},12585,{"$f":"BDI!$B$17","v":0.20335932421833602},30.29,15145,"Sinapi 98555"]
[null,"SF-00084","Civil","Vedações","Alvenaria de vedação","m2",100,{"$f":"OFFSET(INDEX(Composições!A:M,MATCH(E88,Composições!B:B,0),13),2,0)","v":50.33},5033,{"$f":"BDI!$B$17","v":0.20335932421833602},60.57,6057,"Sinapi 87503"]
[null,"SF-00085","Civil","Vedações","Fechamento ou shaft em gesso acartonado tipo drywall","m2",10,{"$f":"OFFSET(INDEX(Composições!A:M,MATCH(E89,Composições!B:B,0),13),2,0)","v":41.510000000000005},415.1,{"$f":"BDI!$B$17","v":0.20335932421833602},49.95,499.5,"Sinapi 96370"]
[null,"SF-00086","Civil","Vedações","Fixação (encunhamento) de Alvenaria de Vedação","m",30,{"$f":"OFFSET(INDEX(Composições!A:M,MATCH(E90,Composições!B:B,0),13),2,0)","v":15.87},476.1,{"$f":"BDI!$B$17","v":0.20335932421833602},19.100000000000001,573,"Sinapi 93202"]
[null,"SF-00087","Civil","Vedações","Parede em gesso acartonado (drywall)","m2",120,{"$f":"OFFSET(INDEX(Composições!A:M,MATCH(E91,Composições!B:B,0),13),2,0)","v":65.37},7844.4,{"$f":"BDI!$B$17","v":0.20335932421833602},78.66,9439.2000000000007,"Sinapi 96358"]
[null,"SF-00088","Civil","Vedações","Reparos superficiais em painéis de gesso acartonado","m2",20,{"$f":"OFFSET(INDEX(Composições!A:M,MATCH(E92,Composições!B:B,0),13),2,0)","v":4.59},91.8,{"$f":"BDI!$B$17","v":0.20335932421833602},5.52,110.4,"Sinapi 96370 Adaptada"]
[null,"SF-00089","Civil","Vedações","Sóculo h=10 cm","m2",20,{"$f":"OFFSET(INDEX(Composições!A:M,MATCH(E93,Composições!B:B,0),13),2,0)","v":51.970000000000006},1039.4000000000001,{"$f":"BDI!$B$17","v":0.20335932421833602},62.54,1250.8,"Sinapi 87471 + Sinapi 87545"]
[null,"SF-00090","Civil","Revestimentos","Chapisco colante industrializado em vigas e pilares","m2",50,{"$f":"OFFSET(INDEX(Composições!A:M,MATCH(E94,Composições!B:B,0),13),2,0)","v":10.74},537,{"$f":"BDI!$B$17","v":0.20335932421833602},12.92,646,"Sinapi 87872"]
[null,"SF-00091","Civil","Revestimentos","Chapisco com argamassa traço 1:3 ","m2",200,{"$f":"OFFSET(INDEX(Composições!A:M,MATCH(E95,Composições!B:B,0),13),2,0)","v":2.9},580,{"$f":"BDI!$B$17","v":0.20335932421833602},3.49,698,"Sinapi 87878"]
[null,"SF-00092","Civil","Revestimentos","Gesso cola","m2",440,{"$f":"OFFSET(INDEX(Composições!A:M,MATCH(E96,Composições!B:B,0),13),2,0)","v":11.23},4941.2,{"$f":"BDI!$B$17","v":0.20335932421833602},13.51,5944.4,"Sinapi 87419 Adaptada"]
[null,"SF-00093","Civil","Revestimentos","Reboco com argamassa industrializada e=2,0 cm","m2",200,{"$f":"OFFSET(INDEX(Composições!A:M,MATCH(E97,Composições!B:B,0),13),2,0)","v":25.71},5142,{"$f":"BDI!$B$17","v":0.20335932421833602},30.94,6188,"Sinapi 87398 + 87531 Adaptada"]
[null,"SF-00094","Civil","Revestimentos","Regularização com argamassa industrializada e=0,5 cm","m2",200,{"$f":"OFFSET(INDEX(Composições!A:M,MATCH(E98,Composições!B:B,0),13),2,0)","v":7.92},1584,{"$f":"BDI!$B$17","v":0.20335932421833602},9.5299999999999994,1906,"Sinapi 87398 + 87549 Adaptada"]
[null,"SF-00095","Civil","Revestimentos","Tratamento de trincas superficiais ","m",100,{"$f":"OFFSET(INDEX(Composições!A:M,MATCH(E99,Composições!B:B,0),13),2,0)","v":14.440000000000001},1444,{"$f":"BDI!$B$17","v":0.20335932421833602},17.38,1738,"Pini 06.103.000460.SER Adaptada"]
[null,"SF-00096","Civil","Pinturas","Aplicação de fundo selador base água","m2",5400,{"$f":"OFFSET(INDEX(Composições!A:M,MATCH(E100,Composições!B:B,0),13),2,0)","v":3.3},17820,{"$f":"BDI!$B$17","v":0.20335932421833602},3.97,21438,"Sinapi 88414"]
[null,"SF-00097","Civil","Pinturas","Fundo anticorrosivo e de aderência (base água)","m2",400,{"$f":"OFFSET(INDEX(Composições!A:M,MATCH(E101,Composições!B:B,0),13),2,0)","v":16.899999999999999},6760,{"$f":"BDI!$B$17","v":0.20335932421833602},20.34,8136,"Sinapi 74064/1 Adaptada"]
[null,"SF-00098","Civil","Pinturas","Massa acrílica","m2",150,{"$f":"OFFSET(INDEX(Composições!A:M,MATCH(E102,Composições!B:B,0),13),2,0)","v":13.58},2037,{"$f":"BDI!$B$17","v":0.20335932421833602},16.34,2451,"Sinapi 96132"]
[null,"SF-00099","Civil","Pinturas","Massa corrida","m2",1000,{"$f":"OFFSET(INDEX(Composições!A:M,MATCH(E103,Composições!B:B,0),13),2,0)","v":10.379999999999999},10380,{"$f":"BDI!$B$17","v":0.20335932421833602},12.49,12490,"Sinapi 88497"]
[null,"SF-00100","Civil","Pinturas","Pintura com tinta látex acrílica Premium (paredes)","m2",6000,{"$f":"OFFSET(INDEX(Composições!A:M,MATCH(E104,Composições!B:B,0),13),2,0)","v":10.17},61020,{"$f":"BDI!$B$17","v":0.20335932421833602},12.24,73440,"Sinapi 88489"]
[null,"SF-00101","Civil","Pinturas","Pintura em verniz sintético ","m2",300,{"$f":"OFFSET(INDEX(Composições!A:M,MATCH(E105,Composições!B:B,0),13),2,0)","v":13.93},4179,{"$f":"BDI!$B$17","v":0.20335932421833602},16.760000000000002,5028,"Sinapi 6082 Adaptada"]
[null,"SF-00102","Civil","Pinturas","Pintura esmalte acetinado (metais e madeiras)","m2",650,{"$f":"OFFSET(INDEX(Composições!A:M,MATCH(E106,Composições!B:B,0),13),2,0)","v":21.06},13689,{"$f":"BDI!$B$17","v":0.20335932421833602},25.34,16471,"Sinapi 73924/2 Adaptada"]
[null,"SF-00103","Civil","Pinturas","Pintura tinta látex acrílica standard (tetos)","m2",3000,{"$f":"OFFSET(INDEX(Composições!A:M,MATCH(E107,Composições!B:B,0),13),2,0)","v":11.45},34350,{"$f":"BDI!$B$17","v":0.20335932421833602},13.78,41340,"Sinapi 88488"]
[null,"SF-00104","Civil","Pisos, Revestimentos e Pavimentação","Cerâmica para revestimento de superfícies internas ou externas – Linha Administrativa","m2",200,{"$f":"OFFSET(INDEX(Composições!A:M,MATCH(E108,Composições!B:B,0),13),2,0)","v":67.27},13454,{"$f":"BDI!$B$17","v":0.20335932421833602},80.95,16190,"Sinapi 87273 Adaptada"]
[null,"SF-00105","Civil","Pisos, Revestimentos e Pavimentação","Contrapiso em argamassa","m2",60,{"$f":"OFFSET(INDEX(Composições!A:M,MATCH(E109,Composições!B:B,0),13),2,0)","v":35.380000000000003},2122.8000000000002,{"$f":"BDI!$B$17","v":0.20335932421833602},42.57,2554.1999999999998,"Sinapi 87642"]
[null,"SF-00106","Civil","Pisos, Revestimentos e Pavimentação","Contrapiso em argamassa (e=2cm) ou Regularização de contrapiso existente ","m2",550,{"$f":"OFFSET(INDEX(Composições!A:M,MATCH(E110,Composições!B:B,0),13),2,0)","v":24.139999999999997},13277,{"$f":"BDI!$B$17","v":0.20335932421833602},29.05,15977.5,"Sinapi 87622"]
[null,"SF-00107","Civil","Pisos, Revestimentos e Pavimentação","Granito cinza andorinha para piso","m2",1050,{"$f":"OFFSET(INDEX(Composições!A:M,MATCH(E111,Composições!B:B,0),13),2,0)","v":157.13999999999999},164997,{"$f":"BDI!$B$17","v":0.20335932421833602},189.1,198555,"Sinapi 98671 Adaptada"]
[null,"SF-00108","Civil","Pisos, Revestimentos e Pavimentação","Granito Cinza Andorinha para rodapé","m2",270,{"$f":"OFFSET(INDEX(Composições!A:M,MATCH(E112,Composições!B:B,0),13),2,0)","v":253.73999999999998},68509.8,{"$f":"BDI!$B$17","v":0.20335932421833602},305.33999999999997,82441.8,"Sinapi 98671 e Sinapi 98685 Adaptadas"]
[null,"SF-00109","Civil","Pisos, Revestimentos e Pavimentação","Granito Cinza Andorinha para soleira e peitoril","m2",25,{"$f":"OFFSET(INDEX(Composições!A:M,MATCH(E113,Composições!B:B,0),13),2,0)","v":212.92},5323,{"$f":"BDI!$B$17","v":0.20335932421833602},256.22000000000003,6405.5,"Sinapi 98671 e Sinapi 98689 Adaptadas"]
[null,"SF-00110","Civil","Pisos, Revestimentos e Pavimentação","Granito Preto São Gabriel para piso","m2",30,{"$f":"OFFSET(INDEX(Composições!A:M,MATCH(E114,Composições!B:B,0),13),2,0)","v":220.94},6628.2,{"$f":"BDI!$B$17","v":0.20335932421833602},265.87,7976.1,"Sinapi 98671 Adaptada"]
[null,"SF-00111","Civil","Pisos, Revestimentos e Pavimentação","Granito Preto São Gabriel para rodapé","m2",3,{"$f":"OFFSET(INDEX(Composições!A:M,MATCH(E115,Composições!B:B,0),13),2,0)","v":402.31000000000006},1206.93,{"$f":"BDI!$B$17","v":0.20335932421833602},484.12,1452.36,"Sinapi 98671 e Sinapi 98685 Adaptadas"]
[null,"SF-00112","Civil","Pisos, Revestimentos e Pavimentação","Granito Preto São Gabriel para soleira e peitoril","m2",2,{"$f":"OFFSET(INDEX(Composições!A:M,MATCH(E116,Composições!B:B,0),13),2,0)","v":287.92},575.84,{"$f":"BDI!$B$17","v":0.20335932421833602},346.47,692.94,"Sinapi 98671 e Sinapi 98689 Adaptadas"]
[null,"SF-00113","Civil","Pisos, Revestimentos e Pavimentação","Instalação de rodapé de madeira reaproveitado","m",70,{"$f":"OFFSET(INDEX(Composições!A:M,MATCH(E117,Composições!B:B,0),13),2,0)","v":5.83},408.1,{"$f":"BDI!$B$17","v":0.20335932421833602},7.02,491.4,"Sinapi 84162 Adaptada"]
[null,"SF-00114","Civil","Pisos, Revestimentos e Pavimentação","Mármore Bege Bahia para piso e parede","m2",10,{"$f":"OFFSET(INDEX(Composições!A:M,MATCH(E118,Composições!B:B,0),13),2,0)","v":217.97},2179.6999999999998,{"$f":"BDI!$B$17","v":0.20335932421833602},262.3,2623,"Sinapi 98671 Adaptada"]
[null,"SF-00115","Civil","Pisos, Revestimentos e Pavimentação","Mármore Branco Especial para piso e parede","m2",40,{"$f":"OFFSET(INDEX(Composições!A:M,MATCH(E119,Composições!B:B,0),13),2,0)","v":371.74},14869.6,{"$f":"BDI!$B$17","v":0.20335932421833602},447.34,17893.599999999999,"Sinapi 98672 Adaptada"]
[null,"SF-00116","Civil","Pisos, Revestimentos e Pavimentação","Rodapé de madeira","m",70,{"$f":"OFFSET(INDEX(Composições!A:M,MATCH(E120,Composições!B:B,0),13),2,0)","v":15.09},1056.3,{"$f":"BDI!$B$17","v":0.20335932421833602},18.16,1271.2,"Sinapi 84162"]
[null,"SF-00117","Civil","Marmores e Granitos","Acabamento abaulado em placas de granito ou mármore reaproveitadas","m",20,20,400,{"$f":"BDI!$B$17","v":0.20335932421833602},24.07,481.4,"Pesquisa Simples"]
[null,"SF-00118","Civil","Marmores e Granitos","Acabamento em meia esquadria em placas de granito ou mármore reaproveitadas","m",20,17,340,{"$f":"BDI!$B$17","v":0.20335932421833602},20.46,409.2,"Pesquisa Simples"]
[null,"SF-00119","Civil","Marmores e Granitos","Acabamento reto em placas de granito ou mármore reaproveitadas","m",20,10,200,{"$f":"BDI!$B$17","v":0.20335932421833602},12.03,240.6,"Pesquisa Simples"]
[null,"SF-00120","Civil","Marmores e Granitos","Corte de peça de granito ou mármore reaproveitada","m",20,15,300,{"$f":"BDI!$B$17","v":0.20335932421833602},18.05,361,"Pesquisa Simples"]
[null,"SF-00121","Civil","Marmores e Granitos","Corte em placas de granito ou mármore reaproveitadas, para instalação de cubas","un",20,56.86,1137.2,{"$f":"BDI!$B$17","v":0.20335932421833602},68.42,1368.4,"Sinapi 38605"]
[null,"SF-00122","Civil","Marmores e Granitos","Furo em placas de granito ou mármore reaproveitadas, para instalação de torneira ou misturador","un",20,8.52,170.4,{"$f":"BDI!$B$17","v":0.20335932421833602},10.25,205,"Sinapi 38633"]
[null,"SF-00123","Civil","Marmores e Granitos","Granito Cinza Andorinha 20mm para rodabancada","m2",30,{"$f":"OFFSET(INDEX(Composições!A:M,MATCH(E127,Composições!B:B,0),13),2,0)","v":165.33999999999997},4960.2,{"$f":"BDI!$B$17","v":0.20335932421833602},198.96,5968.8,"Sinapi 98671 e Sinapi 98685 Adaptadas"]
[null,"SF-00124","Civil","Marmores e Granitos","Granito Cinza Andorinha 25mm para bancadas","m2",50,{"$f":"OFFSET(INDEX(Composições!A:M,MATCH(E128,Composições!B:B,0),13),2,0)","v":209.44},10472,{"$f":"BDI!$B$17","v":0.20335932421833602},252.03,12601.5,"Orse 10759 Adaptada"]
[null,"SF-00125","Civil","Marmores e Granitos","Granito Cinza Andorinha 30mm para divisória","m2",100,{"$f":"OFFSET(INDEX(Composições!A:M,MATCH(E129,Composições!B:B,0),13),2,0)","v":299.73},29973,{"$f":"BDI!$B$17","v":0.20335932421833602},360.68,36068,"Sinapi 79627"]
[null,"SF-00126","Civil","Marmores e Granitos","Granito Preto São Gabriel 25mm para bancadas","m2",30,{"$f":"OFFSET(INDEX(Composições!A:M,MATCH(E130,Composições!B:B,0),13),2,0)","v":359.79},10793.7,{"$f":"BDI!$B$17","v":0.20335932421833602},432.96,12988.8,"Orse 10759 Adaptada"]
[null,"SF-00127","Civil","Marmores e Granitos","Granito Preto São Gabriel 20mm para rodabancada","m2",8,{"$f":"OFFSET(INDEX(Composições!A:M,MATCH(E131,Composições!B:B,0),13),2,0)","v":253.73999999999998},2029.92,{"$f":"BDI!$B$17","v":0.20335932421833602},305.33999999999997,2442.7199999999998,"Sinapi 98671 e Sinapi 98685 Adaptadas"]
[null,"SF-00128","Civil","Marmores e Granitos","Instalação de bancada de granito ou mármore reaproveitada","m2",30,{"$f":"OFFSET(INDEX(Composições!A:M,MATCH(E132,Composições!B:B,0),13),2,0)","v":30.53},915.9,{"$f":"BDI!$B$17","v":0.20335932421833602},36.74,1102.2,"Orse 10759 Adaptada"]
[null,"SF-00129","Civil","Marmores e Granitos","Instalação de rodapé reaproveitado, de mármore ou granito ","m2",2,{"$f":"OFFSET(INDEX(Composições!A:M,MATCH(E133,Composições!B:B,0),13),2,0)","v":35.340000000000003},70.680000000000007,{"$f":"BDI!$B$17","v":0.20335932421833602},42.53,85.06,"Sinapi 98671 Adaptada"]
[null,"SF-00130","Civil","Marmores e Granitos","Instalação de soleira ou peitoril, de mármore ou granito, reaproveitados","m2",10,{"$f":"OFFSET(INDEX(Composições!A:M,MATCH(E134,Composições!B:B,0),13),2,0)","v":35.050000000000004},{"$f":"IF(ISNUMBER(H134),ROUND(G134*H134,2),\"-\")","v":350.5},{"$f":"BDI!$B$17","v":0.20335932421833602},{"$f":"IF(ISNUMBER(H134),ROUND(H134*(1+J134),2),0)","v":42.18},{"$f":"ROUND(K134*G134,2)","v":421.8},"Sinapi 98689 Adaptada"]
[null,"SF-00131","Civil","Marmores e Granitos","Mármore Branco Especial 20mm para rodabancada","m2",1,{"$f":"OFFSET(INDEX(Composições!A:M,MATCH(E135,Composições!B:B,0),13),2,0)","v":342.14000000000004},342.14,{"$f":"BDI!$B$17","v":0.20335932421833602},411.72,411.72,"Sinapi 98685 Adaptada"]
[null,"SF-00132","Civil","Divisórias","Divisória em gesso acartonado revestido - Painel liso cego - Ed. Anexo I","m2",500,357.2,178600,{"$f":"BDI!$B$17","v":0.20335932421833602},429.84,214920,"Pesquisa Simples"]
[null,"SF-00133","Civil","Divisórias","Divisória em gesso acartonado revestido - Painel liso, painel de vidro e bandeira – ed. Anexo I","m2",500,726.38,363190,{"$f":"BDI!$B$17","v":0.20335932421833602},874.1,437050,"Pesquisa Simples"]
[null,"SF-00134","Civil","Divisórias","Divisória MDF com painel liso cego e bandeira","m2",1000,535,535000,{"$f":"BDI!$B$17","v":0.20335932421833602},643.79999999999995,643800,"Pesquisa Simples"]
[null,"SF-00135","Civil","Divisórias","Divisória MDF com painel liso, painel de vidro e bandeira","m2",1000,705,705000,{"$f":"BDI!$B$17","v":0.20335932421833602},848.37,848370,"Pesquisa Simples"]
[null,"SF-00136","Civil","Divisórias","Divisória MDF com painel paginado cego e bandeira - Interlegis","m2",200,750,150000,{"$f":"BDI!$B$17","v":0.20335932421833602},902.52,180504,"Pesquisa Simples"]
[null,"SF-00137","Civil","Divisórias","Divisória MDF com painel paginado, painel de vidro e bandeira - Interlegis","m2",200,1036,207200,{"$f":"BDI!$B$17","v":0.20335932421833602},1246.68,249336,"Pesquisa Simples"]
[null,"SF-00138","Civil","Divisórias","Instalação de divisória reaproveitada","m2",700,{"$f":"OFFSET(INDEX(Composições!A:M,MATCH(E142,Composições!B:B,0),13),2,0)","v":12.29},8603,{"$f":"BDI!$B$17","v":0.20335932421833602},14.79,10353,"Pini 06.102.000005.SER Adaptada"]
[null,"SF-00139","Civil","Forros","Alçapão em forro de gesso acartonado","m2",100,{"$f":"OFFSET(INDEX(Composições!A:M,MATCH(E143,Composições!B:B,0),13),2,0)","v":98.17},9817,{"$f":"BDI!$B$17","v":0.20335932421833602},118.13,11813,"Sinapi 74073/1 Adaptada"]
[null,"SF-00140","Civil","Forros","Forro de PVC em réguas de 100 x 6000mm","m2",50,{"$f":"OFFSET(INDEX(Composições!A:M,MATCH(E144,Composições!B:B,0),13),2,0)","v":35.700000000000003},1785,{"$f":"BDI!$B$17","v":0.20335932421833602},42.96,2148,"Sinapi 96486 Adaptada"]
[null,"SF-00141","Civil","Forros","Forro de PVC em réguas de 100 x 6000mm, sem estrutura","m2",100,{"$f":"OFFSET(INDEX(Composições!A:M,MATCH(E145,Composições!B:B,0),13),2,0)","v":17.36},1736,{"$f":"BDI!$B$17","v":0.20335932421833602},20.89,2089,"Sinapi 96486 Adaptada"]
[null,"SF-00142","Civil","Forros","Forro de PVC modular em placas","m2",20,{"$f":"OFFSET(INDEX(Composições!A:M,MATCH(E146,Composições!B:B,0),13),2,0)","v":69.3},1386,{"$f":"BDI!$B$17","v":0.20335932421833602},83.39,1667.8,"Orse 05045"]
[null,"SF-00143","Civil","Forros","Forro em chapas metálicas","m2",500,{"$f":"OFFSET(INDEX(Composições!A:M,MATCH(E147,Composições!B:B,0),13),2,0)","v":140.47},70235,{"$f":"BDI!$B$17","v":0.20335932421833602},169.04,84520,"Pini 21.104.000040.SER Adaptada"]
[null,"SF-00144","Civil","Forros","Forro em gesso acartonado monolítico","m2",1000,{"$f":"OFFSET(INDEX(Composições!A:M,MATCH(E148,Composições!B:B,0),13),2,0)","v":47.710000000000008},47710,{"$f":"BDI!$B$17","v":0.20335932421833602},57.41,57410,"Sinapi 96114"]
[null,"SF-00145","Civil","Forros","Forro em gesso acartonado monolítico, sem estrutura","m2",2300,{"$f":"OFFSET(INDEX(Composições!A:M,MATCH(E149,Composições!B:B,0),13),2,0)","v":34.97},80431,{"$f":"BDI!$B$17","v":0.20335932421833602},42.08,96784,"Sinapi 96114 Adaptada"]
[null,"SF-00146","Civil","Forros","Forro mineral modulado","m2",300,{"$f":"OFFSET(INDEX(Composições!A:M,MATCH(E150,Composições!B:B,0),13),2,0)","v":80.040000000000006},24012,{"$f":"BDI!$B$17","v":0.20335932421833602},96.32,28896,"Sinapi 39513"]
[null,"SF-00147","Civil","Forros","Forro mineral modulado, sem estrutura","m2",100,{"$f":"OFFSET(INDEX(Composições!A:M,MATCH(E151,Composições!B:B,0),13),2,0)","v":47.29},4729,{"$f":"BDI!$B$17","v":0.20335932421833602},56.91,5691,"Pini 21.101.000010.SER Adaptada"]
[null,"SF-00148","Civil","Forros","Instalação de forro de PVC reaproveitado","m2",100,{"$f":"OFFSET(INDEX(Composições!A:M,MATCH(E152,Composições!B:B,0),13),2,0)","v":9.370000000000001},937,{"$f":"BDI!$B$17","v":0.20335932421833602},11.28,1128,"Sinapi 72201"]
[null,"SF-00149","Civil","Forros","Instalação de forro mineral reaproveitado","m2",100,{"$f":"OFFSET(INDEX(Composições!A:M,MATCH(E153,Composições!B:B,0),13),2,0)","v":36.11},3611,{"$f":"BDI!$B$17","v":0.20335932421833602},43.45,4345,"Pini 21.101.000010.SER Adaptada"]
[null,"SF-00150","Civil","Forros","Tabica metálica em forro de gesso acartonado","m",3300,{"$f":"OFFSET(INDEX(Composições!A:M,MATCH(E154,Composições!B:B,0),13),2,0)","v":7.18},23694,{"$f":"BDI!$B$17","v":0.20335932421833602},8.64,28512,"Sinapi 96121 adaptada"]
[null,"SF-00151","Civil","Carpete","Instalação de revestimento de piso têxtil (carpete) reaproveitado","m2",400,{"$f":"OFFSET(INDEX(Composições!A:M,MATCH(E155,Composições!B:B,0),13),2,0)","v":5.13},2052,{"$f":"BDI!$B$17","v":0.20335932421833602},6.17,2468,"Seinfra C1914 Adaptada"]
[null,"SF-00152","Civil","Vidro Comum","Baguetes metálicos","m",400,{"$f":"OFFSET(INDEX(Composições!A:M,MATCH(E156,Composições!B:B,0),13),2,0)","v":11.370000000000001},4548,{"$f":"BDI!$B$17","v":0.20335932421833602},13.68,5472,"Senado Federal"]
[null,"SF-00153","Civil","Vidro Comum","Cordão de massa de vidraceiro","m",400,{"$f":"OFFSET(INDEX(Composições!A:M,MATCH(E157,Composições!B:B,0),13),2,0)","v":11.13},4452,{"$f":"BDI!$B$17","v":0.20335932421833602},13.39,5356,"Sedop 270629 Adaptada"]
[null,"SF-00154","Civil","Vidro Comum","Espelho cristal, e=5 mm","m2",130,{"$f":"OFFSET(INDEX(Composições!A:M,MATCH(E158,Composições!B:B,0),13),2,0)","v":347.99999999999994},45240,{"$f":"BDI!$B$17","v":0.20335932421833602},418.77,54440.1,"Sinapi 85005 Adaptada"]
[null,"SF-00155","Civil","Vidro Comum","Instalação de vidro reaproveitado","m2",20,{"$f":"OFFSET(INDEX(Composições!A:M,MATCH(E159,Composições!B:B,0),13),2,0)","v":20.78},415.6,{"$f":"BDI!$B$17","v":0.20335932421833602},25.01,500.2,"Sinapi 72117 Adaptada"]
[null,"SF-00156","Civil","Vidro Comum","Substituição da calafetação com selante","m",400,{"$f":"OFFSET(INDEX(Composições!A:M,MATCH(E160,Composições!B:B,0),13),2,0)","v":12.870000000000001},5148,{"$f":"BDI!$B$17","v":0.20335932421833602},15.49,6196,"Senado Federal"]
[null,"SF-00157","Civil","Vidro Comum","Vidro liso comum transparente 4mm","m2",20,{"$f":"OFFSET(INDEX(Composições!A:M,MATCH(E161,Composições!B:B,0),13),2,0)","v":92.769999999999982},1855.4,{"$f":"BDI!$B$17","v":0.20335932421833602},111.64,2232.8000000000002,"Sinapi 72117"]
[null,"SF-00158","Civil","Vidro Comum","Vidro liso comum transparente 6mm","m2",60,{"$f":"OFFSET(INDEX(Composições!A:M,MATCH(E162,Composições!B:B,0),13),2,0)","v":130.54000000000002},7832.4,{"$f":"BDI!$B$17","v":0.20335932421833602},157.09,9425.4,"Sinapi 84959"]
[null,"SF-00159","Civil","Vidro Temperado","Instalação de painéis de vidro temperado reaproveitados","m2",100,{"$f":"OFFSET(INDEX(Composições!A:M,MATCH(E163,Composições!B:B,0),13),2,0)","v":32.909999999999997},3291,{"$f":"BDI!$B$17","v":0.20335932421833602},39.6,3960,"Orse 05041 Adaptada"]
[null,"SF-00160","Civil","Vidro Temperado","Mola hidráulica de piso","un",25,{"$f":"OFFSET(INDEX(Composições!A:M,MATCH(E164,Composições!B:B,0),13),2,0)","v":763.47},19086.75,{"$f":"BDI!$B$17","v":0.20335932421833602},918.73,22968.25,"Sinapi 84886 Adaptada"]
[null,"SF-00161","Civil","Persianas","Instalação de persianas reaproveitadas","m",1200,{"$f":"OFFSET(INDEX(Composições!A:M,MATCH(E165,Composições!B:B,0),13),2,0)","v":5.27},6324,{"$f":"BDI!$B$17","v":0.20335932421833602},6.34,7608,"Senado Federal"]
[null,"SF-00162","Civil","Persianas","Persiana vertical em alumínio curvado de 90 m, cor verde claro","m2",600,225.94,135564,{"$f":"BDI!$B$17","v":0.20335932421833602},271.89,163134,"Pesquisa Simples"]
[null,"SF-00163","Civil","Persianas","Persiana vertical em tecido Juta Resinado sem blecaute de 90mm, cor bege","m2",300,102,30600,{"$f":"BDI!$B$17","v":0.20335932421833602},122.74,36822,"Pesquisa Simples"]
[null,"SF-00164","Civil","Persianas","Persiana vertical em tecido sintético sem blecaute de 90mm, cores verde escuro ou branca","m2",100,74,7400,{"$f":"BDI!$B$17","v":0.20335932421833602},89.05,8905,"Pesquisa Simples"]
[null,"SF-00165","Civil","Película","Película jateada","m2",80,76.819999999999993,6145.6,{"$f":"BDI!$B$17","v":0.20335932421833602},92.44,7395.2,"Pesquisa Simples"]
[null,"SF-00166","Hidrossanitário","Tubos","Tubo de Ligação Bacia Ajustável Completo","un",15,{"$f":"OFFSET(INDEX(Composições!A:M,MATCH(E170,Composições!B:B,0),13),2,0)","v":61.96},929.4,{"$f":"BDI!$B$17","v":0.20335932421833602},74.56,1118.4000000000001,"Orse 03707 Adaptada"]
[null,"SF-00167","Hidrossanitário","Tubos","Tubo PVC esgoto ou aguas pluviais predial DN 100mm","m",215,{"$f":"OFFSET(INDEX(Composições!A:M,MATCH(E171,Composições!B:B,0),13),2,0)","v":33.200000000000003},7138,{"$f":"BDI!$B$17","v":0.20335932421833602},39.950000000000003,8589.25,"Sinapi 89512"]
[null,"SF-00168","Hidrossanitário","Tubos","Tubo PVC esgoto ou aguas pluviais predial DN 40mm","m",80,{"$f":"OFFSET(INDEX(Composições!A:M,MATCH(E172,Composições!B:B,0),13),2,0)","v":10.25},820,{"$f":"BDI!$B$17","v":0.20335932421833602},12.33,986.4,"Sinapi 89508"]
[null,"SF-00169","Hidrossanitário","Tubos","Tubo PVC esgoto ou aguas pluviais predial DN 50mm","m",80,{"$f":"OFFSET(INDEX(Composições!A:M,MATCH(E173,Composições!B:B,0),13),2,0)","v":14.75},1180,{"$f":"BDI!$B$17","v":0.20335932421833602},17.75,1420,"Sinapi 89509"]
[null,"SF-00170","Hidrossanitário","Tubos","Tubo PVC esgoto ou aguas pluviais predial DN 75mm","m",100,{"$f":"OFFSET(INDEX(Composições!A:M,MATCH(E174,Composições!B:B,0),13),2,0)","v":22.24},2224,{"$f":"BDI!$B$17","v":0.20335932421833602},26.76,2676,"Sinapi 89511"]
[null,"SF-00171","Hidrossanitário","Tubos","Tubo PVC soldavel agua fria DN 25mm","m",200,{"$f":"OFFSET(INDEX(Composições!A:M,MATCH(E175,Composições!B:B,0),13),2,0)","v":2.42},484,{"$f":"BDI!$B$17","v":0.20335932421833602},2.91,582,"Sinapi 89446"]
[null,"SF-00172","Hidrossanitário","Tubos","Tubo PVC soldavel agua fria DN 32mm","m",100,{"$f":"OFFSET(INDEX(Composições!A:M,MATCH(E176,Composições!B:B,0),13),2,0)","v":4.7200000000000006},472,{"$f":"BDI!$B$17","v":0.20335932421833602},5.68,568,"Sinapi 89447"]
[null,"SF-00173","Hidrossanitário","Tubos","Tubo PVC soldavel agua fria DN 40mm","m",100,{"$f":"OFFSET(INDEX(Composições!A:M,MATCH(E177,Composições!B:B,0),13),2,0)","v":6.72},672,{"$f":"BDI!$B$17","v":0.20335932421833602},8.09,809,"Sinapi 89448"]
[null,"SF-00174","Hidrossanitário","Tubos","Tubo PVC soldavel agua fria DN 50mm","m",100,{"$f":"OFFSET(INDEX(Composições!A:M,MATCH(E178,Composições!B:B,0),13),2,0)","v":8.32},832,{"$f":"BDI!$B$17","v":0.20335932421833602},10.01,1001,"Sinapi 89449"]
[null,"SF-00175","Hidrossanitário","Registros e Válvulas","Base registro gaveta 3/4\"","un",80,{"$f":"OFFSET(INDEX(Composições!A:M,MATCH(E179,Composições!B:B,0),13),2,0)","v":44.17},3533.6,{"$f":"BDI!$B$17","v":0.20335932421833602},53.15,4252,"Sinapi 89987 Adaptada"]
[null,"SF-00176","Hidrossanitário","Ralos e caixas","Caixa sifonada de PVC DN 150mm","un",60,{"$f":"OFFSET(INDEX(Composições!A:M,MATCH(E180,Composições!B:B,0),13),2,0)","v":52.320000000000007},3139.2,{"$f":"BDI!$B$17","v":0.20335932421833602},62.96,3777.6,"Sinapi 89708"]
[null,"SF-00177","Hidrossanitário","Ralos e caixas","Caixa sifonada de PVC DN 250mm","un",60,{"$f":"OFFSET(INDEX(Composições!A:M,MATCH(E181,Composições!B:B,0),13),2,0)","v":91.179999999999993},5470.8,{"$f":"BDI!$B$17","v":0.20335932421833602},109.72,6583.2,"Sinapi 89708 Adaptada"]
[null,"SF-00178","Hidrossanitário","Ralos e caixas","Grelha quadrada para ralo 10x10cm","un",60,{"$f":"OFFSET(INDEX(Composições!A:M,MATCH(E182,Composições!B:B,0),13),2,0)","v":39.36},2361.6,{"$f":"BDI!$B$17","v":0.20335932421833602},47.36,2841.6,"Orse 09419 Adaptada"]
[null,"SF-00179","Hidrossanitário","Ralos e caixas","Grelha quadrada para ralo 15x15cm","un",60,{"$f":"OFFSET(INDEX(Composições!A:M,MATCH(E183,Composições!B:B,0),13),2,0)","v":65.17},3910.2,{"$f":"BDI!$B$17","v":0.20335932421833602},78.42,4705.2,"Orse 09419 Adaptada"]
[null,"SF-00180","Hidrossanitário","Ralos e caixas","Ralo seco PVC DN 100x40mm","un",60,{"$f":"OFFSET(INDEX(Composições!A:M,MATCH(E184,Composições!B:B,0),13),2,0)","v":8.61},516.6,{"$f":"BDI!$B$17","v":0.20335932421833602},10.36,621.6,"Sinapi 89710"]
[null,"SF-00181","Hidrossanitário","Louças","Assento para bacia convencional – Linha Administrativa","un",60,{"$f":"OFFSET(INDEX(Composições!A:M,MATCH(E185,Composições!B:B,0),13),2,0)","v":21.959999999999997},1317.6,{"$f":"BDI!$B$17","v":0.20335932421833602},26.43,1585.8,"Orse 02056 Adaptada"]
[null,"SF-00182","Hidrossanitário","Louças","Bacia convencional – Linha Administrativa","un",60,{"$f":"OFFSET(INDEX(Composições!A:M,MATCH(E186,Composições!B:B,0),13),2,0)","v":211.54000000000002},12692.4,{"$f":"BDI!$B$17","v":0.20335932421833602},254.56,15273.6,"Sinapi 95469 Adaptada"]
[null,"SF-00183","Hidrossanitário","Louças","Bacia convencional com saída horizontal","un",2,{"$f":"OFFSET(INDEX(Composições!A:M,MATCH(E187,Composições!B:B,0),13),2,0)","v":226.47000000000003},452.94,{"$f":"BDI!$B$17","v":0.20335932421833602},272.52,545.04,"Sinapi 95469 Adaptada"]
[null,"SF-00184","Hidrossanitário","Louças","Cuba oval de embutir","un",60,{"$f":"OFFSET(INDEX(Composições!A:M,MATCH(E188,Composições!B:B,0),13),2,0)","v":87.43},5245.8,{"$f":"BDI!$B$17","v":0.20335932421833602},105.21,6312.6,"Sinapi 86901 Adaptada"]
[null,"SF-00185","Hidrossanitário","Louças","Cuba retangular em aço inox – Linha Administrativa","un",20,{"$f":"OFFSET(INDEX(Composições!A:M,MATCH(E189,Composições!B:B,0),13),2,0)","v":139.32999999999998},2786.6,{"$f":"BDI!$B$17","v":0.20335932421833602},167.66,3353.2,"Sinapi 86900"]
[null,"SF-00186","Hidrossanitário","Louças","Cuba semiencaixe quadrada com mesa","un",10,{"$f":"OFFSET(INDEX(Composições!A:M,MATCH(E190,Composições!B:B,0),13),2,0)","v":537.7299999999999},5377.3,{"$f":"BDI!$B$17","v":0.20335932421833602},647.08000000000004,6470.8,"Sinapi 86901 Adaptada"]
[null,"SF-00187","Hidrossanitário","Louças","Instalação de lavatório reaproveitado","un",60,{"$f":"OFFSET(INDEX(Composições!A:M,MATCH(E191,Composições!B:B,0),13),2,0)","v":29.2},1752,{"$f":"BDI!$B$17","v":0.20335932421833602},35.14,2108.4,"Sinapi 86904 Adaptada"]
[null,"SF-00188","Hidrossanitário","Louças","Instalação de mictório reaproveitado","un",60,{"$f":"OFFSET(INDEX(Composições!A:M,MATCH(E192,Composições!B:B,0),13),2,0)","v":92.22},5533.2,{"$f":"BDI!$B$17","v":0.20335932421833602},110.97,6658.2,"Sinapi 74234/1"]
[null,"SF-00189","Hidrossanitário","Louças","Instalação de vaso sanitário reaproveitado","un",60,{"$f":"OFFSET(INDEX(Composições!A:M,MATCH(E193,Composições!B:B,0),13),2,0)","v":50.72},3043.2,{"$f":"BDI!$B$17","v":0.20335932421833602},61.03,3661.8,"Sinapi 95471 Adaptada"]
[null,"SF-00190","Hidrossanitário","Louças","Lavatório suspenso","un",10,{"$f":"OFFSET(INDEX(Composições!A:M,MATCH(E194,Composições!B:B,0),13),2,0)","v":96.08},960.8,{"$f":"BDI!$B$17","v":0.20335932421833602},115.62,1156.2,"Sinapi 86904"]
[null,"SF-00191","Hidrossanitário","Louças","Mictório – Linha Administrativa","un",20,{"$f":"OFFSET(INDEX(Composições!A:M,MATCH(E195,Composições!B:B,0),13),2,0)","v":325.19999999999993},6504,{"$f":"BDI!$B$17","v":0.20335932421833602},391.33,7826.6,"Sinapi 74234/1 Adaptada"]
[null,"SF-00192","Hidrossanitário","Louças","Tanque 38 litros – Linha Administrativa","un",5,{"$f":"OFFSET(INDEX(Composições!A:M,MATCH(E196,Composições!B:B,0),13),2,0)","v":355.97},1779.85,{"$f":"BDI!$B$17","v":0.20335932421833602},428.36,2141.8000000000002,"Sinapi 86874 Adaptada"]
[null,"SF-00193","Hidrossanitário","Metais","Acabamento para registro GD – Linha Administrativa","un",40,{"$f":"OFFSET(INDEX(Composições!A:M,MATCH(E197,Composições!B:B,0),13),2,0)","v":42.2},1688,{"$f":"BDI!$B$17","v":0.20335932421833602},50.78,2031.2,"Orse 8436 Adaptada"]
[null,"SF-00194","Hidrossanitário","Metais","Acabamento para registro PQ – Linha Administrativa","un",40,{"$f":"OFFSET(INDEX(Composições!A:M,MATCH(E198,Composições!B:B,0),13),2,0)","v":33.75},{"$f":"IF(ISNUMBER(H198),ROUND(G198*H198,2),\"-\")","v":1350},{"$f":"BDI!$B$17","v":0.20335932421833602},{"$f":"IF(ISNUMBER(H198),ROUND(H198*(1+J198),2),0)","v":40.61},{"$f":"ROUND(K198*G198,2)","v":1624.4},"Orse 8436 Adaptada"]
[null,"SF-00195","Hidrossanitário","Metais","Ducha higiênica – Linha Administrativa","un",60,{"$f":"OFFSET(INDEX(Composições!A:M,MATCH(E199,Composições!B:B,0),13),2,0)","v":221.83},13309.8,{"$f":"BDI!$B$17","v":0.20335932421833602},266.94,16016.4,"Pini 26.108.000090.SER Adaptada"]
[null,"SF-00196","Hidrossanitário","Metais","Instalação de metais e acessórios reaproveitados","un",200,{"$f":"OFFSET(INDEX(Composições!A:M,MATCH(E200,Composições!B:B,0),13),2,0)","v":3.25},650,{"$f":"BDI!$B$17","v":0.20335932421833602},3.91,782,"Sinapi 95541"]
[null,"SF-00197","Hidrossanitário","Metais","Ligação flexível 1/2” x 40 cm – Linha Administrativa","un",60,{"$f":"OFFSET(INDEX(Composições!A:M,MATCH(E201,Composições!B:B,0),13),2,0)","v":25.99},1559.4,{"$f":"BDI!$B$17","v":0.20335932421833602},31.28,1876.8,"Sinapi 86887"]
[null,"SF-00198","Hidrossanitário","Metais","Sifão articulado para cozinha – Linha Administrativa","un",20,{"$f":"OFFSET(INDEX(Composições!A:M,MATCH(E202,Composições!B:B,0),13),2,0)","v":192.76000000000002},3855.2,{"$f":"BDI!$B$17","v":0.20335932421833602},231.96,4639.2,"Sinapi 86881 Adaptada"]
[null,"SF-00199","Hidrossanitário","Metais","Sifão para lavatório 1 1/2\"","un",60,{"$f":"OFFSET(INDEX(Composições!A:M,MATCH(E203,Composições!B:B,0),13),2,0)","v":92.78},5566.8,{"$f":"BDI!$B$17","v":0.20335932421833602},111.65,6699,"Sinapi 86881"]
[null,"SF-00200","Hidrossanitário","Metais","Sifão para tanque – Linha Administrativa","un",5,{"$f":"OFFSET(INDEX(Composições!A:M,MATCH(E204,Composições!B:B,0),13),2,0)","v":101.44999999999999},507.25,{"$f":"BDI!$B$17","v":0.20335932421833602},122.08,610.4,"Sinapi 86881 Adaptada"]
[null,"SF-00201","Hidrossanitário","Metais","Torneira de mesa para cozinha bica móvel – Linha Administrativa","un",20,{"$f":"OFFSET(INDEX(Composições!A:M,MATCH(E205,Composições!B:B,0),13),2,0)","v":256.8},5136,{"$f":"BDI!$B$17","v":0.20335932421833602},309.02,6180.4,"Sinapi 86910 Adaptada"]
[null,"SF-00202","Hidrossanitário","Metais","Torneira de mesa para cozinha bica móvel – Linha Administrativa","un",20,{"$f":"OFFSET(INDEX(Composições!A:M,MATCH(E206,Composições!B:B,0),13),2,0)","v":256.8},5136,{"$f":"BDI!$B$17","v":0.20335932421833602},309.02,6180.4,"Sinapi 86910 Adaptada"]
[null,"SF-00203","Hidrossanitário","Metais","Torneira de mesa para lavatório – Linha Acessibilidade","un",10,{"$f":"OFFSET(INDEX(Composições!A:M,MATCH(E207,Composições!B:B,0),13),2,0)","v":236.27},2362.6999999999998,{"$f":"BDI!$B$17","v":0.20335932421833602},284.32,2843.2,"Sinapi 86915 Adaptada"]
[null,"SF-00204","Hidrossanitário","Metais","Torneira de mesa para lavatório bica alta – Linha Administrativa","un",60,{"$f":"OFFSET(INDEX(Composições!A:M,MATCH(E208,Composições!B:B,0),13),2,0)","v":145.79000000000002},8747.4,{"$f":"BDI!$B$17","v":0.20335932421833602},175.44,10526.4,"Sinapi 86915 Adaptada"]
[null,"SF-00205","Hidrossanitário","Metais","Torneira de mesa para lavatório bica baixa – Linha Administrativa","un",60,{"$f":"OFFSET(INDEX(Composições!A:M,MATCH(E209,Composições!B:B,0),13),2,0)","v":112.96000000000001},6777.6,{"$f":"BDI!$B$17","v":0.20335932421833602},135.93,8155.8,"Sinapi 86915 Adaptada"]
[null,"SF-00206","Hidrossanitário","Metais","Torneira de mesa para lavatório com fechamento automático – Linha Administrativa","un",60,{"$f":"OFFSET(INDEX(Composições!A:M,MATCH(E210,Composições!B:B,0),13),2,0)","v":140.20000000000002},8412,{"$f":"BDI!$B$17","v":0.20335932421833602},168.71,10122.6,"Sinapi 86915 Adaptada"]
[null,"SF-00207","Hidrossanitário","Metais","Torneira de parede para cozinha bica móvel – Linha Administrativa","un",20,{"$f":"OFFSET(INDEX(Composições!A:M,MATCH(E211,Composições!B:B,0),13),2,0)","v":155.31},3106.2,{"$f":"BDI!$B$17","v":0.20335932421833602},186.89,3737.8,"Sinapi 86910 Adaptada"]
[null,"SF-00208","Hidrossanitário","Metais","Torneira de parede para tanque – Linha Administrativa","un",5,{"$f":"OFFSET(INDEX(Composições!A:M,MATCH(E212,Composições!B:B,0),13),2,0)","v":52.51},262.55,{"$f":"BDI!$B$17","v":0.20335932421833602},63.19,315.95,"Sinapi 86914 Adaptada"]
[null,"SF-00209","Hidrossanitário","Metais","Válvula de descarga 1 1/2\" – Linha Acessibilidade","un",10,{"$f":"OFFSET(INDEX(Composições!A:M,MATCH(E213,Composições!B:B,0),13),2,0)","v":431.05},4310.5,{"$f":"BDI!$B$17","v":0.20335932421833602},518.71,5187.1000000000004,"Sinapi 40729 Adaptada"]
[null,"SF-00210","Hidrossanitário","Metais","Válvula de descarga 1 1/2\" – Linha Administrativa","un",60,{"$f":"OFFSET(INDEX(Composições!A:M,MATCH(E214,Composições!B:B,0),13),2,0)","v":168.61},10116.6,{"$f":"BDI!$B$17","v":0.20335932421833602},202.9,12174,"Sinapi 40729"]
[null,"SF-00211","Hidrossanitário","Metais","Válvula de descarga 1 1/4\" – Linha Acessibilidade","un",10,{"$f":"OFFSET(INDEX(Composições!A:M,MATCH(E215,Composições!B:B,0),13),2,0)","v":311.56},3115.6,{"$f":"BDI!$B$17","v":0.20335932421833602},374.92,3749.2,"Sinapi 40729 Adaptada"]
[null,"SF-00212","Hidrossanitário","Metais","Válvula de descarga 1 1/4\" – Linha Administrativa","un",60,{"$f":"OFFSET(INDEX(Composições!A:M,MATCH(E216,Composições!B:B,0),13),2,0)","v":141.75},8505,{"$f":"BDI!$B$17","v":0.20335932421833602},170.58,10234.799999999999,"Sinapi 40729 Adaptada"]
[null,"SF-00213","Hidrossanitário","Metais","Válvula de escoamento para lavatório – Linha Administrativa","un",60,{"$f":"OFFSET(INDEX(Composições!A:M,MATCH(E217,Composições!B:B,0),13),2,0)","v":26.319999999999997},1579.2,{"$f":"BDI!$B$17","v":0.20335932421833602},31.67,1900.2,"Sinapi 86877 Adaptada"]
[null,"SF-00214","Hidrossanitário","Metais","Válvula de escoamento para tanque – Linha Administrativa","un",5,{"$f":"OFFSET(INDEX(Composições!A:M,MATCH(E218,Composições!B:B,0),13),2,0)","v":22.5},112.5,{"$f":"BDI!$B$17","v":0.20335932421833602},27.08,135.4,"Sinapi 86879 Adaptada"]
[null,"SF-00215","Hidrossanitário","Metais","Válvula descarga para mictório – Linha Administrativa","un",60,{"$f":"OFFSET(INDEX(Composições!A:M,MATCH(E219,Composições!B:B,0),13),2,0)","v":148.92000000000002},8935.2000000000007,{"$f":"BDI!$B$17","v":0.20335932421833602},179.2,10752,"Sinapi 40729 Adaptada"]
[null,"SF-00216","Hidrossanitário","Acessibilidade","Alarme de emergência para sanitários PNE","un",10,{"$f":"OFFSET(INDEX(Composições!A:M,MATCH(E220,Composições!B:B,0),13),2,0)","v":300.35000000000002},3003.5,{"$f":"BDI!$B$17","v":0.20335932421833602},361.43,3614.3,"Orse 11961 Adaptada"]
[null,"SF-00217","Hidrossanitário","Acessibilidade","Barra de apoio 40cm – Linha Acessibilidade","un",20,{"$f":"OFFSET(INDEX(Composições!A:M,MATCH(E221,Composições!B:B,0),13),2,0)","v":108.24000000000001},2164.8000000000002,{"$f":"BDI!$B$17","v":0.20335932421833602},130.25,2605,"Pini 26.104.000060.SER Adaptada"]
[null,"SF-00218","Hidrossanitário","Acessibilidade","Barra de apoio 70cm – Linha Acessibilidade","un",20,{"$f":"OFFSET(INDEX(Composições!A:M,MATCH(E222,Composições!B:B,0),13),2,0)","v":121.24000000000001},2424.8000000000002,{"$f":"BDI!$B$17","v":0.20335932421833602},145.9,2918,"Pini 26.104.000060.SER Adaptada"]
[null,"SF-00219","Hidrossanitário","Acessibilidade","Barra de apoio 80cm – Linha Acessibilidade","un",20,{"$f":"OFFSET(INDEX(Composições!A:M,MATCH(E223,Composições!B:B,0),13),2,0)","v":123.24000000000001},2464.8000000000002,{"$f":"BDI!$B$17","v":0.20335932421833602},148.30000000000001,2966,"Pini 26.104.000060.SER Adaptada"]
[null,"SF-00220","Hidrossanitário","Acessibilidade","Barra de apoio lateral fixa 30cm – Linha Acessibilidade","un",20,{"$f":"OFFSET(INDEX(Composições!A:M,MATCH(E224,Composições!B:B,0),13),2,0)","v":134.24},2684.8,{"$f":"BDI!$B$17","v":0.20335932421833602},161.54,3230.8,"Pini 26.104.000060.SER"]
[null,"SF-00221","Hidrossanitário","Acessibilidade","Lavatório suspenso – Linha Acessibilidade","un",10,{"$f":"OFFSET(INDEX(Composições!A:M,MATCH(E225,Composições!B:B,0),13),2,0)","v":146.11000000000001},1461.1,{"$f":"BDI!$B$17","v":0.20335932421833602},175.82,1758.2,"Sinapi 86904 Adaptada"]
[null,"SF-00222","Hidrossanitário","Acessibilidade","Lavatório suspenso com Coluna – Linha Acessibilidade ","un",10,{"$f":"OFFSET(INDEX(Composições!A:M,MATCH(E226,Composições!B:B,0),13),2,0)","v":148.97},1489.7,{"$f":"BDI!$B$17","v":0.20335932421833602},179.26,1792.6,"Sinapi 86903 Adaptada"]
[null,"SF-00223","Hidrossanitário","Acessórios","Cabide – Linha Administrativa","un",60,{"$f":"OFFSET(INDEX(Composições!A:M,MATCH(E227,Composições!B:B,0),13),2,0)","v":49.7},2982,{"$f":"BDI!$B$17","v":0.20335932421833602},59.81,3588.6,"Sinapi 95542 Adaptada"]
[null,"SF-00224","Hidrossanitário","Acessórios","Papeleira – Linha Administrativa","un",60,{"$f":"OFFSET(INDEX(Composições!A:M,MATCH(E228,Composições!B:B,0),13),2,0)","v":91.13},5467.8,{"$f":"BDI!$B$17","v":0.20335932421833602},109.66,6579.6,"Sinapi 95542 Adaptada"]
[null,"SF-00225","Hidrossanitário","Acessórios","Porta toalha argola – Linha Administrativa","un",60,{"$f":"OFFSET(INDEX(Composições!A:M,MATCH(E229,Composições!B:B,0),13),2,0)","v":91.65},5499,{"$f":"BDI!$B$17","v":0.20335932421833602},110.29,6617.4,"Sinapi 95542 Adaptada"]
[null,"SF-00226","Hidrossanitário","Acessórios","Porta toalha barra – Linha Administrativa","un",60,{"$f":"OFFSET(INDEX(Composições!A:M,MATCH(E230,Composições!B:B,0),13),2,0)","v":122.28},7336.8,{"$f":"BDI!$B$17","v":0.20335932421833602},147.15,8829,"Sinapi 95542 Adaptada"]
[null,"SF-00227","Elétrica","Infraestrutura","Caixa 4x2 de embutir para alvenaria","un",2000,{"$f":"OFFSET(INDEX(Composições!A:M,MATCH(E231,Composições!B:B,0),13),2,0)","v":6.26},12520,{"$f":"BDI!$B$17","v":0.20335932421833602},7.53,15060,"Sinapi 91941"]
[null,"SF-00228","Elétrica","Infraestrutura","Caixa 4x2 para drywall","un",500,{"$f":"OFFSET(INDEX(Composições!A:M,MATCH(E232,Composições!B:B,0),13),2,0)","v":10.41},5205,{"$f":"BDI!$B$17","v":0.20335932421833602},12.53,6265,"Sinapi 91941 Adaptada"]
[null,"SF-00229","Elétrica","Infraestrutura","Caixa 4x4 de embutir para alvenaria","un",500,{"$f":"OFFSET(INDEX(Composições!A:M,MATCH(E233,Composições!B:B,0),13),2,0)","v":8.27},4135,{"$f":"BDI!$B$17","v":0.20335932421833602},9.9499999999999993,4975,"Sinapi 91944"]
[null,"SF-00230","Elétrica","Infraestrutura","Caixa 4x4 para drywall","un",100,{"$f":"OFFSET(INDEX(Composições!A:M,MATCH(E234,Composições!B:B,0),13),2,0)","v":12.989999999999998},1299,{"$f":"BDI!$B$17","v":0.20335932421833602},15.63,1563,"Sinapi 91944 Adaptada"]
[null,"SF-00231","Elétrica","Infraestrutura","Caixa de passagem em alumínio 100x100x50mm","un",1900,{"$f":"OFFSET(INDEX(Composições!A:M,MATCH(E235,Composições!B:B,0),13),2,0)","v":46.04},87476,{"$f":"BDI!$B$17","v":0.20335932421833602},55.4,105260,"Sinapi 83366 Adaptada"]
[null,"SF-00232","Elétrica","Infraestrutura","Caixa de passagem em alumínio 200x200x100mm","un",200,{"$f":"OFFSET(INDEX(Composições!A:M,MATCH(E236,Composições!B:B,0),13),2,0)","v":78.039999999999992},15608,{"$f":"BDI!$B$17","v":0.20335932421833602},93.91,18782,"Sinapi 83366 Adaptada"]
[null,"SF-00233","Elétrica","Infraestrutura","Caixa de passagem em PVC 150x150x75mm","un",1900,{"$f":"OFFSET(INDEX(Composições!A:M,MATCH(E237,Composições!B:B,0),13),2,0)","v":28.12},53428,{"$f":"BDI!$B$17","v":0.20335932421833602},33.840000000000003,64296,"Orse 08699 Adaptada"]
[null,"SF-00234","Elétrica","Infraestrutura","Caixa para piso elevado","un",200,{"$f":"OFFSET(INDEX(Composições!A:M,MATCH(E238,Composições!B:B,0),13),2,0)","v":233.82},46764,{"$f":"BDI!$B$17","v":0.20335932421833602},281.37,56274,"Sinapi 83366 Adaptada"]
[null,"SF-00235","Elétrica","Infraestrutura","Canaleta em alumínio aparente 73mmx25mm","m",1000,{"$f":"OFFSET(INDEX(Composições!A:M,MATCH(E239,Composições!B:B,0),13),2,0)","v":101.03},101030,{"$f":"BDI!$B$17","v":0.20335932421833602},121.58,121580,"Pini 16.111.000015.SER"]
[null,"SF-00236","Elétrica","Infraestrutura","Condulete de alumínio de 1’’","un",1900,{"$f":"OFFSET(INDEX(Composições!A:M,MATCH(E240,Composições!B:B,0),13),2,0)","v":29.21},55499,{"$f":"BDI!$B$17","v":0.20335932421833602},35.15,66785,"Sinapi 95802"]
[null,"SF-00237","Elétrica","Infraestrutura","Eletrocalha 100x50 mm","m",1500,{"$f":"OFFSET(INDEX(Composições!A:M,MATCH(E241,Composições!B:B,0),13),2,0)","v":47.05},70575,{"$f":"BDI!$B$17","v":0.20335932421833602},56.62,84930,"Pini 16.113.000350.SER Adaptada"]
[null,"SF-00238","Elétrica","Infraestrutura","Eletrocalha 200x100 mm","m",1500,{"$f":"OFFSET(INDEX(Composições!A:M,MATCH(E242,Composições!B:B,0),13),2,0)","v":82.210000000000008},123315,{"$f":"BDI!$B$17","v":0.20335932421833602},98.93,148395,"Pini 16.113.000377.SER Adaptada"]
[null,"SF-00239","Elétrica","Infraestrutura","Eletrocalha 200x50 mm","m",1500,{"$f":"OFFSET(INDEX(Composições!A:M,MATCH(E243,Composições!B:B,0),13),2,0)","v":69.77000000000001},104655,{"$f":"BDI!$B$17","v":0.20335932421833602},83.96,125940,"Pini 16.113.000356.SER Adaptada"]
[null,"SF-00240","Elétrica","Infraestrutura","Eletrocalha 300x100 mm","m",1500,{"$f":"OFFSET(INDEX(Composições!A:M,MATCH(E244,Composições!B:B,0),13),2,0)","v":95.17},142755,{"$f":"BDI!$B$17","v":0.20335932421833602},114.52,171780,"Pini 16.113.000380.SER Adaptada"]
[null,"SF-00241","Elétrica","Infraestrutura","Eletrocalha 300x50 mm","m",1500,{"$f":"OFFSET(INDEX(Composições!A:M,MATCH(E245,Composições!B:B,0),13),2,0)","v":82.62},123930,{"$f":"BDI!$B$17","v":0.20335932421833602},99.42,149130,"Pini 16.113.000359.SER Adaptada"]
[null,"SF-00242","Elétrica","Infraestrutura","Eletrocalha 400x50 mm","m",1500,{"$f":"OFFSET(INDEX(Composições!A:M,MATCH(E246,Composições!B:B,0),13),2,0)","v":105.82000000000001},158730,{"$f":"BDI!$B$17","v":0.20335932421833602},127.34,191010,"Pini 16.113.000362.SER Adaptada"]
[null,"SF-00243","Elétrica","Infraestrutura","Eletrocalha 50x50 mm","m",3000,{"$f":"OFFSET(INDEX(Composições!A:M,MATCH(E247,Composições!B:B,0),13),2,0)","v":39.79999999999999},119400,{"$f":"BDI!$B$17","v":0.20335932421833602},47.89,143670,"Pini 16.113.000344.SER Adaptada"]
[null,"SF-00244","Elétrica","Infraestrutura","Eletroduto de aço galvanizado de 1 1/2\"","m",6000,{"$f":"OFFSET(INDEX(Composições!A:M,MATCH(E248,Composições!B:B,0),13),2,0)","v":24.400000000000002},146400,{"$f":"BDI!$B$17","v":0.20335932421833602},29.36,176160,"Sinapi 95752 Adaptada"]
[null,"SF-00245","Elétrica","Infraestrutura","Eletroduto de aço galvanizado de 1 1/4\"","m",8000,{"$f":"OFFSET(INDEX(Composições!A:M,MATCH(E249,Composições!B:B,0),13),2,0)","v":20.71},165680,{"$f":"BDI!$B$17","v":0.20335932421833602},24.92,199360,"Sinapi 95751 Adaptada"]
[null,"SF-00246","Elétrica","Infraestrutura","Eletroduto de aço galvanizado de 1\"","m",1500,{"$f":"OFFSET(INDEX(Composições!A:M,MATCH(E250,Composições!B:B,0),13),2,0)","v":17.47},26205,{"$f":"BDI!$B$17","v":0.20335932421833602},21.02,31530,"Sinapi 95750 Adaptada"]
[null,"SF-00247","Elétrica","Infraestrutura","Eletroduto de aço galvanizado de 2\"","m",3000,{"$f":"OFFSET(INDEX(Composições!A:M,MATCH(E251,Composições!B:B,0),13),2,0)","v":29.769999999999996},89310,{"$f":"BDI!$B$17","v":0.20335932421833602},35.82,107460,"Sinapi 95752 Adaptada"]
[null,"SF-00248","Elétrica","Infraestrutura","Eletroduto de aço galvanizado de 3/4\"","m",1500,{"$f":"OFFSET(INDEX(Composições!A:M,MATCH(E252,Composições!B:B,0),13),2,0)","v":14.27},21405,{"$f":"BDI!$B$17","v":0.20335932421833602},17.170000000000002,25755,"Sinapi 95749 Adaptada"]
[null,"SF-00249","Elétrica","Infraestrutura","Eletroduto de PVC Corrugado Reforçado 1'' (DE 32mm)","m",1900,{"$f":"OFFSET(INDEX(Composições!A:M,MATCH(E253,Composições!B:B,0),13),2,0)","v":9.52},18088,{"$f":"BDI!$B$17","v":0.20335932421833602},11.46,21774,"Sinapi 91836 Adaptada"]
[null,"SF-00250","Elétrica","Infraestrutura","Eletroduto de PVC Corrugado Reforçado 3/4'' (DE 25mm)","m",1900,{"$f":"OFFSET(INDEX(Composições!A:M,MATCH(E254,Composições!B:B,0),13),2,0)","v":6.6199999999999992},12578,{"$f":"BDI!$B$17","v":0.20335932421833602},7.97,15143,"Sinapi 91834 Adaptada"]
[null,"SF-00251","Elétrica","Infraestrutura","Eletroduto flexível metálico com capa de PVC 1’’","m",3000,{"$f":"OFFSET(INDEX(Composições!A:M,MATCH(E255,Composições!B:B,0),13),2,0)","v":18.96},56880,{"$f":"BDI!$B$17","v":0.20335932421833602},22.82,68460,"Sinapi 91846 Adaptada"]
[null,"SF-00252","Elétrica","Infraestrutura","Eletroduto flexível metálico com capa de PVC 3/4\"","m",3000,{"$f":"OFFSET(INDEX(Composições!A:M,MATCH(E256,Composições!B:B,0),13),2,0)","v":14.64},43920,{"$f":"BDI!$B$17","v":0.20335932421833602},17.62,52860,"Sinapi 91844 Adaptada"]
[null,"SF-00253","Elétrica","Infraestrutura","Perfilado 38x38mm","m",1500,{"$f":"OFFSET(INDEX(Composições!A:M,MATCH(E257,Composições!B:B,0),13),2,0)","v":42.169999999999995},63255,{"$f":"BDI!$B$17","v":0.20335932421833602},50.75,76125,"Pini 16.113.000972.SER Adaptada"]
[null,"SF-00254","Elétrica","Interruptores e Tomadas","Espelho 4x2","un",2500,{"$f":"OFFSET(INDEX(Composições!A:M,MATCH(E258,Composições!B:B,0),13),2,0)","v":5.03},12575,{"$f":"BDI!$B$17","v":0.20335932421833602},6.05,15125,"Sinapi 91947"]
[null,"SF-00255","Elétrica","Interruptores e Tomadas","Espelho 4x4","un",600,{"$f":"OFFSET(INDEX(Composições!A:M,MATCH(E259,Composições!B:B,0),13),2,0)","v":8.3800000000000008},5028,{"$f":"BDI!$B$17","v":0.20335932421833602},10.08,6048,"Sinapi 91951"]
[null,"SF-00256","Elétrica","Interruptores e Tomadas","Espelho cego redondo","un",10,{"$f":"OFFSET(INDEX(Composições!A:M,MATCH(E260,Composições!B:B,0),13),2,0)","v":7},70,{"$f":"BDI!$B$17","v":0.20335932421833602},8.42,84.2,"Sinapi 91947"]
[null,"SF-00257","Elétrica","Interruptores e Tomadas","Interruptor para condulete","un",100,{"$f":"OFFSET(INDEX(Composições!A:M,MATCH(E261,Composições!B:B,0),13),2,0)","v":24.65},2465,{"$f":"BDI!$B$17","v":0.20335932421833602},29.66,2966,"Pini 16.115.000191.SER Adaptada"]
[null,"SF-00258","Elétrica","Interruptores e Tomadas","Módulo cego","un",2000,{"$f":"OFFSET(INDEX(Composições!A:M,MATCH(E262,Composições!B:B,0),13),2,0)","v":3.79},{"$f":"IF(ISNUMBER(H262),ROUND(G262*H262,2),\"-\")","v":7580},{"$f":"BDI!$B$17","v":0.20335932421833602},{"$f":"IF(ISNUMBER(H262),ROUND(H262*(1+J262),2),0)","v":4.5599999999999996},{"$f":"ROUND(K262*G262,2)","v":9120},"Orse 00711 Adaptada"]
[null,"SF-00259","Elétrica","Interruptores e Tomadas","Módulo interruptor paralelo","un",100,{"$f":"OFFSET(INDEX(Composições!A:M,MATCH(E263,Composições!B:B,0),13),2,0)","v":16.88},1688,{"$f":"BDI!$B$17","v":0.20335932421833602},20.309999999999999,2031,"Sinapi 91954"]
[null,"SF-00260","Elétrica","Interruptores e Tomadas","Módulo interruptor simples","un",800,{"$f":"OFFSET(INDEX(Composições!A:M,MATCH(E264,Composições!B:B,0),13),2,0)","v":12.59},10072,{"$f":"BDI!$B$17","v":0.20335932421833602},15.15,12120,"Sinapi 91952"]
[null,"SF-00261","Elétrica","Interruptores e Tomadas","Módulo para saída de fio","un",100,{"$f":"OFFSET(INDEX(Composições!A:M,MATCH(E265,Composições!B:B,0),13),2,0)","v":3.33},333,{"$f":"BDI!$B$17","v":0.20335932421833602},4.01,401,"Orse 00711 Adaptada"]
[null,"SF-00262","Elétrica","Interruptores e Tomadas","Módulo sensor de presença","un",100,{"$f":"OFFSET(INDEX(Composições!A:M,MATCH(E266,Composições!B:B,0),13),2,0)","v":125.44},12544,{"$f":"BDI!$B$17","v":0.20335932421833602},150.94999999999999,15095,"Sinapi 91954 Adaptada"]
[null,"SF-00263","Elétrica","Interruptores e Tomadas","Módulo tomada 10 A","un",1800,{"$f":"OFFSET(INDEX(Composições!A:M,MATCH(E267,Composições!B:B,0),13),2,0)","v":13.649999999999999},24570,{"$f":"BDI!$B$17","v":0.20335932421833602},16.43,29574,"Sinapi 91998"]
[null,"SF-00264","Elétrica","Interruptores e Tomadas","Módulo tomada 20 A","un",360,{"$f":"OFFSET(INDEX(Composições!A:M,MATCH(E268,Composições!B:B,0),13),2,0)","v":15.34},5522.4,{"$f":"BDI!$B$17","v":0.20335932421833602},18.46,6645.6,"Sinapi 91999"]
[null,"SF-00265","Elétrica","Interruptores e Tomadas","Porta equipamentos para canaleta de alumínio aparente","un",50,{"$f":"OFFSET(INDEX(Composições!A:M,MATCH(E269,Composições!B:B,0),13),2,0)","v":20.170000000000002},1008.5,{"$f":"BDI!$B$17","v":0.20335932421833602},24.27,1213.5,"Pini 16.115.000180.SER Adaptada"]
[null,"SF-00266","Elétrica","Interruptores e Tomadas","Tampa cega metálica para caixas de piso 4x2","un",50,{"$f":"OFFSET(INDEX(Composições!A:M,MATCH(E270,Composições!B:B,0),13),2,0)","v":12.18},609,{"$f":"BDI!$B$17","v":0.20335932421833602},14.66,733,"Orse 00711 Adaptada"]
[null,"SF-00267","Elétrica","Interruptores e Tomadas","Tampa cega metálica para caixas de piso 4x4","un",50,{"$f":"OFFSET(INDEX(Composições!A:M,MATCH(E271,Composições!B:B,0),13),2,0)","v":14.559999999999999},728,{"$f":"BDI!$B$17","v":0.20335932421833602},17.52,876,"Orse 08998 Adaptada"]
[null,"SF-00268","Elétrica","Interruptores e Tomadas","Tampa cega para condulete","un",100,{"$f":"OFFSET(INDEX(Composições!A:M,MATCH(E272,Composições!B:B,0),13),2,0)","v":4.6099999999999994},461,{"$f":"BDI!$B$17","v":0.20335932421833602},5.55,555,"Pini 16.115.000191.SER Adaptada"]
[null,"SF-00269","Elétrica","Interruptores e Tomadas","Tampa RJ45 dupla para condulete","un",600,{"$f":"OFFSET(INDEX(Composições!A:M,MATCH(E273,Composições!B:B,0),13),2,0)","v":7.09},4254,{"$f":"BDI!$B$17","v":0.20335932421833602},8.5299999999999994,5118,"Pini 16.115.000191.SER Adaptada"]
[null,"SF-00270","Elétrica","Interruptores e Tomadas","Tomada para condulete","un",880,{"$f":"OFFSET(INDEX(Composições!A:M,MATCH(E274,Composições!B:B,0),13),2,0)","v":24.2},21296,{"$f":"BDI!$B$17","v":0.20335932421833602},29.12,25625.599999999999,"Pini 16.115.000191.SER Adaptada"]
[null,"SF-00271","Elétrica","Interruptores e Tomadas","Tomada para perfilado e eletrocalha","un",100,{"$f":"OFFSET(INDEX(Composições!A:M,MATCH(E275,Composições!B:B,0),13),2,0)","v":34.32},3432,{"$f":"BDI!$B$17","v":0.20335932421833602},41.3,4130,"Pini 16.113.000020.SER Adaptada"]
[null,"SF-00272","Elétrica","Iluminação","Bloco autônomo de emergência","un",100,{"$f":"OFFSET(INDEX(Composições!A:M,MATCH(E276,Composições!B:B,0),13),2,0)","v":185.59},18559,{"$f":"BDI!$B$17","v":0.20335932421833602},223.33,22333,"Sinapi 97599 Adaptada"]
[null,"SF-00273","Elétrica","Iluminação","Instalação de luminária reaproveitada","un",500,{"$f":"OFFSET(INDEX(Composições!A:M,MATCH(E277,Composições!B:B,0),13),2,0)","v":17.21},8605,{"$f":"BDI!$B$17","v":0.20335932421833602},20.71,10355,"Sinapi 97587 Adaptada"]
[null,"SF-00274","Elétrica","Iluminação","Luminária 2x14 W de embutir","un",50,{"$f":"OFFSET(INDEX(Composições!A:M,MATCH(E278,Composições!B:B,0),13),2,0)","v":156.58000000000001},7829,{"$f":"BDI!$B$17","v":0.20335932421833602},188.42,9421,"Sinapi 97587 Adaptada"]
[null,"SF-00275","Elétrica","Iluminação","Luminária 2x14 W de sobrepor","un",20,{"$f":"OFFSET(INDEX(Composições!A:M,MATCH(E279,Composições!B:B,0),13),2,0)","v":198.81000000000003},3976.2,{"$f":"BDI!$B$17","v":0.20335932421833602},239.24,4784.8,"Sinapi 97585 Adaptada"]
[null,"SF-00276","Elétrica","Iluminação","Luminária 2x28 W de embutir","un",500,{"$f":"OFFSET(INDEX(Composições!A:M,MATCH(E280,Composições!B:B,0),13),2,0)","v":188.63000000000002},94315,{"$f":"BDI!$B$17","v":0.20335932421833602},226.99,113495,"Sinapi 97587 Adaptada"]
[null,"SF-00277","Elétrica","Iluminação","Luminária 2x28 W de sobrepor","un",100,{"$f":"OFFSET(INDEX(Composições!A:M,MATCH(E281,Composições!B:B,0),13),2,0)","v":181.45000000000002},18145,{"$f":"BDI!$B$17","v":0.20335932421833602},218.35,21835,"Sinapi 97585 Adaptada"]
[null,"SF-00278","Elétrica","Condutores","Condutor 10mm²","m",2000,{"$f":"OFFSET(INDEX(Composições!A:M,MATCH(E282,Composições!B:B,0),13),2,0)","v":8.2199999999999989},16440,{"$f":"BDI!$B$17","v":0.20335932421833602},9.89,19780,"Sinapi 92980 Adaptada"]
[null,"SF-00279","Elétrica","Condutores","Condutor 16mm²","m",2000,{"$f":"OFFSET(INDEX(Composições!A:M,MATCH(E283,Composições!B:B,0),13),2,0)","v":12.19},24380,{"$f":"BDI!$B$17","v":0.20335932421833602},14.67,29340,"Sinapi 92982 Adaptada"]
[null,"SF-00280","Elétrica","Condutores","Condutor 2,5 mm²","m",24000,{"$f":"OFFSET(INDEX(Composições!A:M,MATCH(E284,Composições!B:B,0),13),2,0)","v":2.69},64560,{"$f":"BDI!$B$17","v":0.20335932421833602},3.24,77760,"Sinapi 91926 Adaptada"]
[null,"SF-00281","Elétrica","Condutores","Condutor 3x2,5 mm²","m",5000,{"$f":"OFFSET(INDEX(Composições!A:M,MATCH(E285,Composições!B:B,0),13),2,0)","v":8.2099999999999991},41050,{"$f":"BDI!$B$17","v":0.20335932421833602},9.8800000000000008,49400,"Sinapi 91930 Adaptada"]
[null,"SF-00282","Elétrica","Condutores","Condutor 4 mm²","m",9500,{"$f":"OFFSET(INDEX(Composições!A:M,MATCH(E286,Composições!B:B,0),13),2,0)","v":3.75},35625,{"$f":"BDI!$B$17","v":0.20335932421833602},4.51,42845,"Sinapi 91928 Adaptada"]
[null,"SF-00283","Elétrica","Condutores","Condutor 4x2,5 mm²","m",5000,{"$f":"OFFSET(INDEX(Composições!A:M,MATCH(E287,Composições!B:B,0),13),2,0)","v":7.2700000000000005},36350,{"$f":"BDI!$B$17","v":0.20335932421833602},8.75,43750,"Sinapi 92980 Adaptada"]
[null,"SF-00284","Elétrica","Condutores","Condutor 6 mm²","m",6000,{"$f":"OFFSET(INDEX(Composições!A:M,MATCH(E288,Composições!B:B,0),13),2,0)","v":5.1000000000000005},30600,{"$f":"BDI!$B$17","v":0.20335932421833602},6.14,36840,"Sinapi 91930 Adaptada"]
[null,"SF-00285","Elétrica","Quadros","Quadro elétrico TTA","cj",20,{"$f":"OFFSET(INDEX(Composições!A:M,MATCH(E289,Composições!B:B,0),13),2,0)","v":9948.85},198977,{"$f":"BDI!$G$17","v":0.11096454203424999},11052.82,221056.4,"Sinapi 74131/006 Adaptada"]
[null,"SF-00286","Ar Condicionado","Equipamentos Terminais e Unitários","Ar-condicionado do tipo split piso-teto inverter 54.000BTU/h","un",5,9796.0300000000007,48980.15,{"$f":"BDI!$G$17","v":0.11096454203424999},10883.04,54415.199999999997,"Pesquisa Simples"]
[null,"SF-00287","Ar Condicionado","Equipamentos Terminais e Unitários","Ar-condicionado fancolete hidrônico dutado 2,5 TR","un",60,2241.63,134497.79999999999,{"$f":"BDI!$G$17","v":0.11096454203424999},2490.37,149422.20000000001,"Pesquisa Simples"]
[null,"SF-00288","Ar Condicionado","Equipamentos Terminais e Unitários","Ar-condicionado fancolete hidrônico dutado 4,5 TR","un",10,3094.15,30941.5,{"$f":"BDI!$G$17","v":0.11096454203424999},3437.49,34374.9,"Pesquisa Simples"]
[null,"SF-00289","Ar Condicionado","Equipamentos Terminais e Unitários","Ar-condicionado fancolete hidrônico hi-wall 1,4 TR","un",5,2718.66,13593.3,{"$f":"BDI!$G$17","v":0.11096454203424999},3020.33,15101.65,"Pesquisa Simples"]
[null,"SF-00290","Ar Condicionado","Equipamentos Terminais e Unitários","Ar-condicionado split dutado inverter 30.000 BTU/h","un",40,9806.0300000000007,392241.2,{"$f":"BDI!$G$17","v":0.11096454203424999},10894.15,435766,"Pesquisa Simples"]
[null,"SF-00291","Ar Condicionado","Equipamentos Terminais e Unitários","Ar-condicionado split hi-wall inverter 12.000 BTU/h","un",40,1631.04,65241.599999999999,{"$f":"BDI!$G$17","v":0.11096454203424999},1812.03,72481.2,"Pesquisa Simples"]
[null,"SF-00292","Ar Condicionado","Equipamentos Terminais e Unitários","Ar-condicionado split hi-wall inverter 22.000 BTU/h","un",40,3014.03,120561.2,{"$f":"BDI!$G$17","v":0.11096454203424999},3348.48,133939.20000000001,"Pesquisa Simples"]
[null,"SF-00293","Ar Condicionado","Equipamentos Terminais e Unitários","Instalação de fancolete reaproveitado","un",30,{"$f":"OFFSET(INDEX(Composições!A:M,MATCH(E297,Composições!B:B,0),13),2,0)","v":66.150000000000006},1984.5,{"$f":"BDI!$B$17","v":0.20335932421833602},79.599999999999994,2388,"Senado Federal"]
[null,"SF-00294","Ar Condicionado","Equipamentos Terminais e Unitários","Instalação de split reaproveitado","un",50,{"$f":"OFFSET(INDEX(Composições!A:M,MATCH(E298,Composições!B:B,0),13),2,0)","v":99.23},4961.5,{"$f":"BDI!$B$17","v":0.20335932421833602},119.41,5970.5,"Senado Federal"]
[null,"SF-00295","Ar Condicionado","Exaustores","Exaustor axial 340 m3/h","un",60,{"$f":"OFFSET(INDEX(Composições!A:M,MATCH(E299,Composições!B:B,0),13),2,0)","v":191.35},11481,{"$f":"BDI!$B$17","v":0.20335932421833602},230.26,13815.6,"Orse 11148 Adaptada"]
[null,"SF-00296","Ar Condicionado","Exaustores","Exaustor axial 865 m3/h","un",5,{"$f":"OFFSET(INDEX(Composições!A:M,MATCH(E300,Composições!B:B,0),13),2,0)","v":815.94},4079.7,{"$f":"BDI!$B$17","v":0.20335932421833602},981.87,4909.3500000000004,"Orse 11148 Adaptada"]
[null,"SF-00297","Ar Condicionado","Dutos","Duto chapa galvanizada #22","m2",880,{"$f":"OFFSET(INDEX(Composições!A:M,MATCH(E301,Composições!B:B,0),13),2,0)","v":166.32},146361.60000000001,{"$f":"BDI!$B$17","v":0.20335932421833602},200.14,176123.2,"Pini 19.104.000012.SER Adaptada"]
[null,"SF-00298","Ar Condicionado","Dutos","Duto flexível 6”","m",40,{"$f":"OFFSET(INDEX(Composições!A:M,MATCH(E302,Composições!B:B,0),13),2,0)","v":28.61},1144.4000000000001,{"$f":"BDI!$B$17","v":0.20335932421833602},34.43,1377.2,"Pini 19.104.000080.SER Adaptada"]
[null,"SF-00299","Ar Condicionado","Dutos","Duto flexível 8”","m",20,{"$f":"OFFSET(INDEX(Composições!A:M,MATCH(E303,Composições!B:B,0),13),2,0)","v":30.41},608.20000000000005,{"$f":"BDI!$B$17","v":0.20335932421833602},36.590000000000003,731.8,"Pini 19.104.000080.SER Adaptada"]
[null,"SF-00300","Ar Condicionado","Difusores E Grelhas","Difusor de ar quadrado 360x360 mm","un",180,{"$f":"OFFSET(INDEX(Composições!A:M,MATCH(E304,Composições!B:B,0),13),2,0)","v":201.03},36185.4,{"$f":"BDI!$B$17","v":0.20335932421833602},241.91,43543.8,"Pini 19.104.000200.SER Adaptada"]
[null,"SF-00301","Ar Condicionado","Difusores E Grelhas","Difusor de ar quadrado com caixa plenum AK6 360x360 mm","un",10,{"$f":"OFFSET(INDEX(Composições!A:M,MATCH(E305,Composições!B:B,0),13),2,0)","v":253.14},2531.4,{"$f":"BDI!$B$17","v":0.20335932421833602},304.62,3046.2,"Pini 19.104.000200.SER Adaptada"]
[null,"SF-00302","Ar Condicionado","Difusores E Grelhas","Difusor de ar quadrado para insuflamento em duas direções perpendiculares 376x376 mm","un",10,{"$f":"OFFSET(INDEX(Composições!A:M,MATCH(E306,Composições!B:B,0),13),2,0)","v":182.54},1825.4,{"$f":"BDI!$B$17","v":0.20335932421833602},219.66,2196.6,"Pini 19.104.000200.SER Adaptada"]
[null,"SF-00303","Ar Condicionado","Difusores E Grelhas","Difusor de ar retangular para insuflamento em duas direções 371x208 mm","un",5,{"$f":"OFFSET(INDEX(Composições!A:M,MATCH(E307,Composições!B:B,0),13),2,0)","v":142.5},712.5,{"$f":"BDI!$B$17","v":0.20335932421833602},171.48,857.4,"Pini 19.104.000200.SER Adaptada"]
[null,"SF-00304","Ar Condicionado","Difusores E Grelhas","Difusor de ar retangular para insuflamento em três direções 264x432 mm","un",5,{"$f":"OFFSET(INDEX(Composições!A:M,MATCH(E308,Composições!B:B,0),13),2,0)","v":184.13},920.65,{"$f":"BDI!$B$17","v":0.20335932421833602},221.57,1107.8499999999999,"Pini 19.104.000200.SER Adaptada"]
[null,"SF-00305","Ar Condicionado","Difusores E Grelhas","Difusor de ar retangular para insuflamento em três direções 320x562 mm","un",5,{"$f":"OFFSET(INDEX(Composições!A:M,MATCH(E309,Composições!B:B,0),13),2,0)","v":218.96},1094.8,{"$f":"BDI!$B$17","v":0.20335932421833602},263.49,1317.45,"Pini 19.104.000200.SER Adaptada"]
[null,"SF-00306","Ar Condicionado","Difusores E Grelhas","Difusor de ar retangular para insuflamento em três direções 371x208 mm","un",5,{"$f":"OFFSET(INDEX(Composições!A:M,MATCH(E310,Composições!B:B,0),13),2,0)","v":157.43},787.15,{"$f":"BDI!$B$17","v":0.20335932421833602},189.44,947.2,"Pini 19.104.000200.SER Adaptada"]
[null,"SF-00307","Ar Condicionado","Difusores E Grelhas","Difusor de ar retangular para insuflamento em uma direção 371x208 mm","un",10,{"$f":"OFFSET(INDEX(Composições!A:M,MATCH(E311,Composições!B:B,0),13),2,0)","v":140.69},1406.9,{"$f":"BDI!$B$17","v":0.20335932421833602},169.3,1693,"Pini 19.104.000200.SER Adaptada"]
[null,"SF-00308","Ar Condicionado","Difusores E Grelhas","Grelha para retorno retangular 425x225 mm","un",180,{"$f":"OFFSET(INDEX(Composições!A:M,MATCH(E312,Composições!B:B,0),13),2,0)","v":183.70000000000002},33066,{"$f":"BDI!$B$17","v":0.20335932421833602},221.06,39790.800000000003,"Pini 19.104.000906.SER Adaptada"]
[null,"SF-00309","Ar Condicionado","Difusores E Grelhas","Grelha para retorno retangular 525x325 mm","un",10,{"$f":"OFFSET(INDEX(Composições!A:M,MATCH(E313,Composições!B:B,0),13),2,0)","v":216.12},2161.1999999999998,{"$f":"BDI!$B$17","v":0.20335932421833602},260.07,2600.6999999999998,"Pini 19.104.000906.SER Adaptada"]
[null,"SF-00310","Ar Condicionado","Difusores E Grelhas","Instalação de difusores, grelhas e acessórios de climatização reaproveitados","un",120,{"$f":"OFFSET(INDEX(Composições!A:M,MATCH(E314,Composições!B:B,0),13),2,0)","v":11.8},1416,{"$f":"BDI!$B$17","v":0.20335932421833602},14.2,1704,"Senado Federal"]
[null,"SF-00311","Ar Condicionado","Difusores E Grelhas","Instalação de exaustor reaproveitado","un",20,{"$f":"OFFSET(INDEX(Composições!A:M,MATCH(E315,Composições!B:B,0),13),2,0)","v":46.400000000000006},928,{"$f":"BDI!$B$17","v":0.20335932421833602},55.84,1116.8,"Orse 11148 Adaptada"]
[null,"SF-00312","Ar Condicionado","Difusores E Grelhas","Preparação para instalação de difusores/grelhas de ar em portas","un",20,{"$f":"OFFSET(INDEX(Composições!A:M,MATCH(E316,Composições!B:B,0),13),2,0)","v":16.7},334,{"$f":"BDI!$B$17","v":0.20335932421833602},20.100000000000001,402,"Senado Federal"]
[null,"SF-00313","Ar Condicionado","Acessórios Para Equipamentos Unitários","Bomba para condensado de ar-condicionado para instalação oculta","un",10,{"$f":"OFFSET(INDEX(Composições!A:M,MATCH(E317,Composições!B:B,0),13),2,0)","v":508.35},5083.5,{"$f":"BDI!$B$17","v":0.20335932421833602},611.73,6117.3,"CPOS 43.20.140 Adaptada"]
[null,"SF-00314","Ar Condicionado","Acessórios Para Equipamentos Unitários","Fita aluminizada para refrigeração 48 mm","m",600,0.09,54,{"$f":"BDI!$B$17","v":0.20335932421833602},0.11,66,"Pesquisa Simples"]
[null,"SF-00315","Ar Condicionado","Acessórios Para Equipamentos Unitários","Fita PVC 100 mm para acabamento em refrigeração","m",9600,0.28000000000000003,2688,{"$f":"BDI!$B$17","v":0.20335932421833602},0.34,3264,"Pesquisa Simples"]
[null,"SF-00316","Ar Condicionado","Acessórios Para Equipamentos Unitários","Mangueira emborrachada 3/4\" para água gelada","un",75,25.36,1902,{"$f":"BDI!$B$17","v":0.20335932421833602},30.52,2289,"Pesquisa Simples"]
[null,"SF-00317","Ar Condicionado","Acessórios Para Equipamentos Unitários","Suporte para unidade condensadora de aparelho split","un",125,{"$f":"OFFSET(INDEX(Composições!A:M,MATCH(E321,Composições!B:B,0),13),2,0)","v":60.52},7565,{"$f":"BDI!$B$17","v":0.20335932421833602},72.83,9103.75,"SBC 112411 Adaptada"]
[null,"SF-00318","Ar Condicionado","Acessórios Para Equipamentos Unitários","Suporte para unidade evaporadora de aparelho split ou fancolete","un",200,{"$f":"OFFSET(INDEX(Composições!A:M,MATCH(E322,Composições!B:B,0),13),2,0)","v":72.37},14474,{"$f":"BDI!$B$17","v":0.20335932421833602},87.09,17418,"SBC 112411 Adaptada"]
[null,"SF-00319","Ar Condicionado","Válvulas","Filtro em Y 1\"","un",10,{"$f":"OFFSET(INDEX(Composições!A:M,MATCH(E323,Composições!B:B,0),13),2,0)","v":106.81},1068.0999999999999,{"$f":"BDI!$B$17","v":0.20335932421833602},128.53,1285.3,"Sinapi 95250 Adaptada"]
[null,"SF-00320","Ar Condicionado","Válvulas","Filtro em Y 3/4\"","un",65,{"$f":"OFFSET(INDEX(Composições!A:M,MATCH(E324,Composições!B:B,0),13),2,0)","v":90.81},5902.65,{"$f":"BDI!$B$17","v":0.20335932421833602},109.28,7103.2,"Sinapi 95249 Adaptada"]
[null,"SF-00321","Ar Condicionado","Válvulas","Válvula de balanceamento e controle independente da pressão (PIBCV) 2 vias 1\"","un",10,{"$f":"OFFSET(INDEX(Composições!A:M,MATCH(E325,Composições!B:B,0),13),2,0)","v":539.61},5396.1,{"$f":"BDI!$B$17","v":0.20335932421833602},649.34,6493.4,"Sinapi 95250 Adaptada"]
[null,"SF-00322","Ar Condicionado","Válvulas","Válvula de balanceamento e controle independente da pressão (PIBCV) 2 vias 3/4\" ","un",65,{"$f":"OFFSET(INDEX(Composições!A:M,MATCH(E326,Composições!B:B,0),13),2,0)","v":519.75},{"$f":"IF(ISNUMBER(H326),ROUND(G326*H326,2),\"-\")","v":33783.75},{"$f":"BDI!$B$17","v":0.20335932421833602},{"$f":"IF(ISNUMBER(H326),ROUND(H326*(1+J326),2),0)","v":625.45000000000005},{"$f":"ROUND(K326*G326,2)","v":40654.25},"Sinapi 95249 Adaptada"]
[null,"SF-00323","Ar Condicionado","Válvulas","Válvula de esfera em bronze 1 1/2\"","un",20,{"$f":"OFFSET(INDEX(Composições!A:M,MATCH(E327,Composições!B:B,0),13),2,0)","v":84.07},1681.4,{"$f":"BDI!$B$17","v":0.20335932421833602},101.17,2023.4,"Sinapi 95252"]
[null,"SF-00324","Ar Condicionado","Válvulas","Válvula de esfera em bronze 1 1/4\"","un",20,{"$f":"OFFSET(INDEX(Composições!A:M,MATCH(E328,Composições!B:B,0),13),2,0)","v":74.099999999999994},1482,{"$f":"BDI!$B$17","v":0.20335932421833602},89.17,1783.4,"Sinapi 95251"]
[null,"SF-00325","Ar Condicionado","Válvulas","Válvula de esfera em bronze 1\"","un",20,{"$f":"OFFSET(INDEX(Composições!A:M,MATCH(E329,Composições!B:B,0),13),2,0)","v":57.54},1150.8,{"$f":"BDI!$B$17","v":0.20335932421833602},69.239999999999995,1384.8,"Sinapi 95250"]
[null,"SF-00326","Ar Condicionado","Válvulas","Válvula de esfera em bronze 3/4\" ","un",150,{"$f":"OFFSET(INDEX(Composições!A:M,MATCH(E330,Composições!B:B,0),13),2,0)","v":49.08},7362,{"$f":"BDI!$B$17","v":0.20335932421833602},59.06,8859,"Sinapi 95249"]
[null,"SF-00327","Ar Condicionado","Tubos e isolamento térmico","Isolamento elastomérico em formato de prancha autoadesiva","m2",825,{"$f":"OFFSET(INDEX(Composições!A:M,MATCH(E331,Composições!B:B,0),13),2,0)","v":93.86999999999999},77442.75,{"$f":"BDI!$B$17","v":0.20335932421833602},112.96,93192,"Senado Federal"]
[null,"SF-00328","Ar Condicionado","Tubos e isolamento térmico","Isolamento elastomérico para tubulações de cobre de 1 1/8\" / tubulações de ferro de 3/4\"","m",810,{"$f":"OFFSET(INDEX(Composições!A:M,MATCH(E332,Composições!B:B,0),13),2,0)","v":14.18},11485.8,{"$f":"BDI!$B$17","v":0.20335932421833602},17.059999999999999,13818.6,"Sinapi 97330 Adaptada"]
[null,"SF-00329","Ar Condicionado","Tubos e isolamento térmico","Isolamento elastomérico para tubulações de cobre de 1/2\"","m",400,{"$f":"OFFSET(INDEX(Composições!A:M,MATCH(E333,Composições!B:B,0),13),2,0)","v":7.93},3172,{"$f":"BDI!$B$17","v":0.20335932421833602},9.5399999999999991,3816,"Sinapi 97329 Adaptada"]
[null,"SF-00330","Ar Condicionado","Tubos e isolamento térmico","Isolamento elastomérico para tubulações de cobre de 1/4\"","m",400,{"$f":"OFFSET(INDEX(Composições!A:M,MATCH(E334,Composições!B:B,0),13),2,0)","v":4.16},1664,{"$f":"BDI!$B$17","v":0.20335932421833602},5.01,2004,"Sinapi 97327 Adaptada"]
[null,"SF-00331","Ar Condicionado","Tubos e isolamento térmico","Isolamento elastomérico para tubulações de cobre de 3/4\"","m",400,{"$f":"OFFSET(INDEX(Composições!A:M,MATCH(E335,Composições!B:B,0),13),2,0)","v":10.119999999999999},4048,{"$f":"BDI!$B$17","v":0.20335932421833602},12.18,4872,"Sinapi 97330 Adaptada"]
[null,"SF-00332","Ar Condicionado","Tubos e isolamento térmico","Isolamento elastomérico para tubulações de cobre de 3/8\"","m",800,{"$f":"OFFSET(INDEX(Composições!A:M,MATCH(E336,Composições!B:B,0),13),2,0)","v":6.96},5568,{"$f":"BDI!$B$17","v":0.20335932421833602},8.3800000000000008,6704,"Sinapi 97328 Adaptada"]
[null,"SF-00333","Ar Condicionado","Tubos e isolamento térmico","Isolamento elastomérico para tubulações de cobre de 5/8\"","m",400,{"$f":"OFFSET(INDEX(Composições!A:M,MATCH(E337,Composições!B:B,0),13),2,0)","v":8.5499999999999989},3420,{"$f":"BDI!$B$17","v":0.20335932421833602},10.29,4116,"Sinapi 97330 Adaptada"]
[null,"SF-00334","Ar Condicionado","Tubos e isolamento térmico","Isolamento elastomérico para tubulações de cobre de 7/8\" / tubulações de ferro de 1/2\"","m",100,{"$f":"OFFSET(INDEX(Composições!A:M,MATCH(E338,Composições!B:B,0),13),2,0)","v":9.92},992,{"$f":"BDI!$B$17","v":0.20335932421833602},11.94,1194,"Sinapi 97330 Adaptada"]
[null,"SF-00335","Ar Condicionado","Tubos e isolamento térmico","Isolamento elastomérico para tubulações de cobre de 1\"","m",30,{"$f":"OFFSET(INDEX(Composições!A:M,MATCH(E339,Composições!B:B,0),13),2,0)","v":10.379999999999999},{"$f":"IF(ISNUMBER(H339),ROUND(G339*H339,2),\"-\")","v":311.39999999999998},{"$f":"BDI!$B$17","v":0.20335932421833602},{"$f":"IF(ISNUMBER(H339),ROUND(H339*(1+J339),2),0)","v":12.49},{"$f":"ROUND(K339*G339,2)","v":374.7},"Sinapi 97330 Adaptada"]
[null,"SF-00336","Ar Condicionado","Tubos e isolamento térmico","Isolamento elastomérico para tubulações de ferro de 1 1/2\"","m",100,{"$f":"OFFSET(INDEX(Composições!A:M,MATCH(E340,Composições!B:B,0),13),2,0)","v":21.27},2127,{"$f":"BDI!$B$17","v":0.20335932421833602},25.6,2560,"Sinapi 97330 Adaptada"]
[null,"SF-00337","Ar Condicionado","Tubos e isolamento térmico","Isolamento elastomérico para tubulações de ferro de 1 1/4\"","m",100,{"$f":"OFFSET(INDEX(Composições!A:M,MATCH(E341,Composições!B:B,0),13),2,0)","v":17.91},1791,{"$f":"BDI!$B$17","v":0.20335932421833602},21.55,2155,"Sinapi 97330 Adaptada"]
[null,"SF-00338","Ar Condicionado","Tubos e isolamento térmico","Isolamento elastomérico para tubulações de ferro de 1\"","m",100,{"$f":"OFFSET(INDEX(Composições!A:M,MATCH(E342,Composições!B:B,0),13),2,0)","v":13.87},1387,{"$f":"BDI!$B$17","v":0.20335932421833602},16.690000000000001,1669,"Sinapi 97330 Adaptada"]
[null,"SF-00339","Ar Condicionado","Tubos e isolamento térmico","Proteção mecânica em alumínio","m2",100,{"$f":"OFFSET(INDEX(Composições!A:M,MATCH(E343,Composições!B:B,0),13),2,0)","v":17.61},1761,{"$f":"BDI!$B$17","v":0.20335932421833602},21.19,2119,"Senado Federal"]
[null,"SF-00340","Ar Condicionado","Tubos e isolamento térmico","Tubo de aço-carbono galvanizado 1 1/2\"","m",100,{"$f":"OFFSET(INDEX(Composições!A:M,MATCH(E344,Composições!B:B,0),13),2,0)","v":46.19},4619,{"$f":"BDI!$B$17","v":0.20335932421833602},55.58,5558,"Sinapi 92653 Adaptada"]
[null,"SF-00341","Ar Condicionado","Tubos e isolamento térmico","Tubo de aço-carbono galvanizado 1 1/4\"","m",100,{"$f":"OFFSET(INDEX(Composições!A:M,MATCH(E345,Composições!B:B,0),13),2,0)","v":39.69},3969,{"$f":"BDI!$B$17","v":0.20335932421833602},47.76,4776,"Sinapi 92652 Adaptada"]
[null,"SF-00342","Ar Condicionado","Tubos e isolamento térmico","Tubo de aço-carbono galvanizado 1\"","m",100,{"$f":"OFFSET(INDEX(Composições!A:M,MATCH(E346,Composições!B:B,0),13),2,0)","v":32.36},3236,{"$f":"BDI!$B$17","v":0.20335932421833602},38.94,3894,"Sinapi 92688 Adaptada"]
[null,"SF-00343","Ar Condicionado","Tubos e isolamento térmico","Tubo de aço-carbono galvanizado 3/4\"","m",750,{"$f":"OFFSET(INDEX(Composições!A:M,MATCH(E347,Composições!B:B,0),13),2,0)","v":31.919999999999998},23940,{"$f":"BDI!$B$17","v":0.20335932421833602},38.409999999999997,28807.5,"Sinapi 92688 Adaptada"]
[null,"SF-00344","Ar Condicionado","Tubos e isolamento térmico","Tubo de cobre de 1/2\"","m",400,{"$f":"OFFSET(INDEX(Composições!A:M,MATCH(E348,Composições!B:B,0),13),2,0)","v":18.079999999999998},7232,{"$f":"BDI!$B$17","v":0.20335932421833602},21.76,8704,"Sinapi 97329 Adaptada"]
[null,"SF-00345","Ar Condicionado","Tubos e isolamento térmico","Tubo de cobre de 1/4\" ","m",400,{"$f":"OFFSET(INDEX(Composições!A:M,MATCH(E349,Composições!B:B,0),13),2,0)","v":9.18},3672,{"$f":"BDI!$B$17","v":0.20335932421833602},11.05,4420,"Sinapi 97327 Adaptada"]
[null,"SF-00346","Ar Condicionado","Tubos e isolamento térmico","Tubo de cobre de 3/4\"","m",400,{"$f":"OFFSET(INDEX(Composições!A:M,MATCH(E350,Composições!B:B,0),13),2,0)","v":26.61},10644,{"$f":"BDI!$B$17","v":0.20335932421833602},32.020000000000003,12808,"Sinapi 97330 Adaptada"]
[null,"SF-00347","Ar Condicionado","Tubos e isolamento térmico","Tubo de cobre de 3/8\"","m",800,{"$f":"OFFSET(INDEX(Composições!A:M,MATCH(E351,Composições!B:B,0),13),2,0)","v":13.610000000000001},10888,{"$f":"BDI!$B$17","v":0.20335932421833602},16.38,13104,"Sinapi 97328 Adaptada"]
[null,"SF-00348","Ar Condicionado","Tubos e isolamento térmico","Tubo de cobre de 5/8\"","m",400,{"$f":"OFFSET(INDEX(Composições!A:M,MATCH(E352,Composições!B:B,0),13),2,0)","v":22.249999999999996},8900,{"$f":"BDI!$B$17","v":0.20335932421833602},26.77,10708,"Sinapi 97330 Adaptada"]
[null,"SF-00349","Ar Condicionado","Tubos e isolamento térmico","Tubo de cobre de 7/8\"","m",100,{"$f":"OFFSET(INDEX(Composições!A:M,MATCH(E353,Composições!B:B,0),13),2,0)","v":24.95},2495,{"$f":"BDI!$B$17","v":0.20335932421833602},30.02,3002,"Sinapi 97330 Adaptada"]
[null,"SF-00350","Ar Condicionado","Tubos e isolamento térmico","Tubo de cobre de 1\"","m",30,{"$f":"OFFSET(INDEX(Composições!A:M,MATCH(E354,Composições!B:B,0),13),2,0)","v":28.72},{"$f":"IF(ISNUMBER(H354),ROUND(G354*H354,2),\"-\")","v":861.6},{"$f":"BDI!$B$17","v":0.20335932421833602},{"$f":"IF(ISNUMBER(H354),ROUND(H354*(1+J354),2),0)","v":34.56},{"$f":"ROUND(K354*G354,2)","v":1036.8},"Sinapi 97330 Adaptada"]
[null,"SF-00351","Ar Condicionado","Tubos e isolamento térmico","Tubo de cobre de 1 1/8\"","m",60,{"$f":"OFFSET(INDEX(Composições!A:M,MATCH(E355,Composições!B:B,0),13),2,0)","v":31.279999999999998},1876.8,{"$f":"BDI!$B$17","v":0.20335932421833602},37.64,2258.4,"Sinapi 97330 Adaptada"]
[null,"SF-00352","Marcenaria e Serralheria","Armários","Armário em MDF laminado com porta e prateleiras","m2",500,590.83000000000004,295415,{"$f":"BDI!$B$17","v":0.20335932421833602},710.98,355490,"Pesquisa Simples"]
[null,"SF-00353","Marcenaria e Serralheria","Armários","Armários em MDF laminado com porta e gavetas","m2",100,590.83000000000004,59083,{"$f":"BDI!$B$17","v":0.20335932421833602},710.98,71098,"Pesquisa Simples"]
[null,"SF-00354","Marcenaria e Serralheria","Armários","Instalação de armários reaproveitados","m2",240,{"$f":"OFFSET(INDEX(Composições!A:M,MATCH(E358,Composições!B:B,0),13),2,0)","v":27.5},6600,{"$f":"BDI!$B$17","v":0.20335932421833602},33.090000000000003,7941.6,"Senado Federal"]
[null,"SF-00355","Marcenaria e Serralheria","Armários","Mesa/tampo de MDF, fixada em parede com mão-francesa","m2",20,{"$f":"OFFSET(INDEX(Composições!A:M,MATCH(E359,Composições!B:B,0),13),2,0)","v":161.32999999999998},3226.6,{"$f":"BDI!$B$17","v":0.20335932421833602},194.14,3882.8,"Senado Federal"]
[null,"SF-00356","Marcenaria e Serralheria","Armários","Painel para TV de 120 x 180 cm","un",10,{"$f":"OFFSET(INDEX(Composições!A:M,MATCH(E360,Composições!B:B,0),13),2,0)","v":253.3},2533,{"$f":"BDI!$B$17","v":0.20335932421833602},304.81,3048.1,"Senado Federal"]
[null,"SF-00357","Marcenaria e Serralheria","Armários","Painel para TV de 160 x 160 cm","un",10,{"$f":"OFFSET(INDEX(Composições!A:M,MATCH(E361,Composições!B:B,0),13),2,0)","v":535.75},5357.5,{"$f":"BDI!$B$17","v":0.20335932421833602},644.70000000000005,6447,"Senado Federal"]
[null,"SF-00358","Marcenaria e Serralheria","Armários","Painel para TV de 90 x 120 cm","un",10,{"$f":"OFFSET(INDEX(Composições!A:M,MATCH(E362,Composições!B:B,0),13),2,0)","v":152.1},1521,{"$f":"BDI!$B$17","v":0.20335932421833602},183.03,1830.3,"Senado Federal"]
[null,"SF-00359","Marcenaria e Serralheria","Portas","Batentes e guarnições para porta, em madeira","un",40,{"$f":"OFFSET(INDEX(Composições!A:M,MATCH(E363,Composições!B:B,0),13),2,0)","v":275.41000000000003},11016.4,{"$f":"BDI!$B$17","v":0.20335932421833602},331.42,13256.8,"Sinapi 90818"]
[null,"SF-00360","Marcenaria e Serralheria","Portas","Chapa de proteção para porta – Linha Acessibilidade","m2",5,{"$f":"OFFSET(INDEX(Composições!A:M,MATCH(E364,Composições!B:B,0),13),2,0)","v":235.45},1177.25,{"$f":"BDI!$B$17","v":0.20335932421833602},283.33,1416.65,"Seinfra C4621 Adaptada"]
[null,"SF-00361","Marcenaria e Serralheria","Portas","Folha de porta 2,10x0,60m, com ou sem bandeira, estruturada em madeira","un",10,{"$f":"OFFSET(INDEX(Composições!A:M,MATCH(E365,Composições!B:B,0),13),2,0)","v":175.71},1757.1,{"$f":"BDI!$B$17","v":0.20335932421833602},211.44,2114.4,"Sinapi 91009 Adaptada"]
[null,"SF-00362","Marcenaria e Serralheria","Portas","Folha de porta 2,10x0,70m, com ou sem bandeira, estruturada em madeira","un",15,{"$f":"OFFSET(INDEX(Composições!A:M,MATCH(E366,Composições!B:B,0),13),2,0)","v":131.22},1968.3,{"$f":"BDI!$B$17","v":0.20335932421833602},157.9,2368.5,"Sinapi 91010 Adaptada"]
[null,"SF-00363","Marcenaria e Serralheria","Portas","Folha de porta 2,10x0,80m, com ou sem bandeira, estruturada em madeira","un",30,{"$f":"OFFSET(INDEX(Composições!A:M,MATCH(E367,Composições!B:B,0),13),2,0)","v":208.79999999999998},6264,{"$f":"BDI!$B$17","v":0.20335932421833602},251.26,7537.8,"Sinapi 91011 Adaptada"]
[null,"SF-00364","Marcenaria e Serralheria","Portas","Folha de porta 2,10x0,90m, com ou sem bandeira, estruturada em madeira","un",15,{"$f":"OFFSET(INDEX(Composições!A:M,MATCH(E368,Composições!B:B,0),13),2,0)","v":197.43},2961.45,{"$f":"BDI!$B$17","v":0.20335932421833602},237.58,3563.7,"Sinapi 91012 Adaptada"]
[null,"SF-00365","Marcenaria e Serralheria","Portas","Folha de porta 2,10x1,0m, com ou sem bandeira, estruturada em madeira","un",10,{"$f":"OFFSET(INDEX(Composições!A:M,MATCH(E369,Composições!B:B,0),13),2,0)","v":206.35},2063.5,{"$f":"BDI!$B$17","v":0.20335932421833602},248.31,2483.1,"Sinapi 91012 Adaptada"]
[null,"SF-00366","Marcenaria e Serralheria","Portas","Instalação de batentes de madeira reaproveitados","un",30,{"$f":"OFFSET(INDEX(Composições!A:M,MATCH(E370,Composições!B:B,0),13),2,0)","v":67.319999999999993},2019.6,{"$f":"BDI!$B$17","v":0.20335932421833602},81.010000000000005,2430.3000000000002,"Sinapi 91294 Adaptada"]
[null,"SF-00367","Marcenaria e Serralheria","Portas","Instalação de folhas de portas reaproveitadas","un",30,{"$f":"OFFSET(INDEX(Composições!A:M,MATCH(E371,Composições!B:B,0),13),2,0)","v":68.67},2060.1,{"$f":"BDI!$B$17","v":0.20335932421833602},82.63,2478.9,"Sinapi 72144"]
[null,"SF-00368","Marcenaria e Serralheria","Ferragens","Dobradiça para porta","un",180,{"$f":"OFFSET(INDEX(Composições!A:M,MATCH(E372,Composições!B:B,0),13),2,0)","v":48.650000000000006},8757,{"$f":"BDI!$B$17","v":0.20335932421833602},58.54,10537.2,"Sinapi 74047/2 Adaptada"]
[null,"SF-00369","Marcenaria e Serralheria","Ferragens","Fechadura para banheiro maçaneta em barra","un",10,{"$f":"OFFSET(INDEX(Composições!A:M,MATCH(E373,Composições!B:B,0),13),2,0)","v":113.66999999999999},1136.7,{"$f":"BDI!$B$17","v":0.20335932421833602},136.79,1367.9,"Sinapi 90830 Adaptada"]
[null,"SF-00370","Marcenaria e Serralheria","Ferragens","Fechadura para porta externa maçaneta em barra","un",10,{"$f":"OFFSET(INDEX(Composições!A:M,MATCH(E374,Composições!B:B,0),13),2,0)","v":133.88},1338.8,{"$f":"BDI!$B$17","v":0.20335932421833602},161.11000000000001,1611.1,"Sinapi 90830 Adaptada"]
[null,"SF-00371","Marcenaria e Serralheria","Ferragens","Fechadura para porta interna maçaneta tubular","un",60,{"$f":"OFFSET(INDEX(Composições!A:M,MATCH(E375,Composições!B:B,0),13),2,0)","v":657.67000000000007},39460.199999999997,{"$f":"BDI!$B$17","v":0.20335932421833602},791.41,47484.6,"Sinapi 90830 Adaptada"]
[null,"SF-00372","Marcenaria e Serralheria","Ferragens","Instalação de ferragens de porta reaproveitadas","m",30,{"$f":"OFFSET(INDEX(Composições!A:M,MATCH(E376,Composições!B:B,0),13),2,0)","v":24.68},740.4,{"$f":"BDI!$B$17","v":0.20335932421833602},29.7,891,"Sinapi 90830 Adaptada"]
[null,"SF-00373","Marcenaria e Serralheria","Ferragens","Mola hidráulica aérea ","un",25,{"$f":"OFFSET(INDEX(Composições!A:M,MATCH(E377,Composições!B:B,0),13),2,0)","v":137.17000000000002},3429.25,{"$f":"BDI!$B$17","v":0.20335932421833602},165.06,4126.5,"Orse 01778 Adaptada"]
[null,"SF-00374","Marcenaria e Serralheria","Ferragens","Pivô em latão com acabamento cromado para portas pivotantes ","un",25,{"$f":"OFFSET(INDEX(Composições!A:M,MATCH(E378,Composições!B:B,0),13),2,0)","v":100.67},2516.75,{"$f":"BDI!$B$17","v":0.20335932421833602},121.14,3028.5,"Senado Federal"]
[null,"SF-00375","Rede e Telefonia","Rede","Cabo de dados tipo UTP, tipo LSZH, categoria 6","m",10000,{"$f":"OFFSET(INDEX(Composições!A:M,MATCH(E379,Composições!B:B,0),13),2,0)","v":2.2999999999999998},23000,{"$f":"BDI!$B$17","v":0.20335932421833602},2.77,27700,"Sinapi 98295 Adaptada"]
[null,"SF-00376","Rede e Telefonia","Rede","Módulo (tomada) de rede RJ45, categoria 6, com conectorização e certificação","un",1400,{"$f":"OFFSET(INDEX(Composições!A:M,MATCH(E380,Composições!B:B,0),13),2,0)","v":68.010000000000005},95214,{"$f":"BDI!$B$17","v":0.20335932421833602},81.84,114576,"Sinapi 98307 Adaptada"]
[null,"SF-00377","Rede e Telefonia","Rede","Painel de distribuição (patch panel) de 24 portas, categoria 6","un",30,{"$f":"OFFSET(INDEX(Composições!A:M,MATCH(E381,Composições!B:B,0),13),2,0)","v":451.49},13544.7,{"$f":"BDI!$B$17","v":0.20335932421833602},543.29999999999995,16299,"Sinapi 98302 Adaptada"]
[null,"SF-00378","Rede e Telefonia","Telefonia","Cabo de telefonia tipo CCI 50x2","m",10000,{"$f":"OFFSET(INDEX(Composições!A:M,MATCH(E382,Composições!B:B,0),13),2,0)","v":2.6399999999999997},26400,{"$f":"BDI!$B$17","v":0.20335932421833602},3.18,31800,"Sinapi 98262 Adaptada"]
[null,"SF-00379","Rede e Telefonia","Telefonia","Módulo (tomada) de rede RJ45, para telefonia","un",1040,{"$f":"OFFSET(INDEX(Composições!A:M,MATCH(E383,Composições!B:B,0),13),2,0)","v":37.82},{"$f":"IF(ISNUMBER(H383),ROUND(G383*H383,2),\"-\")","v":39332.800000000003},{"$f":"BDI!$B$17","v":0.20335932421833602},{"$f":"IF(ISNUMBER(H383),ROUND(H383*(1+J383),2),0)","v":45.51},{"$f":"ROUND(K383*G383,2)","v":47330.400000000001},"Sinapi 72337 Adaptada"]
[null,"SF-00380","Ar Condicionado","Difusores E Grelhas","Grelha para retorno para portas, divisórias e paredes 525x325 mm","un",100,{"$f":"OFFSET(INDEX(Composições!A:M,MATCH(E384,Composições!B:B,0),13),2,0)","v":347.37},34737,{"$f":"BDI!$B$17","v":0.20335932421833602},418.01,41801,"Pini 19.104.000804.SER Adaptada"]
[null,"CUSTO DIRETO TOTAL",null,null,null,null,null,null,{"$f":"SUBTOTAL(109,I5:I384)","v":8774271.2700000014},null,null,{"$f":"SUBTOTAL(109,L5:L384)","v":10465850.190000001}]
[null,"CUSTO TOTAL",null,null,null,null,null,null,{"$f":"L385","v":10465850.190000001}]

{"sheet":"Composições","index":1,"n_rows":2291,"n_cols":13,"rows_kept":2291,"cut":false,"hidden":false,"merged":[[0,0,2,0],[2189,3,2189,6],[2197,3,2197,6],[2181,3,2181,6],[2173,3,2173,6],[2165,3,2165,6],[423,0,430,0],[423,1,430,1],[429,3,429,6],[153,1,159,1],[595,1,602,1],[535,0,542,0],[535,1,542,1],[543,0,550,0],[543,1,550,1],[574,0,580,0],[551,0,557,0],[551,1,557,1],[581,0,586,0],[581,1,586,1],[618,0,625,0],[618,1,625,1],[610,0,617,0],[610,1,617,1],[626,0,633,0],[626,1,633,1],[744,0,748,0],[744,1,748,1],[699,0,704,0],[669,1,676,1],[688,0,698,0],[688,1,698,1],[716,0,729,0],[716,1,729,1],[642,0,649,0],[730,0,739,0],[2272,1,2277,1],[1031,0,1038,0],[1031,1,1038,1],[749,0,753,0],[749,1,753,1],[754,0,758,0],[754,1,758,1],[642,1,649,1],[634,0,641,0],[634,1,641,1],[730,1,739,1],[681,0,687,0],[681,1,687,1],[705,0,708,0],[705,1,708,1],[2258,0,2265,0],[2258,1,2265,1],[2266,0,2271,0],[2143,1,2152,1],[2125,0,2130,0],[2125,1,2130,1],[2137,0,2142,0],[2137,1,2142,1],[2131,0,2136,0],[595,0,602,0],[505,0,510,0],[505,1,510,1],[465,0,470,0],[465,1,470,1],[498,0,504,0],[498,1,504,1],[558,0,565,0],[558,1,565,1],[491,1,497,1],[519,0,526,0],[2143,0,2152,0],[431,0,440,0],[431,1,440,1],[378,0,391,0],[378,1,391,1],[392,0,398,0],[392,1,398,1],[471,0,477,0],[471,1,477,1],[441,0,447,0],[441,1,447,1],[448,0,458,0],[399,0,410,0],[448,1,458,1],[459,0,464,0],[399,1,410,1],[574,1,580,1],[519,1,526,1],[566,0,573,0],[566,1,573,1],[527,0,534,0],[527,1,534,1],[587,0,594,0],[587,1,594,1],[2049,0,2056,0],[2278,0,2284,0],[2278,1,2284,1],[789,0,794,0],[789,1,794,1],[816,0,820,0],[816,1,820,1],[827,0,830,0],[827,1,830,1],[2266,1,2271,1],[2252,0,2257,0],[2252,1,2257,1],[1183,0,1189,0],[1183,1,1189,1],[1081,0,1087,0],[1081,1,1087,1],[1137,0,1143,0],[1137,1,1143,1],[2167,0,2174,0],[2167,1,2174,1],[2208,0,2212,0],[2208,1,2212,1],[2159,0,2166,0],[2159,1,2166,1],[2049,1,2056,1],[2231,0,2236,0],[2231,1,2236,1],[2213,0,2218,0],[2213,1,2218,1],[2183,0,2190,0],[2183,1,2190,1],[2175,0,2182,0],[2175,1,2182,1],[2131,1,2136,1],[2117,1,2124,1],[2153,0,2158,0],[2153,1,2158,1],[2073,0,2080,0],[2073,1,2080,1],[2081,0,2088,0],[2081,1,2088,1],[2117,0,2124,0],[2065,0,2072,0],[2065,1,2072,1],[2089,0,2096,0],[2089,1,2096,1],[2057,0,2064,0],[2057,1,2064,1],[2237,0,2241,0],[2237,1,2241,1],[2225,0,2230,0],[2225,1,2230,1],[2191,0,2198,0],[2191,1,2198,1],[2219,0,2224,0],[2219,1,2224,1],[2199,0,2207,0],[2199,1,2207,1],[2242,0,2246,0],[2242,1,2246,1],[2247,0,2251,0],[2247,1,2251,1],[603,0,609,0],[603,1,609,1],[699,1,704,1],[178,0,184,0],[178,1,184,1],[766,0,771,0],[766,1,771,1],[650,0,655,0],[650,1,655,1],[663,0,668,0],[663,1,668,1],[656,0,662,0],[656,1,662,1],[677,0,680,0],[677,1,680,1],[669,0,676,0],[2019,0,2024,0],[2019,1,2024,1],[2113,0,2116,0],[2113,1,2116,1],[1947,0,1954,0],[1947,1,1954,1],[1939,0,1946,0],[1939,1,1946,1],[1971,0,1978,0],[1971,1,1978,1],[1955,0,1962,0],[1955,1,1962,1],[1979,0,1986,0],[1979,1,1986,1],[1963,0,1970,0],[1963,1,1970,1],[2043,0,2048,0],[2043,1,2048,1],[2037,0,2042,0],[2037,1,2042,1],[2031,0,2036,0],[2031,1,2036,1],[2025,0,2030,0],[2025,1,2030,1],[1987,0,1994,0],[1987,1,1994,1],[2011,0,2018,0],[2011,1,2018,1],[2003,0,2010,0],[2003,1,2010,1],[1995,0,2002,0],[1995,1,2002,1],[1867,0,1873,0],[1867,1,1873,1],[1925,0,1930,0],[1925,1,1930,1],[1918,0,1924,0],[1918,1,1924,1],[1911,0,1917,0],[1911,1,1917,1],[1904,0,1910,0],[1904,1,1910,1],[1897,0,1903,0],[1897,1,1903,1],[1931,0,1938,0],[1931,1,1938,1],[1822,0,1827,0],[1822,1,1827,1],[1828,0,1833,0],[1828,1,1833,1],[1834,0,1838,0],[1834,1,1838,1],[1844,0,1848,0],[1844,1,1848,1],[1839,0,1843,0],[1839,1,1843,1],[1849,0,1854,0],[1849,1,1854,1],[1855,0,1860,0],[1855,1,1860,1],[1861,0,1866,0],[1861,1,1866,1],[1889,0,1896,0],[1889,1,1896,1],[1881,0,1888,0],[1881,1,1888,1],[1874,0,1880,0],[1874,1,1880,1],[1816,0,1821,0],[1816,1,1821,1],[1792,0,1797,0],[1792,1,1797,1],[1810,0,1815,0],[1810,1,1815,1],[1786,0,1791,0],[1786,1,1791,1],[1798,0,1803,0],[1798,1,1803,1],[1804,0,1809,0],[1804,1,1809,1],[1762,0,1767,0],[1762,1,1767,1],[1768,0,1773,0],[1768,1,1773,1],[1755,0,1761,0],[1755,1,1761,1],[1774,0,1779,0],[1774,1,1779,1],[1780,0,1785,0],[1780,1,1785,1],[1602,0,1606,0],[1602,1,1606,1],[1738,0,1742,0],[1738,1,1742,1],[1733,0,1737,0],[1733,1,1737,1],[1743,0,1748,0],[1743,1,1748,1],[1749,0,1754,0],[1749,1,1754,1],[1634,0,1644,0],[1634,1,1644,1],[1645,0,1655,0],[1645,1,1655,1],[1621,0,1626,0],[1621,1,1626,1],[1627,0,1633,0],[1627,1,1633,1],[1607,0,1613,0],[1607,1,1613,1],[1614,0,1620,0],[1614,1,1620,1],[1727,0,1732,0],[1727,1,1732,1],[1434,0,1441,0],[1434,1,1441,1],[1692,0,1698,0],[1692,1,1698,1],[1706,0,1712,0],[1706,1,1712,1],[1720,0,1726,0],[1720,1,1726,1],[1678,0,1684,0],[1678,1,1684,1],[1685,0,1691,0],[1685,1,1691,1],[1699,0,1705,0],[1699,1,1705,1],[1587,0,1591,0],[1587,1,1591,1],[1592,0,1596,0],[1592,1,1596,1],[1582,0,1586,0],[1582,1,1586,1],[1656,0,1666,0],[1656,1,1666,1],[1667,0,1677,0],[1667,1,1677,1],[1419,0,1433,0],[1419,1,1433,1],[1517,0,1522,0],[1517,1,1522,1],[1597,0,1601,0],[1597,1,1601,1],[1374,0,1388,0],[1374,1,1388,1],[1404,0,1418,0],[1404,1,1418,1],[1502,0,1516,0],[1502,1,1516,1],[1481,0,1487,0],[1481,1,1487,1],[1474,0,1480,0],[1474,1,1480,1],[1466,0,1473,0],[1466,1,1473,1],[1450,0,1457,0],[1450,1,1457,1],[1576,0,1581,0],[1576,1,1581,1],[1553,0,1558,0],[1553,1,1558,1],[1523,0,1528,0],[1523,1,1528,1],[1529,0,1534,0],[1529,1,1534,1],[1570,0,1575,0],[1570,1,1575,1],[1442,0,1449,0],[1442,1,1449,1],[1535,0,1541,0],[1535,1,1541,1],[1542,0,1546,0],[1542,1,1546,1],[1559,0,1563,0],[1559,1,1563,1],[1564,0,1569,0],[1564,1,1569,1],[1458,0,1465,0],[1458,1,1465,1],[1495,0,1501,0],[1495,1,1501,1],[1488,0,1494,0],[1488,1,1494,1],[1547,0,1552,0],[1547,1,1552,1],[1389,0,1403,0],[1389,1,1403,1],[1286,0,1291,0],[1286,1,1291,1],[1322,0,1328,0],[1322,1,1328,1],[1310,0,1315,0],[1310,1,1315,1],[1292,0,1297,0],[1292,1,1297,1],[1298,0,1303,0],[1298,1,1303,1],[1304,0,1309,0],[1304,1,1309,1],[1316,0,1321,0],[1316,1,1321,1],[1329,0,1343,0],[1329,1,1343,1],[1359,0,1373,0],[1359,1,1373,1],[1344,0,1358,0],[1344,1,1358,1],[1266,0,1272,0],[1266,1,1272,1],[1279,0,1285,0],[1279,1,1285,1],[1273,0,1278,0],[1273,1,1278,1],[1067,0,1073,0],[1067,1,1073,1],[1088,0,1094,0],[1088,1,1094,1],[1095,0,1101,0],[1095,1,1101,1],[1130,0,1136,0],[1130,1,1136,1],[1256,0,1260,0],[1256,1,1260,1],[1251,0,1255,0],[1251,1,1255,1],[1246,0,1250,0],[1246,1,1250,1],[1211,0,1217,0],[1211,1,1217,1],[1218,0,1224,0],[1218,1,1224,1],[1102,0,1108,0],[1102,1,1108,1],[1225,0,1231,0],[1225,1,1231,1],[1261,0,1265,0],[1261,1,1265,1],[1055,0,1059,0],[1055,1,1059,1],[1198,0,1203,0],[1198,1,1203,1],[1232,0,1239,0],[1232,1,1239,1],[1240,0,1245,0],[1240,1,1245,1],[1204,0,1210,0],[1204,1,1210,1],[1152,0,1159,0],[1152,1,1159,1],[1144,0,1151,0],[1144,1,1151,1],[1060,0,1066,0],[1060,1,1066,1],[975,0,981,0],[975,1,981,1],[989,0,995,0],[989,1,995,1],[1005,0,1012,0],[1005,1,1012,1],[996,0,1004,0],[996,1,1004,1],[1190,0,1197,0],[1190,1,1197,1],[1176,0,1182,0],[1176,1,1182,1],[1074,0,1080,0],[1074,1,1080,1],[1109,0,1115,0],[1109,1,1115,1],[1116,0,1122,0],[1116,1,1122,1],[1123,0,1129,0],[1123,1,1129,1],[1168,0,1175,0],[1168,1,1175,1],[1160,0,1167,0],[1160,1,1167,1],[914,0,924,0],[914,1,924,1],[1049,0,1054,0],[1049,1,1054,1],[935,0,943,0],[935,1,943,1],[925,0,929,0],[925,1,929,1],[930,0,934,0],[930,1,934,1],[1044,0,1048,0],[1044,1,1048,1],[1039,0,1043,0],[1039,1,1043,1],[944,0,948,0],[944,1,948,1],[1021,0,1030,0],[1021,1,1030,1],[968,0,974,0],[968,1,974,1],[982,0,988,0],[982,1,988,1],[1013,0,1020,0],[1013,1,1020,1],[882,1,888,1],[876,0,881,0],[876,1,881,1],[870,0,875,0],[870,1,875,1],[896,0,902,0],[896,1,902,1],[903,0,913,0],[903,1,913,1],[821,1,826,1],[772,0,776,0],[772,1,776,1],[777,0,781,0],[777,1,781,1],[795,0,801,0],[795,1,801,1],[821,0,826,0],[802,0,808,0],[802,1,808,1],[809,0,815,0],[809,1,815,1],[759,0,765,0],[759,1,765,1],[709,0,715,0],[709,1,715,1],[740,0,743,0],[740,1,743,1],[782,0,788,0],[782,1,788,1],[301,0,306,0],[301,1,306,1],[511,0,518,0],[511,1,518,1],[491,0,497,0],[478,0,484,0],[478,1,484,1],[371,0,377,0],[371,1,377,1],[485,0,490,0],[485,1,490,1],[459,1,464,1],[417,0,422,0],[417,1,422,1],[411,0,416,0],[411,1,416,1],[209,0,213,0],[209,1,213,1],[232,0,242,0],[232,1,242,1],[357,0,370,0],[357,1,370,1],[332,1,341,1],[332,0,341,0],[271,0,285,0],[271,1,285,1],[342,0,347,0],[342,1,347,1],[348,0,356,0],[348,1,356,1],[307,0,321,0],[307,1,321,1],[286,0,300,0],[286,1,300,1],[322,0,331,0],[322,1,331,1],[249,0,256,0],[249,1,256,1],[264,1,270,1],[214,0,218,0],[214,1,218,1],[257,0,263,0],[257,1,263,1],[264,0,270,0],[41,0,45,0],[5,0,8,0],[5,1,8,1],[58,0,62,0],[58,1,62,1],[41,1,45,1],[160,0,164,0],[160,1,164,1],[86,0,90,0],[86,1,90,1],[9,0,12,0],[9,1,12,1],[76,0,80,0],[76,1,80,1],[51,0,57,0],[51,1,57,1],[32,0,35,0],[32,1,35,1],[27,0,31,0],[27,1,31,1],[96,0,100,0],[96,1,100,1],[153,0,159,0],[13,0,16,0],[13,1,16,1],[223,0,231,0],[223,1,231,1],[200,0,204,0],[200,1,204,1],[101,0,104,0],[101,1,104,1],[17,1,21,1],[17,0,21,0],[219,0,222,0],[219,1,222,1],[143,1,147,1],[165,0,169,0],[165,1,169,1],[81,0,85,0],[81,1,85,1],[115,0,118,0],[115,1,118,1],[170,0,173,0],[170,1,173,1],[36,1,40,1],[36,0,40,0],[174,1,177,1],[174,0,177,0],[63,0,67,0],[63,1,67,1],[46,0,50,0],[46,1,50,1],[205,0,208,0],[205,1,208,1],[110,0,114,0],[110,1,114,1],[119,0,123,0],[119,1,123,1],[196,0,199,0],[143,0,147,0],[105,0,109,0],[105,1,109,1],[196,1,199,1],[185,1,191,1],[124,0,128,0],[124,1,128,1],[959,0,967,0],[959,1,967,1],[889,0,895,0],[1713,0,1719,0],[1713,1,1719,1],[192,0,195,0],[192,1,195,1],[68,0,75,0],[68,1,75,1],[134,0,137,0],[134,1,137,1],[138,0,142,0],[138,1,142,1],[91,0,95,0],[91,1,95,1],[129,0,133,0],[129,1,133,1],[185,0,191,0],[148,0,152,0],[148,1,152,1],[889,1,895,1],[882,0,888,0],[243,0,248,0],[243,1,248,1],[0,2,0,12],[1,2,1,12],[2,2,2,12],[22,1,26,1],[22,0,26,0],[2285,0,2290,0],[2285,1,2290,1],[2272,0,2277,0],[2097,0,2104,0],[2097,1,2104,1],[2105,0,2112,0],[2105,1,2112,1],[831,0,835,0],[831,1,835,1],[836,0,844,0],[836,1,844,1],[861,0,869,0],[861,1,869,1],[852,0,860,0],[852,1,860,1],[845,0,851,0],[845,1,851,1],[949,0,958,0],[949,1,958,1]]}
[null,"SENADO FEDERAL","Ata de Registro de Preços para Reformas no SF - 2018/2019"]
[null,"SECRETARIA DE INFRAESTRUTURA","COMPOSIÇÕES"]
[null,"SERVIÇO DE ORÇAMENTOS","Outubro de 2018 (data-base: Sinapi ago/2018, Pini ago/2018 e Orse jul/2018)"]
[]
["Item","Discriminação",null,"Especificação do Serviço","Unidade","Coeficiente","Fonte do Coeficiente","Preço","Fonte do Preço","Composição Auxiliar","MAT.","M.O.","TOTAL"]
["SF-00001","Engenheiro(a) /Arquiteto(a) júnior",{"$f":"IF(AND(D6<>\"\",A21=\"\"),C22,IF(D6<>\"\",A21,\"\"))","v":""},null,"hh",null,"Sinapi 90777"]
[null,null,{"$f":"IF(AND(D7<>\"\",A22=\"\"),C6,IF(D7<>\"\",A22,\"\"))","v":""}]
[null,null,{"$f":"IF(AND(D8<>\"\",A6=\"\"),C7,IF(D8<>\"\",A6,\"\"))","v":"SF-00001"},"Engenheiro civil de obra júnior com encargos complementares","h",1,"Sinapi 90777",72.153000000000006,"Sinapi 90777",null,null,{"$f":"ROUND(H8*F8,2)","v":72.150000000000006},{"$f":"SUM(J8:L8)","v":72.150000000000006}]
[null,null,"",null,null,null,null,""]
["SF-00002","Mestre de obras","",null,"hh",null,"Sinapi 90780",""]
[null,null,""]
[null,null,"SF-00002","Mestre de obras com encargos complementares","h",1,"Sinapi 90780",21.753000000000004,"Sinapi 90780",null,null,{"$f":"ROUND(H12*F12,2)","v":21.75},{"$f":"SUM(J12:L12)","v":21.75}]
[null,null,"",null,null,null,null,""]
["SF-00003","Planejamento físico-financeiro","",null,"un",null,"Senado Federal",""]
[null,null,"",null,null,null,null,""]
[null,null,"SF-00003","Engenheiro Civil de Obra Pleno","h",16,"Senado Federal",82.070999999999998,"Sinapi 90778",null,null,{"$f":"ROUND(H16*F16,2)","v":1313.14},{"$f":"SUM(J16:L16)","v":1313.14}]
[null,null,"",null,null,null,null,""]
["SF-00004","Projetos de segurança do trabalho","",null,"un",null,"Senado Federal",""]
[null,null,"",null,null,null,null,""]
[null,null,"SF-00004","Engenheiro de Segurança do Trabalho","h",20,"Senado Federal",82.070999999999998,"Sinapi 90778",null,null,{"$f":"ROUND(H20*F20,2)","v":1641.42},{"$f":"SUM(J20:L21)","v":1838.1100000000001}]
[null,null,"SF-00004","Anotação de Responsabilidade Técnica","un",1,"Senado Federal",196.68600000000001,"Crea-DF",null,{"$f":"ROUND(H21*F21,2)","v":196.69}]
[null,null,"",null,null,null,null,""]
["SF-00005","Demolição de alvenarias","",null,"m3",null,"Sinapi 97622",""]
[null,null,"",null,null,null,null,""]
[null,null,"SF-00005","Pedreiro com Encargos Complementares","h",0.22500000000000001,"Sinapi 97622",18.117000000000001,"Sinapi 88309",null,null,{"$f":"ROUND(H25*F25,2)","v":4.08},{"$f":"SUM(J25:L26)","v":34.69}]
[null,null,"SF-00005","Servente com Encargos Complementares","h",2.3248000000000002,"Sinapi 97622",13.167000000000002,"Sinapi 88316",null,null,{"$f":"ROUND(H26*F26,2)","v":30.61}]
[null,null,"",null,null,null,null,""]
["SF-00006","Demolição de concreto simples","",null,"m3",null,"Seinfra C1049 Adaptada",""]
[null,null,"",null,null,null,null,""]
[null,null,"SF-00006","Pedreiro com Encargos Complementares","h",1.3,"Seinfra C1049",18.117000000000001,"Sinapi 88309",null,null,{"$f":"ROUND(H30*F30,2)","v":23.55},{"$f":"SUM(J30:L31)","v":194.72}]
[null,null,"SF-00006","Servente com Encargos Complementares","h",13,"Seinfra C1049",13.167000000000002,"Sinapi 88316",null,null,{"$f":"ROUND(H31*F31,2)","v":171.17}]
[null,null,"",null,null,null,null,""]
["SF-00007","Demolição de contrapiso","",null,"m2",null,"SCO/RJ - SC 05.05.0800 Adaptada",""]
[null,null,"",null,null,null,null,""]
[null,null,"SF-00007","Servente com Encargos Complementares","h",0.7,"SCO/RJ - SC 05.05.0800",13.167000000000002,"Sinapi 88316",null,null,{"$f":"ROUND(H35*F35,2)","v":9.2200000000000006},{"$f":"SUM(J35:L35)","v":9.2200000000000006}]
[null,null,"",null,null,null,null,""]
["SF-00008","Demolição de fechamento ou divisória em gesso acartonado","",null,"m2",null,"Sinapi 97638",""]
[null,null,"",null,null,null,null,""]
[null,null,"SF-00008","Servente com Encargos Complementares","h",0.1186,"Sinapi 97638",13.167000000000002,"Sinapi 88316",null,null,{"$f":"ROUNDUP(H39*F39,2)","v":1.57},{"$f":"SUM(J39:L40)","v":4.6399999999999997}]
[null,null,"SF-00008","Servente com Encargos Complementares","h",0.2329,"Sinapi 97638",13.167000000000002,"Sinapi 88316",null,null,{"$f":"ROUND(H40*F40,2)","v":3.07}]
[null,null,"",null,null,null,null,""]
["SF-00009","Demolição de forro de gesso","",null,"m2",null,"Sinapi 97641",""]
[null,null,"",null,null,null,null,""]
[null,null,"SF-00009","Gesseiro com encargos complementares","h",7.1300000000000002E-2,"Sinapi 97641",18.009,"Sinapi 88269",null,null,{"$f":"ROUNDUP(H44*F44,2)","v":1.29},{"$f":"SUM(J44:L45)","v":3.14}]
[null,null,"SF-00009","Servente com Encargos Complementares","h",0.1401,"Sinapi 97641",13.167000000000002,"Sinapi 88316",null,null,{"$f":"ROUNDUP(H45*F45,2)","v":1.85}]
[null,null,"",null,null,null,null,""]
["SF-00010","Demolição de infraestrutura elétrica (eletrodutos, eletrocalhas, cabos)","",null,"m",null,"Sinapi 97661 Adaptada",""]
[null,null,"",null,null,null,null,""]
[null,null,"SF-00010","Eletricista com encargos complementares","h",{"$f":"0.0096*5","v":4.7999999999999994E-2},"Sinapi 97661 Adaptada",18.297000000000001,"Sinapi 88264",null,null,{"$f":"ROUND(H49*F49,2)","v":0.88},{"$f":"SUM(J49:L50)","v":2.12}]
[null,null,"SF-00010","Servente com Encargos Complementares","h",{"$f":"0.0188*5","v":9.4E-2},"Sinapi 97661 Adaptada",13.167000000000002,"Sinapi 88316",null,null,{"$f":"ROUND(H50*F50,2)","v":1.24}]
[null,null,"",null,null,null,null,""]
["SF-00011","Demolição de revestimento cerâmico, granito, mármore ou granitina","",null,"m2",null,"Sinapi 97634",""]
[null,null,"",null,null,null,null,""]
[null,null,"SF-00011","Martelete ou rompedor pneumático manual, 28 kg, com silenciador - CHP diurno. AF_07/2016","chp",6.9900000000000004E-2,"Sinapi 97634",{"$f":"OFFSET(INDEX('Composições Auxiliares'!A:L,MATCH(D54,'Composições Auxiliares'!A:A,0),12),2,0)","v":16.420000000000002},"Sinapi 5795",{"$f":"ROUNDDOWN(H54*F54,2)","v":1.1399999999999999},null,null,{"$f":"SUM(J54:L57)","v":7.72}]
[null,null,"SF-00011","Martelete ou rompedor pneumático manual, 28 kg, com silenciador - CHI diurno. AF_07/2016","chi",4.82E-2,"Sinapi 97634",{"$f":"OFFSET(INDEX('Composições Auxiliares'!A:L,MATCH(D55,'Composições Auxiliares'!A:A,0),12),2,0)","v":15.459999999999999},"Sinapi 5952",{"$f":"ROUND(H55*F55,2)","v":0.75}]
[null,null,"SF-00011","Azulejista ou ladrilhista com encargos complementares","h",0.1055,"Sinapi 97634",18.045000000000002,"Sinapi 88256",null,null,{"$f":"ROUNDUP(H56*F56,2)","v":1.91}]
[null,null,"SF-00011","Servente com Encargos Complementares","h",0.29720000000000002,"Sinapi 97634",13.167000000000002,"Sinapi 88316",null,null,{"$f":"ROUNDUP(H57*F57,2)","v":3.92}]
[null,null,"",null,null,null,null,""]
["SF-00012","Demolição de revestimento em argamassa","",null,"m2",null,"Sinapi 97631",""]
[null,null,"",null,null,null,null,""]
[null,null,"SF-00012","Pedreiro com Encargos Complementares","h",3.7400000000000003E-2,"Sinapi 97631",18.117000000000001,"Sinapi 88309",null,null,{"$f":"ROUND(H61*F61,2)","v":0.68},{"$f":"SUM(J61:L62)","v":2.0699999999999998}]
[null,null,"SF-00012","Servente com Encargos Complementares","h",0.1053,"Sinapi 97631",13.167000000000002,"Sinapi 88316",null,null,{"$f":"ROUND(H62*F62,2)","v":1.39}]
[null,null,"",null,null,null,null,""]
["SF-00013","Demolição de tubulação hidrossanitária embutida com conexões e acessórios","",null,"m",null,"Sinapi 97662",""]
[null,null,"",null,null,null,null,""]
[null,null,"SF-00013","Encanador ou Bombeiro Hidráulico com Encargos Complementares","h",7.1000000000000004E-3,"Sinapi 97662",18.081,"Sinapi 88267",null,null,{"$f":"ROUND(H66*F66,2)","v":0.13},{"$f":"SUM(J66:L67)","v":0.31}]
[null,null,"SF-00013","Servente com Encargos Complementares","h",1.4E-2,"Sinapi 97662",13.167000000000002,"Sinapi 88316",null,null,{"$f":"ROUND(H67*F67,2)","v":0.18}]
[null,null,"",null,null,null,null,""]
["SF-00014","Demolição em concreto armado","",null,"m3",null,"Sinapi 97627",""]
[null,null,"",null,null,null,null,""]
[null,null,"SF-00014","Martelete ou rompedor pneumático manual, 28 kg, com silenciador - CHP diurno. AF_07/2016","chp",3.2467999999999999,"Sinapi 97627",{"$f":"OFFSET(INDEX('Composições Auxiliares'!A:L,MATCH(D71,'Composições Auxiliares'!A:A,0),12),2,0)","v":16.420000000000002},"Sinapi 5795",{"$f":"ROUNDDOWN(H71*F71,2)","v":53.31},null,null,{"$f":"SUM(J71:L75)","v":167.94}]
[null,null,{"$f":"IF(AND(D72<>\"\",A70=\"\"),C71,IF(D72<>\"\",A70,\"\"))","v":"SF-00014"},"Martelete ou rompedor pneumático manual, 28 kg, com silenciador - CHI diurno. AF_07/2016","chi",0.92020000000000002,"Sinapi 97627",{"$f":"OFFSET(INDEX('Composições Auxiliares'!A:L,MATCH(D72,'Composições Auxiliares'!A:A,0),12),2,0)","v":15.459999999999999},"Sinapi 5952",{"$f":"ROUNDDOWN(H72*F72,2)","v":14.22}]
[null,null,"SF-00014","Cabo de aco galvanizado, diametro 9,53 mm (3/8\"), com alma de fibra 6 x 25 f  (coletado caixa)","kg",0.28349999999999997,"Sinapi 97627",7.9649999999999999,"Sinapi 42655",null,{"$f":"ROUND(H73*F73,2)","v":2.2599999999999998}]
[null,null,"SF-00014","Pedreiro com Encargos Complementares","h",0.63660000000000005,"Sinapi 97627",18.117000000000001,"Sinapi 88309",null,null,{"$f":"ROUND(H74*F74,2)","v":11.53}]
[null,null,"SF-00014","Servente com Encargos Complementares","h",6.5785,"Sinapi 97627",13.167000000000002,"Sinapi 88316",null,null,86.62]
[null,null,"",null,null,null,null,""]
["SF-00016","Remoção de armários","",null,"m2",null,"SCO/RJ - SC 05.05.1750 Adaptada",""]
[null,null,"",null,null,null,null,""]
[null,null,"SF-00016","Carpinteiro de esquadria com encargos complementares","h",0.35,"SCO/RJ - SC 05.05.1750",18.045000000000002,"Sinapi 88261",null,null,{"$f":"ROUND(H79*F79,2)","v":6.32},{"$f":"SUM(J79:L80)","v":10.93}]
[null,null,"SF-00016","Servente com Encargos Complementares","h",0.35,"SCO/RJ - SC 05.05.1750",13.167000000000002,"Sinapi 88316",null,null,{"$f":"ROUND(H80*F80,2)","v":4.6100000000000003}]
[null,null,"",null,null,null,null,""]
["SF-00017","Remoção de bancadas","",null,"m2",null,"Orse 8387 Adaptada",""]
[null,null,"",null,null,null,null,""]
[null,null,"SF-00017","Pedreiro com Encargos Complementares","h",0.15,"Orse 8387",18.117000000000001,"Sinapi 88309",null,null,{"$f":"ROUND(H84*F84,2)","v":2.72},{"$f":"SUM(J84:L85)","v":15.89}]
[null,null,"SF-00017","Servente com Encargos Complementares","h",1,"Orse 8387",13.167000000000002,"Sinapi 88316",null,null,{"$f":"ROUND(H85*F85,2)","v":13.17}]
[null,null,"",null,null,null,null,""]
["SF-00018","Remoção de batentes de madeira","",null,"un",null,"Sinapi 97644 Adaptada",""]
[null,null,"",null,null,null,null,""]
[null,null,"SF-00018","Pedreiro com Encargos Complementares","h",{"$f":"0.1315*0.7","v":9.2049999999999993E-2},"Sinapi 97644 Adaptada",18.117000000000001,"Sinapi 88309",null,null,{"$f":"ROUND(H89*F89,2)","v":1.67},{"$f":"SUM(J89:L90)","v":4.05}]
[null,null,"SF-00018","Servente com Encargos Complementares","h",{"$f":"0.2582*0.7","v":0.18073999999999998},"Sinapi 97644 Adaptada",13.167000000000002,"Sinapi 88316",null,null,{"$f":"ROUND(H90*F90,2)","v":2.38}]
[null,null,"",null,null,null,null,""]
["SF-00019","Remoção de canaleta em alumínio","",null,"m",null,"Orse 010276 Adaptada",""]
[null,null,"",null,null,null,null,""]
[null,null,"SF-00019","Eletricista com encargos complementares","h",{"$f":"0.75*0.1","v":7.5000000000000011E-2},"Orse 010276 Adaptada",18.297000000000001,"Sinapi 88264",null,null,{"$f":"ROUND(H94*F94,2)","v":1.37},{"$f":"SUM(J94:L95)","v":3.34}]
[null,null,"SF-00019","Servente com Encargos Complementares","h",{"$f":"0.75*0.2","v":0.15000000000000002},"Orse 010276 Adaptada",13.167000000000002,"Sinapi 88316",null,null,{"$f":"ROUNDDOWN(H95*F95,2)","v":1.97}]
[null,null,"",null,null,null,null,""]
["SF-00020","Remoção de carpete","",null,"m2",null,"Pini 02.102.000043.SER Adaptada",""]
[null,null,"",null,null,null,null,""]
[null,null,"SF-00020","Pedreiro com Encargos Complementares","h",0.01,"Pini 02.102.000043.SER",18.117000000000001,"Sinapi 88309",null,null,{"$f":"ROUND(H99*F99,2)","v":0.18},{"$f":"SUM(J99:L100)","v":1.49}]
[null,null,"SF-00020","Servente com Encargos Complementares","h",0.1,"Pini 02.102.000043.SER",13.167000000000002,"Sinapi 88316",null,null,{"$f":"ROUNDDOWN(H100*F100,2)","v":1.31}]
[null,null,"",null,null,null,null,""]
["SF-00021","Remoção de cortinas","",null,"m",null,"SBC 022086",""]
[null,null,"",null,null,null,null,""]
[null,null,"SF-00021","Ajudante especializado com encargos complementares","h",0.17,"SBC 022086",15.795000000000002,"Sinapi 88243",null,null,{"$f":"ROUNDDOWN(H104*F104,2)","v":2.68},{"$f":"SUM(J104:L104)","v":2.68}]
[null,null,"",null,null,null,null,""]
["SF-00022","Remoção de difusores, grelhas e acessórios de climatização","",null,"un",null,"Orse 08857 Adaptada",""]
[null,null,"",null,null,null,null,""]
[null,null,"SF-00022","Ajudante de operação em geral com encargos complementares","h",0.6,"Orse 08857",14.103,"Sinapi 88241",null,null,{"$f":"ROUND(H108*F108,2)","v":8.4600000000000009},{"$f":"SUM(J108:L109)","v":16.36}]
[null,null,"SF-00022","Servente com Encargos Complementares","h",0.6,"Orse 08857",13.167000000000002,"Sinapi 88316",null,null,{"$f":"ROUND(H109*F109,2)","v":7.9}]
[null,null,"",null,null,null,null,""]
["SF-00023","Remoção de divisória de mármore ou granito","",null,"m2",null,"Seinfra C1051 Adaptada",""]
[null,null,"",null,null,null,null,""]
[null,null,"SF-00023","Marmorista/graniteiro com encargos complementares","h",0.6,"Seinfra C1051",14.949,"Sinapi 88274",null,null,{"$f":"ROUND(H113*F113,2)","v":8.9700000000000006},{"$f":"SUM(J113:L114)","v":24.770000000000003}]
[null,null,"SF-00023","Servente com Encargos Complementares","h",1.2,"Seinfra C1051",13.167000000000002,"Sinapi 88316",null,null,{"$f":"ROUND(H114*F114,2)","v":15.8}]
[null,null,"",null,null,null,null,""]
["SF-00024","Remoção de divisórias de MDF e gesso acartonado","",null,"m2",null,"Sinapi 72178",""]
[null,null,"",null,null,null,null,""]
[null,null,"SF-00024","Carpinteiro de esquadria com encargos complementares","h",1.2,"Sinapi 72178",18.045000000000002,"Sinapi 88261",null,null,{"$f":"ROUND(H118*F118,2)","v":21.65},{"$f":"SUM(J118:L118)","v":21.65}]
[null,null,"",null,null,null,null,""]
["SF-00025","Remoção de dutos/tubulações","",null,"m",null,"Seinfra C3389 Adaptada",""]
[null,null,"",null,null,null,null,""]
[null,null,"SF-00025","Encanador ou Bombeiro Hidráulico com Encargos Complementares","h",0.17499999999999999,"Seinfra C3389",18.081,"Sinapi 88267",null,null,{"$f":"ROUNDUP(H122*F122,2)","v":3.17},{"$f":"SUM(J122:L123)","v":7.12}]
[null,null,"SF-00025","Servente com Encargos Complementares","h",0.3,"Seinfra C3389",13.167000000000002,"Sinapi 88316",null,null,{"$f":"ROUND(H123*F123,2)","v":3.95}]
[null,null,"",null,null,null,null,""]
["SF-00026","Remoção de esquadrias metálicas","",null,"m2",null,"Pini 02.102.000031.SER Adaptada",""]
[null,null,"",null,null,null,null,""]
[null,null,"SF-00026","Pedreiro com Encargos Complementares","h",0.05,"Pini 02.102.000031.SER",18.117000000000001,"Sinapi 88309",null,null,{"$f":"ROUND(H127*F127,2)","v":0.91},{"$f":"SUM(J127:L128)","v":7.5}]
[null,null,"SF-00026","Servente com Encargos Complementares","h",0.5,"Pini 02.102.000031.SER",13.167000000000002,"Sinapi 88316",null,null,{"$f":"ROUNDUP(H128*F128,2)","v":6.59}]
[null,null,"",null,null,null,null,""]
["SF-00027","Remoção de exaustor","",null,"un",null,"Orse 11102 Adaptada",""]
[null,null,"",null,null,null,null,""]
[null,null,"SF-00027","Pedreiro com Encargos Complementares","h",0.5,"Orse 11102 Adaptada",18.117000000000001,"Sinapi 88309",null,null,{"$f":"ROUND(H132*F132,2)","v":9.06},{"$f":"SUM(J132:L133)","v":15.65}]
[null,null,"SF-00027","Servente com Encargos Complementares","h",0.5,"Orse 11102 Adaptada",13.167000000000002,"Sinapi 88316",null,null,{"$f":"ROUNDUP(H133*F133,2)","v":6.59}]
[null,null,"",null,null,null,null,""]
["SF-00028","Remoção de ferragens de porta","",null,"un",null,"Orse 04859 Adaptada",""]
[null,null,{"$f":"IF(AND(D136<>\"\",A134=\"\"),C135,IF(D136<>\"\",A134,\"\"))","v":""},null,null,null,null,""]
[null,null,"SF-00028","Carpinteiro de esquadria com encargos complementares","h",{"$f":"0.25","v":0.25},"Orse 04859",18.045000000000002,"Sinapi 88261",null,null,{"$f":"ROUND(H137*F137,2)","v":4.51},{"$f":"SUM(J137:L137)","v":4.51}]
[null,null,"",null,null,null,null,""]
["SF-00029","Remoção de folha de porta","",null,"un",null,"Sinapi 97644",""]
[null,null,"",null,null,null,null,""]
[null,null,"SF-00029","Pedreiro com Encargos Complementares","h",0.13150000000000001,"Sinapi 97644",18.117000000000001,"Sinapi 88309",null,null,{"$f":"ROUNDUP(H141*F141,2)","v":2.3899999999999997},{"$f":"SUM(J141:L142)","v":5.7899999999999991}]
[null,null,"SF-00029","Servente com Encargos Complementares","h",0.25819999999999999,"Sinapi 97644",13.167000000000002,"Sinapi 88316",null,null,{"$f":"ROUND(H142*F142,2)","v":3.4}]
[null,null,"",null,null,null,null,""]
["SF-00030","Remoção de laminado melamínico (LDAP), em PVC ou vinílico","",null,"m2",null,"Pini 02.102.000044.SER Adaptada",""]
[null,null,"",null,null,null,null,""]
[null,null,"SF-00030","Pedreiro com Encargos Complementares","h",0.09,"Pini 02.102.000044.SER",18.117000000000001,"Sinapi 88309",null,null,{"$f":"ROUND(H146*F146,2)","v":1.63},{"$f":"SUM(J146:L147)","v":13.48}]
[null,null,"SF-00030","Servente com Encargos Complementares","h",0.9,"Pini 02.102.000044.SER",13.167000000000002,"Sinapi 88316",null,null,{"$f":"ROUND(H147*F147,2)","v":11.85}]
[null,null,"",null,null,null,null,""]
["SF-00031","Remoção de louças","",null,"un",null,"Sinapi 97663",""]
[null,null,"",null,null,null,null,""]
[null,null,"SF-00031","Encanador ou Bombeiro Hidráulico com Encargos Complementares","h",0.17549999999999999,"Sinapi 97663",18.081,"Sinapi 88267",null,null,{"$f":"ROUNDUP(H151*F151,2)","v":3.1799999999999997},{"$f":"SUM(J151:L152)","v":7.72}]
[null,null,"SF-00031","Servente com Encargos Complementares","h",0.3448,"Sinapi 97663",13.167000000000002,"Sinapi 88316",null,null,{"$f":"ROUND(H152*F152,2)","v":4.54}]
[null,null,"",null,null,null,null,""]
["SF-00032","Remoção de luminária","",null,"un",null,"Sinapi 97665 Adaptada",""]
[null,null,"",null,null,null,null,""]
[null,null,"SF-00032","Eletricista com encargos complementares","h",{"$f":"0.0183*5","v":9.1499999999999998E-2},"Sinapi 97665 Adaptada",18.297000000000001,"Sinapi 88264",null,null,{"$f":"ROUND(H156*F156,2)","v":1.67},{"$f":"SUM(J156:L157)","v":4.0399999999999991}]
[null,null,"SF-00032","Servente com Encargos Complementares","h",{"$f":"0.0359*5","v":0.17949999999999999},"Sinapi 97665 Adaptada",13.167000000000002,"Sinapi 88316",null,null,{"$f":"ROUNDUP(H157*F157,2)","v":2.3699999999999997}]
[null,null,"",null,null,null,null,""]
[null,null,"","Obs. Remoção com reaproveitamento",null,null,null,""]
[null,null,"",null,null,null,null,""]
["SF-00033","Remoção de metais e acessórios","",null,"un",null,"Sinapi 97666",""]
[null,null,"",null,null,null,null,""]
[null,null,"SF-00033","Encanador ou Bombeiro Hidráulico com Encargos Complementares","h",0.128,"Sinapi 97666",18.081,"Sinapi 88267",null,null,{"$f":"ROUND(H163*F163,2)","v":2.31},{"$f":"SUM(J163:L164)","v":5.62}]
[null,null,"SF-00033","Servente com Encargos Complementares","h",0.25140000000000001,"Sinapi 97666",13.167000000000002,"Sinapi 88316",null,null,{"$f":"ROUND(H164*F164,2)","v":3.31}]
[null,null,"",null,null,null,null,""]
["SF-00034","Remoção de painéis de vidro temperado","",null,"m2",null,"Orse 4715 Adaptada",""]
[null,null,"",null,null,null,null,""]
[null,null,"SF-00034","Servente com Encargos Complementares","h",0.35,"Orse 4715",13.167000000000002,"Sinapi 88316",null,null,{"$f":"ROUND(H168*F168,2)","v":4.6100000000000003},{"$f":"SUM(J168:L169)","v":10.96}]
[null,null,"SF-00034","Pedreiro com Encargos Complementares","h",0.35,"Orse 4715",18.117000000000001,"Sinapi 88309",null,null,{"$f":"ROUNDUP(H169*F169,2)","v":6.35}]
[null,null,"",null,null,null,null,""]
["SF-00036","Remoção de persianas","",null,"m",null,"Senado Federal",""]
[null,null,"",null,null,null,null,""]
[null,null,"SF-00036","Ajudante especializado com encargos complementares","h",{"$f":"1/6","v":0.16666666666666666},"Senado Federal",15.795000000000002,"Sinapi 88243",null,null,{"$f":"ROUNDUP(H173*F173,2)","v":2.6399999999999997},{"$f":"SUM(J173:L173)","v":2.6399999999999997}]
[null,null,"",null,null,null,null,""]
["SF-00037","Remoção de pintura ou textura","",null,"m2",null,"Orse 7725 Adaptada",""]
[null,null,"",null,null,null,null,""]
[null,null,"SF-00037","Servente com Encargos Complementares","h",0.4,"Orse 7725",13.167000000000002,"Sinapi 88316",null,null,{"$f":"ROUND(H177*F177,2)","v":5.27},{"$f":"SUM(J177:L177)","v":5.27}]
[null,null,"",null,null,null,null,""]
["SF-00038","Remoção de placas de forro","",null,"m2",null,"Sinapi 97640 Adaptada",""]
[null,null,"",null,null,null,null,""]
[null,null,"SF-00038","Montador de estrutura metálica com encargos complementares","h",{"$f":"0.0258*3","v":7.7399999999999997E-2},"Sinapi 97640 Adaptada",14.301,"Sinapi 88278",null,null,{"$f":"ROUND(H181*F181,2)","v":1.1100000000000001},{"$f":"SUM(J181:L182)","v":3.12}]
[null,null,"SF-00038","Servente com Encargos Complementares","h",{"$f":"0.0507*3","v":0.15210000000000001},"Sinapi 97640 Adaptada",13.167000000000002,"Sinapi 88316",null,null,{"$f":"ROUNDUP(H182*F182,2)","v":2.0099999999999998}]
[null,null,"",null,null,null,null,""]
[null,null,"","Obs: remoção com reaproveitamento",null,null,null,""]
[null,null,"",null,null,null,null,""]
["SF-00039","Remoção de quadros de elétricos ou de telecomunicações","",null,"un",null,"Senado Federal",""]
[null,null,"",null,null,null,null,""]
[null,null,"SF-00039","Auxiliar de eletricista com encargos complementares","h",0.5,"Senado Federal",14.048999999999999,"Sinapi 88247",null,null,{"$f":"ROUNDUP(H188*F188,2)","v":7.0299999999999994},{"$f":"SUM(J188:L191)","v":47.47}]
[null,null,"SF-00039","Eletricista com encargos complementares","h",0.5,"Senado Federal",18.297000000000001,"Sinapi 88264",null,null,{"$f":"ROUND(H189*F189,2)","v":9.15}]
[null,null,"SF-00039","Pedreiro com Encargos Complementares","h",1,"Orse 07224",18.117000000000001,"Sinapi 88309",null,null,{"$f":"ROUND(H190*F190,2)","v":18.12}]
[null,null,"SF-00039","Servente com Encargos Complementares","h",1,"Orse 07224",13.167000000000002,"Sinapi 88316",null,null,{"$f":"ROUND(H191*F191,2)","v":13.17}]
[null,null,"",null,null,null,null,""]
["SF-00040","Remoção de revestimento acústico","",null,"m2",null,"Senado Federal",""]
[null,null,"",null,null,null,null,""]
[null,null,"SF-00040","Servente com Encargos Complementares","h",0.2,"Senado Federal",13.167000000000002,"Sinapi 88316",null,null,{"$f":"ROUNDUP(H195*F195,2)","v":2.6399999999999997},{"$f":"SUM(J195:L195)","v":2.6399999999999997}]
[null,null,{"$f":"IF(AND(D196<>\"\",A194=\"\"),C195,IF(D196<>\"\",A194,\"\"))","v":""},null,null,null,null,""]
["SF-00041","Remoção de rodapé de mármore ou granito","",null,"m",null,"Orse 4858 Adaptada",""]
[null,null,"",null,null,null,null,""]
[null,null,"SF-00041","Servente com Encargos Complementares","h",0.437,"Orse 4858",13.167000000000002,"Sinapi 88316",null,null,{"$f":"ROUND(H199*F199,2)","v":5.75},{"$f":"SUM(J199:L199)","v":5.75}]
[null,null,"",null,null,null,null,""]
["SF-00042","Remoção de rodapés de madeira","",null,"m2",null,"Orse 10235 Adaptada",""]
[null,null,"",null,null,null,null,""]
[null,null,"SF-00042","Carpinteiro de formas com encargos complementares","h",0.25,"Orse 10235",18.009,"Sinapi 88262",null,null,{"$f":"ROUND(H203*F203,2)","v":4.5},{"$f":"SUM(J203:L204)","v":4.83}]
[null,null,"SF-00042","Servente com Encargos Complementares","h",2.5000000000000001E-2,"Orse 10235",13.167000000000002,"Sinapi 88316",null,null,{"$f":"ROUND(H204*F204,2)","v":0.33}]
[null,null,"",null,null,null,null,""]
["SF-00043","Remoção de soleira de mármore ou granito","",null,"m",null,"Pini 02.102.000042.SER Adaptada",""]
[null,null,"",null,null,null,null,""]
[null,null,"SF-00043","Servente com Encargos Complementares","h",0.55000000000000004,"Pini 02.102.000042.SER",13.167000000000002,"Sinapi 88316",null,null,{"$f":"ROUNDUP(H208*F208,2)","v":7.25},{"$f":"SUM(J208:L208)","v":7.25}]
[null,null,"",null,null,null,null,""]
["SF-00044","Remoção de split/fancolete (equipamento unitário)","",null,"un",null,"Senado Federal",""]
[null,null,"",null,null,null,null,""]
[null,null,"SF-00044","Montador eletromecânico com encargos complementares","h",1,"Senado Federal",18.971999999999998,"Sinapi 88279",null,null,{"$f":"ROUND(H212*F212,2)","v":18.97},{"$f":"SUM(J212:L213)","v":33.07}]
[null,null,"SF-00044","Ajudante de operação em geral com encargos complementares","h",1,"Senado Federal",14.103,"Sinapi 88241",null,null,{"$f":"ROUND(H213*F213,2)","v":14.1}]
[null,null,"",null,null,null,null,""]
["SF-00045","Remoção de vidro comum","",null,"m2",null,"Sinapi 85421",""]
[null,null,"",null,null,null,null,""]
[null,null,"SF-00045","Servente com Encargos Complementares","h",0.2,"Sinapi 85421",13.167000000000002,"Sinapi 88316",null,null,{"$f":"ROUNDUP(H217*F217,2)","v":2.6399999999999997},{"$f":"SUM(J217:L218)","v":11.02}]
[null,null,"SF-00045","Vidraceiro com encargos complementares","h",0.5,"Sinapi 85421",16.758000000000003,"Sinapi 88325",null,null,{"$f":"ROUND(H218*F218,2)","v":8.3800000000000008}]
[null,null,"",null,null,null,null,""]
["SF-00046","Retirada de entulhos","",null,"m3",null,"Orse 0026 Adaptada",""]
[null,null,"",null,null,null,null,""]
[null,null,"SF-00046","Servente com Encargos Complementares","h",1,"Orse 0026",13.167000000000002,"Sinapi 88316",null,null,{"$f":"ROUND(H222*F222,2)","v":13.17},{"$f":"SUM(J222:L222)","v":13.17}]
[null,null,"",null,null,null,null,""]
["SF-00057","Isolamento de obra com tela plástica com malha de 5mm e estrutura de madeira pontaleteada","",null,"m2",null,"Sinapi 85424",""]
[null,null,"",null,null,null,null,""]
[null,null,"SF-00057","Ajudante de carpinteiro com encargos complementares","h",0.53,"Sinapi 85424",15.065999999999999,"Sinapi 88239",null,null,{"$f":"ROUND(H226*F226,2)","v":7.98},{"$f":"SUM(J226:L231)","v":19.05}]
[null,null,"SF-00057","Carpinteiro de formas com encargos complementares","h",0.44,"Sinapi 85424",18.009,"Sinapi 88262",null,null,{"$f":"ROUND(H227*F227,2)","v":7.92}]
[null,null,"SF-00057","Peca de madeira nativa / regional 7,5 x 7,5cm (3x3) nao aparelhada (p/forma)","m",0.06,"Sinapi 85424",4.6800000000000006,"Sinapi 4491",null,{"$f":"ROUND(H228*F228,2)","v":0.28000000000000003}]
[null,null,"SF-00057","Peca de madeira 3a qualidade 2,5 x 10cm nao aparelhada","m",0.2,"Sinapi 85424",2.403,"Sinapi 4509",null,{"$f":"ROUND(H229*F229,2)","v":0.48}]
[null,null,"SF-00057","Prego de aco polido com cabeca 18 x 27 (2 1/2 x 10)","kg",0.01,"Sinapi 85424",9.3149999999999995,"Sinapi 5061",null,{"$f":"ROUND(H230*F230,2)","v":0.09}]
[null,null,"SF-00057","Tela fachadeira em polietileno, rolo de 3 x 100 m (L x C), cor branca, sem logomarca - para protecao de obras","m2",1.1000000000000001,"Sinapi 85424",2.097,"Sinapi 7170",null,{"$f":"ROUNDDOWN(H231*F231,2)","v":2.2999999999999998}]
[null,null,"",null,null,null,null,""]
["SF-00070","Tapume","",null,"m2",null,"Sinapi 74220/1",""]
[null,null,"",null,null,null,null,""]
[null,null,"SF-00070","Carpinteiro de formas com encargos complementares","h",0.8,"Sinapi 74220/1",18.009,"Sinapi 88262",null,null,{"$f":"ROUND(H235*F235,2)","v":14.41},{"$f":"SUM(J235:L242)","v":48.779999999999994}]
[null,null,"SF-00070","Pintor com encargos complementares","h",0.3,"Sinapi 74220/1",18.045000000000002,"Sinapi 88310",null,null,{"$f":"ROUNDUP(H236*F236,2)","v":5.42}]
[null,null,"SF-00070","Servente com Encargos Complementares","h",0.95,"Sinapi 74220/1",13.167000000000002,"Sinapi 88316",null,null,{"$f":"ROUND(H237*F237,2)","v":12.51}]
[null,null,"SF-00070","Cal hidratada CH-I para argamassas","kg",0.6,"Sinapi 74220/1",4.5449999999999999,"Sinapi 1106",null,{"$f":"ROUND(H238*F238,2)","v":2.73}]
[null,null,"SF-00070","Chapa de madeira compensada resinada para forma de concreto, de *2,2 x 1,1* m, E = 6 mm","un",0.22727269999999999,"Sinapi 74220/1",20.349,"Sinapi 1351",null,{"$f":"ROUNDUP(H239*F239,2)","v":4.63}]
[null,null,"SF-00070","Peca de madeira nativa / regional 7,5 x 7,5cm (3x3) nao aparelhada (p/forma)","m",1.58,"Sinapi 74220/1",4.6800000000000006,"Sinapi 4491",null,{"$f":"ROUNDUP(H240*F240,2)","v":7.3999999999999995}]
[null,null,"SF-00070","Prego de aco polido com cabeca 18 x 27 (2 1/2 x 10)","kg",0.15,"Sinapi 74220/1",9.3149999999999995,"Sinapi 5061",null,{"$f":"ROUND(H241*F241,2)","v":1.4}]
[null,null,"SF-00070","Óleo de linhaça","l",2.1999999999999999E-2,"Sinapi 74220/1",12.609,"Sinapi 5333",null,{"$f":"ROUND(H242*F242,2)","v":0.28000000000000003}]
[null,null,"",null,null,null,null,""]
["SF-00073","Limpeza final de obra","",null,"m2",null,"ORSE 02450 Adaptada",""]
[null,null,"",null,null,null,null,""]
[null,null,"SF-00073","Servente com Encargos Complementares","h",0.1,"ORSE 02450",13.167000000000002,"Sinapi 88316",null,null,{"$f":"ROUNDDOWN(+F246*H246,2)","v":1.31},{"$f":"SUM(J246:L248)","v":1.82}]
[null,null,"SF-00073","Sabão em pó","m",5.0000000000000001E-3,"ORSE 02450",7.0830000000000002,"Sinapi 00016",null,{"$f":"ROUND(H247*F247,2)","v":0.04}]
[null,null,"SF-00073","Vassoura","un",0.05,"ORSE 02450",9.4320000000000004,"Sinapi 38400",null,{"$f":"ROUND(H248*F248,2)","v":0.47}]
[null,null,"",null,null,null,null,""]
["SF-00074","Abertura/fechamento rasgo em alvenaria","",null,"m",null,"Sinapi 90447 + Sinapi 90466",""]
[null,null,"",null,null,null,null,""]
[null,null,"SF-00074","Auxiliar de eletricista com encargos complementares","h",3.4000000000000002E-2,"Sinapi 90447",14.048999999999999,"Sinapi 88247",null,null,{"$f":"ROUND(H252*F252,2)","v":0.48},{"$f":"SUM(J252:L256)","v":13.37}]
[null,null,"SF-00074","Eletricista com encargos complementares","h",0.216,"Sinapi 90447",18.297000000000001,"Sinapi 88264",null,null,{"$f":"ROUND(H253*F253,2)","v":3.95}]
[null,null,"SF-00074","Auxiliar de encanador ou bombeiro hidráulico com encargos complementares","h",5.5E-2,"Sinapi 90466",13.977,"Sinapi 88248",null,null,{"$f":"ROUND(H254*F254,2)","v":0.77}]
[null,null,"SF-00074","Encanador ou Bombeiro Hidráulico com Encargos Complementares","h",0.39100000000000001,"Sinapi 90466",18.081,"Sinapi 88267",null,null,7.07]
[null,null,"SF-00074","Argamassa traço 1:3 (cimento e areia média), preparo manual. AF_08/2014","m3",3.0000000000000001E-3,"Sinapi 90466",{"$f":"OFFSET(INDEX('Composições Auxiliares'!A:L,MATCH(D256,'Composições Auxiliares'!A:A,0),12),2,0)","v":366.43999999999994},"Sinapi 88629",{"$f":"ROUND(H256*F256,2)","v":1.1000000000000001}]
[null,null,"",null,null,null,null,""]
["SF-00075","Furo em concreto de até 75mm de diâmetro","",null,"un",null,"Sinapi 90440",""]
[null,null,"",null,null,null,null,""]
[null,null,"SF-00075","Martelete ou rompedor pneumático manual, 28 kg, com silenciador - CHP diurno. AF_07/2016","chp",0.58699999999999997,"Sinapi 90440",{"$f":"OFFSET(INDEX('Composições Auxiliares'!A:L,MATCH(D260,'Composições Auxiliares'!A:A,0),12),2,0)","v":16.420000000000002},"Sinapi 5795",{"$f":"ROUND(H260*F260,2)","v":9.64},null,null,{"$f":"SUM(J260:L263)","v":67.62}]
[null,null,{"$f":"IF(AND(D261<>\"\",A259=\"\"),C260,IF(D261<>\"\",A259,\"\"))","v":"SF-00075"},"Martelete ou rompedor pneumático manual, 28 kg, com silenciador - CHI diurno. AF_07/2016","chi",1.29,"Sinapi 90440",{"$f":"OFFSET(INDEX('Composições Auxiliares'!A:L,MATCH(D261,'Composições Auxiliares'!A:A,0),12),2,0)","v":15.459999999999999},"Sinapi 5952",{"$f":"ROUND(H261*F261,2)","v":19.940000000000001}]
[null,null,"SF-00075","Auxiliar de encanador ou bombeiro hidráulico com encargos complementares","h",0.29299999999999998,"Sinapi 90440",13.977,"Sinapi 88248",null,null,{"$f":"ROUND(H262*F262,2)","v":4.0999999999999996}]
[null,null,"SF-00075","Encanador ou Bombeiro Hidráulico com Encargos Complementares","h",1.877,"Sinapi 90440",18.081,"Sinapi 88267",null,null,{"$f":"ROUND(H263*F263,2)","v":33.94}]
[null,null,"",null,null,null,null,""]
["SF-00076","Furo em concreto para diâmetros maiores que 75mm","",null,"un",null,"Sinapi 90441",""]
[null,null,"",null,null,null,null,""]
[null,null,"SF-00076","Martelete ou rompedor pneumático manual, 28 kg, com silenciador - CHP diurno. AF_07/2016","chp",0.75,"Sinapi 90441",{"$f":"OFFSET(INDEX('Composições Auxiliares'!A:L,MATCH(D267,'Composições Auxiliares'!A:A,0),12),2,0)","v":16.420000000000002},"Sinapi 5795",{"$f":"ROUND(H267*F267,2)","v":12.32},null,null,{"$f":"SUM(J267:L270)","v":86.360000000000014}]
[null,null,"SF-00076","Martelete ou rompedor pneumático manual, 28 kg, com silenciador - CHI diurno. AF_07/2016","chi",1.647,"Sinapi 90441",{"$f":"OFFSET(INDEX('Composições Auxiliares'!A:L,MATCH(D268,'Composições Auxiliares'!A:A,0),12),2,0)","v":15.459999999999999},"Sinapi 5952",{"$f":"ROUND(H268*F268,2)","v":25.46}]
[null,null,"SF-00076","Auxiliar de encanador ou bombeiro hidráulico com encargos complementares","h",0.375,"Sinapi 90441",13.977,"Sinapi 88248",null,null,{"$f":"ROUND(H269*F269,2)","v":5.24}]
[null,null,"SF-00076","Encanador ou Bombeiro Hidráulico com Encargos Complementares","h",2.3969999999999998,"Sinapi 90441",18.081,"Sinapi 88267",null,null,{"$f":"ROUND(H270*F270,2)","v":43.34}]
[null,null,"",null,null,null,null,""]
["SF-00077","Concreto virado em betoneira, Fck = 15 MPa","",null,"m3",null,"Sinapi 92873 + Sinapi 94963",""]
[null,null,"",null,null,null,null,""]
[null,null,"SF-00077","Carpinteiro de formas com encargos complementares","h",1.8460000000000001,"Sinapi 92873",18.009,"Sinapi 88262",null,null,{"$f":"ROUND(H274*F274,2)","v":33.24},{"$f":"SUM(J274:L285)","v":401.51}]
[null,null,"SF-00077","Pedreiro com Encargos Complementares","h",1.8460000000000001,"Sinapi 92873",18.117000000000001,"Sinapi 88309",null,null,33.44]
[null,null,"SF-00077","Servente com Encargos Complementares","h",{"$f":"5.538","v":5.5380000000000003},"Sinapi 92873",13.167000000000002,"Sinapi 88316",null,null,72.92]
[null,null,"SF-00077","Vibrador de imersão, diâmetro de ponteira 45mm, motor elétrico trifásico potência de 2 CV - CHP diurno. AF_06/2015","chp",0.67200000000000004,"Sinapi 92873",1.0080000000000002,"Sinapi 90586",null,{"$f":"ROUND(H277*F277,2)","v":0.68}]
[null,null,"SF-00077","Vibrador de imersão, diâmetro de ponteira 45mm, motor elétrico trifásico potência de 2 CV - CHI diurno. AF_06/2015","chi",1.1739999999999999,"Sinapi 92873",0.27,"Sinapi 90587",null,0.32]
[null,null,"SF-00077","Areia media - posto jazida/fornecedor (retirado na jazida, sem transporte)","m3",0.83599999999999997,"Sinapi 94963",79.875,"Sinapi 370",null,66.78]
[null,null,"SF-00077","Cimento Portland composto CP II-32","kg",273.06,"Sinapi 94963",0.36899999999999999,"Sinapi 1379",null,100.76]
[null,null,"SF-00077","Pedra britada n. 1 (9,5 a 19 mm) posto pedreira/fornecedor, sem frete","m3",0.57899999999999996,"Sinapi 94963",72.207000000000008,"Sinapi 4721",null,41.81]
[null,null,"SF-00077","Operador de betoneira estacionária/misturador com encargos complementares","h",1.47,"Sinapi 94963",13.617000000000001,"Sinapi 88377",null,null,{"$f":"ROUND(H282*F282,2)","v":20.02}]
[null,null,"SF-00077","Servente com Encargos Complementares","h",2.33,"Sinapi 94963",13.167000000000002,"Sinapi 88316",null,null,{"$f":"ROUND(H283*F283,2)","v":30.68}]
[null,null,"SF-00077","Betoneira capacidade nominal de 400 l, capacidade de mistura 310 l, motor elétrico trifásico potência de 2 HP, sem carregador - CHP diurno. AF_10/2014","chp",0.76,"Sinapi 94963",0.93600000000000005,"Sinapi 88830",null,{"$f":"ROUND(H284*F284,2)","v":0.71}]
[null,null,"SF-00077","Betoneira capacidade nominal de 400 l, capacidade de mistura 310 l, motor elétrico trifásico potência de 2 HP, sem carregador - CHI diurno. AF_10/2014","chi",0.71,"Sinapi 94963",0.20700000000000002,"Sinapi 88831",null,0.15]
[null,null,"",null,null,null,null,""]
["SF-00078","Concreto virado em betoneira, fck = 25MPa","",null,"m3",null,"Sinapi 92873 + Sinapi 94965",""]
[null,null,"",null,null,null,null,""]
[null,null,"SF-00078","Carpinteiro de formas com encargos complementares","h",1.8460000000000001,"Sinapi 92873",18.009,"Sinapi 88262",null,null,{"$f":"ROUND(H289*F289,2)","v":33.24},{"$f":"SUM(J289:L300)","v":428.38}]
[null,null,"SF-00078","Pedreiro com Encargos Complementares","h",1.8460000000000001,"Sinapi 92873",18.117000000000001,"Sinapi 88309",null,null,{"$f":"ROUND(H290*F290,2)","v":33.44}]
[null,null,"SF-00078","Servente com Encargos Complementares","h",{"$f":"5.538","v":5.5380000000000003},"Sinapi 92873",13.167000000000002,"Sinapi 88316",null,null,{"$f":"ROUND(H291*F291,2)","v":72.92}]
[null,null,"SF-00078","Vibrador de imersão, diâmetro de ponteira 45mm, motor elétrico trifásico potência de 2 CV - CHP diurno. AF_06/2015","chp",0.67200000000000004,"Sinapi 92873",1.0080000000000002,"Sinapi 90586",null,{"$f":"ROUND(H292*F292,2)","v":0.68}]
[null,null,"SF-00078","Vibrador de imersão, diâmetro de ponteira 45mm, motor elétrico trifásico potência de 2 CV - CHI diurno. AF_06/2015","chi",1.1739999999999999,"Sinapi 92873",0.27,"Sinapi 90587",null,{"$f":"ROUND(H293*F293,2)","v":0.32}]
[null,null,"SF-00078","Areia media - posto jazida/fornecedor (retirado na jazida, sem transporte)","m3",0.751,"Sinapi 94965",79.875,"Sinapi 370",null,{"$f":"ROUND(H294*F294,2)","v":59.99}]
[null,null,"SF-00078","Cimento Portland composto CP II-32","kg",362.66,"Sinapi 94965",0.36899999999999999,"Sinapi 1379",null,{"$f":"ROUND(H295*F295,2)","v":133.82}]
[null,null,"SF-00078","Pedra britada n. 1 (9,5 a 19 mm) posto pedreira/fornecedor, sem frete","m3",0.59299999999999997,"Sinapi 94965",72.207000000000008,"Sinapi 4721",null,{"$f":"ROUND(H296*F296,2)","v":42.82}]
[null,null,"SF-00078","Servente com Encargos Complementares","h",{"$f":"2.31","v":2.31},"Sinapi 94965",13.167000000000002,"Sinapi 88316",null,null,{"$f":"ROUND(H297*F297,2)","v":30.42}]
[null,null,"SF-00078","Operador de betoneira estacionária/misturador com encargos complementares","h",1.46,"Sinapi 94965",13.617000000000001,"Sinapi 88377",null,null,{"$f":"ROUND(H298*F298,2)","v":19.88}]
[null,null,"SF-00078","Betoneira capacidade nominal de 400 l, capacidade de mistura 310 l, motor elétrico trifásico potência de 2 HP, sem carregador - CHP diurno. AF_10/2014","chp",0.75,"Sinapi 94965",0.93600000000000005,"Sinapi 88830",null,{"$f":"ROUND(H299*F299,2)","v":0.7}]
[null,null,"SF-00078","Betoneira capacidade nominal de 400 l, capacidade de mistura 310 l, motor elétrico trifásico potência de 2 HP, sem carregador - CHI diurno. AF_10/2014","chi",0.71,"Sinapi 94965",0.20700000000000002,"Sinapi 88831",null,{"$f":"ROUND(H300*F300,2)","v":0.15}]
[null,null,"",null,null,null,null,""]
["SF-00079","Escoramento metálico ","",null,"m2",null,"Orse 07629 Adaptada",""]
[null,null,"",null,null,null,null,""]
[null,null,"SF-00079","Servente com Encargos Complementares","h",0.2,"Orse 07629",13.167000000000002,"Sinapi 88316",null,null,{"$f":"ROUNDUP(H304*F304,2)","v":2.6399999999999997},{"$f":"SUM(J304:L307)","v":18.25}]
[null,null,"SF-00079","Madeira Serrada Aparelhada De Macaranduba, Angelim Ou Equivalente Da Regiao","m3",{"$f":"1.1*0.0036","v":3.96E-3},"Orse 07629 Adaptada",2881.1610000000001,"Sinapi 3989",null,{"$f":"ROUND(H305*F305,2)","v":11.41}]
[null,null,"SF-00079","Locacao De Escora Metalica Telescopica, Com Altura Regulavel De *1,80* A *3,20* M, Com Capacidade De Carga De No Minimo 1000 Kgf (10 Kn), Incluso Tripe E Forcado","un",0.85,"Orse 07629",4.9410000000000007,"Sinapi 10749",null,{"$f":"ROUND(H306*F306,2)","v":4.2}]
[null,null,"",null,null,null,null,""]
["SF-00080","Estrutura metálica em aço ","",null,"kg",null,"SCO/RJ ET 25.05.0180 (B) Adaptada",""]
[null,null,"",null,null,null,null,""]
[null,null,"SF-00080","Acetileno, em garrafas de 9Kg","kg",0.01,"SCO/RJ ET 25.05.0180 (B)",28.125,"SCO/RJ ET 25.05.0180 (B)",null,{"$f":"ROUND(H310*F310,2)","v":0.28000000000000003},null,{"$f":"SUM(J310:L321)","v":13.01}]
[null,null,"SF-00080","Cantoneira de aco, com abas iguais, de: (2\"x3/8\")","kg",0.27,"SCO/RJ ET 25.05.0180 (B)",3.492,"SCO/RJ ET 25.05.0180 (B)",null,{"$f":"ROUNDUP(H311*F311,2)","v":0.95}]
[null,null,"SF-00080","Chapa de aco USI-SAC 350","kg",0.33,"SCO/RJ ET 25.05.0180 (B)",3.9960000000000004,"SCO/RJ ET 25.05.0180 (B)",null,1.32]
[null,null,"SF-00080","Eletrodo com diametro de 5mm (3/16\"), E-7018-6 G","kg",2.5000000000000001E-2,"SCO/RJ ET 25.05.0180 (B)",14.157,"SCO/RJ ET 25.05.0180 (B)",null,0.35]
[null,null,"SF-00080","Oxigenio, em garrafas de 9,3m3","m3",0.05,"SCO/RJ ET 25.05.0180 (B)",6.3,"SCO/RJ ET 25.05.0180 (B)",null,0.32]
[null,null,"SF-00080","Perfil \"H\" de aco carbono, padrao americano, de (6\"x6\")","kg",0.4,"SCO/RJ ET 25.05.0180 (B)",3.7800000000000002,"SCO/RJ ET 25.05.0180 (B)",null,1.51]
[null,null,"SF-00080","Montador de estrutura metálica com encargos complementares","h",0.4,"SCO/RJ ET 25.05.0180 (B)",14.301,"Sinapi 88278",null,null,{"$f":"ROUND(H316*F316,2)","v":5.72}]
[null,null,"SF-00080","Servente com Encargos Complementares","h",0.1,"SCO/RJ ET 25.05.0180 (B)",13.167000000000002,"Sinapi 88316",null,null,{"$f":"ROUNDDOWN(H317*F317,2)","v":1.31}]
[null,null,"SF-00080","Perda em perfil de aco carbono tipo \"H\", de 6\"x6\" - 5% - equivalente ao elementar MAT095450","kg",0.05,"SCO/RJ ET 25.05.0180 (B)",3.7800000000000002,"SCO/RJ ET 25.05.0180 (B)",null,0.19]
[null,null,"SF-00080","Pintura anti-oxido e tinta alquidica esmaltada","m2",0.05,"SCO/RJ ET 25.05.0180 (B)",13.275,"SCO/RJ ET 25.05.0180 (B)",null,{"$f":"ROUNDUP(H319*F319,2)","v":0.67}]
[null,null,"SF-00080","Retificador de solda eletrica de 430A","h",2.5000000000000001E-2,"SCO/RJ ET 25.05.0180 (B)",13.833,"SCO/RJ ET 25.05.0180 (B)",null,{"$f":"ROUNDDOWN(H320*F320,2)","v":0.34}]
[null,null,"SF-00080","Talha Guincho manual, com capacidade de 1,5t, modelo TUL-15, Tirfor ou similar-Custo Horario Corrido","h",0.5,"SCO/RJ ET 25.05.0180 (B)",8.1000000000000003E-2,"SCO/RJ ET 25.05.0180 (B)",null,{"$f":"ROUNDUP(H321*F321,2)","v":0.05}]
[null,null,"",null,null,null,null,""]
["SF-00081","Forma para estruturas de concreto ","",null,"m2",null,"Sinapi 92451",""]
[null,null,"",null,null,null,null,""]
[null,null,{"$f":"IF(AND(D325<>\"\",A323=\"\"),C324,IF(D325<>\"\",A323,\"\"))","v":"SF-00081"},"Desmoldante protetor para formas de madeira, de base oleosa emulsionada em agua","l",0.01,"Sinapi 92451",5.1570000000000009,"Sinapi 2692",null,{"$f":"ROUND(H325*F325,2)","v":0.05},null,{"$f":"SUM(J325:L331)","v":100.55000000000001}]
[null,null,"SF-00081","Tabua madeira 2a qualidade 2,5 x 20,0cm (1 x 8\") nao aparelhada","m",0.47399999999999998,"Sinapi 92451",11.295000000000002,"Sinapi 6193",null,{"$f":"ROUNDUP(H326*F326,2)","v":5.3599999999999994}]
[null,null,"SF-00081","Prego de aco polido com cabeca dupla 17 x 27 (2 1/2 x 11)","kg",4.9000000000000002E-2,"Sinapi 92451",11.691000000000001,"Sinapi 40304",null,{"$f":"ROUNDUP(H327*F327,2)","v":0.57999999999999996}]
[null,null,"SF-00081","Ajudante de carpinteiro com encargos complementares","h",0.20499999999999999,"Sinapi 92451",15.065999999999999,"Sinapi 88239",null,null,{"$f":"ROUND(H328*F328,2)","v":3.09}]
[null,null,"SF-00081","Carpinteiro de formas com encargos complementares","h",1.1200000000000001,"Sinapi 92451",18.009,"Sinapi 88262",null,null,20.170000000000002]
[null,null,"SF-00081","Fabricação de fôrma para vigas, em chapa de madeira compensada resinada, E = 17 mm. AF_12/2015","m2",0.621,"Sinapi 92451",{"$f":"OFFSET(INDEX('Composições Auxiliares'!A:L,MATCH(D330,'Composições Auxiliares'!A:A,0),12),2,0)","v":59.76},"Sinapi 92265",{"$f":"ROUNDUP(H330*F330,2)","v":37.119999999999997}]
[null,null,"SF-00081","Fabricação de escoras de viga do tipo garfo, em madeira. af_12/2015","m",1.8160000000000001,"Sinapi 92451",{"$f":"OFFSET(INDEX('Composições Auxiliares'!A:L,MATCH(D331,'Composições Auxiliares'!A:A,0),12),2,0)","v":18.82},"Sinapi 92272",{"$f":"ROUND(H331*F331,2)","v":34.18}]
[null,null,"",null,null,null,null,""]
["SF-00082","Verga/contraverga/cinta em bloco de concreto canaleta 11,5 x 19 x 39 cm","",null,"m",null,"Pini 06.103.000505.SER Adaptada",""]
[null,null,"",null,null,null,null,""]
[null,null,"SF-00082","Servente com Encargos Complementares","h",0.4,"Pini 06.103.000505.SER",13.167000000000002,"Sinapi 88316",null,null,{"$f":"ROUND(H335*F335,2)","v":5.27},{"$f":"SUM(J335:L341)","v":21.39}]
[null,null,"SF-00082","Pedreiro Com Encargos Complementares","h",0.3,"Pini 06.103.000505.SER",18.117000000000001,"Sinapi 88309",null,null,5.44]
[null,null,"SF-00082","Areia media - posto jazida/fornecedor (retirado na jazida, sem transporte)","m3",0.01,"Pini 06.103.000505.SER",79.875,"Sinapi 370",null,{"$f":"ROUND(H337*F337,2)","v":0.8}]
[null,null,"SF-00082","Pedra britada n. 2 (19 a 38 mm) posto pedreira/fornecedor, sem frete","m3",0.01,"Pini 06.103.000505.SER",72.207000000000008,"Sinapi 4718",null,{"$f":"ROUND(H338*F338,2)","v":0.72}]
[null,null,"SF-00082","Cimento Portland composto CP II-32","kg",2.0099999999999998,"Pini 06.103.000505.SER",0.36899999999999999,"Sinapi 1379",null,{"$f":"ROUND(H339*F339,2)","v":0.74}]
[null,null,"SF-00082","Bloco de concreto tipo canaleta 11,5 x 19 x 39 cm","un ",2.5,"Pini 06.103.000505.SER",2.4390000000000001,"Pini 06.103.000505.SER",null,{"$f":"ROUND(H340*F340,2)","v":6.1}]
[null,null,"SF-00082","Aco CA-50, 10,0 mm, vergalhao","kg",0.5,"Pini 06.103.000505.SER",4.6440000000000001,"Sinapi 00034",null,{"$f":"ROUND(H341*F341,2)","v":2.3199999999999998}]
[null,null,"",null,null,null,null,""]
["SF-00083","Impermeabilização de superfície com revestimento bicomponente semi flexível","",null,"m2",null,"Sinapi 98555",""]
[null,null,"",null,null,null,null,""]
[null,null,"SF-00083","Argamassa polimerica impermeabilizante semiflexivel, bicomponente (membrana impermeabilizante acrilica)","kg",3.2,"Sinapi 98555",4.32,"Sinapi 135",null,{"$f":"ROUND(+F345*H345,2)","v":13.82},null,{"$f":"SUM(J345:L347)","v":25.17}]
[null,null,"SF-00083","Ajudante especializado com encargos complementares","h",0.108,"Sinapi 98555",15.795000000000002,"Sinapi 88243",null,null,{"$f":"ROUND(+F346*H346,2)","v":1.71}]
[null,null,"SF-00083","Impermeabilizador com encargos complementares","h",0.53200000000000003,"Sinapi 98555",18.117000000000001,"Sinapi 88270",null,null,{"$f":"ROUND(+F347*H347,2)","v":9.64}]
[null,null,"",null,null,null,null,""]
["SF-00084","Alvenaria de vedação","",null,"m2",null,"Sinapi 87503",""]
[null,null,"",null,null,null,null,""]
[null,null,"SF-00084","Bloco ceramico (alvenaria de vedacao), de 9 x 19 x 19 cm","mil",2.793E-2,"Sinapi 87503",441,"Sinapi 7266",null,{"$f":"ROUND(+F351*H351,2)","v":12.32},null,{"$f":"SUM(J351:L356)","v":50.33}]
[null,null,"SF-00084","Tela de aco soldada galvanizada/zincada para alvenaria, fio D = *1,20 a 1,70* mm, malha 15 x 15 mm, (C x L) *50 x 7,5* cm","m",0.42,"Sinapi 87503",1.2509999999999999,"Sinapi 34557",null,{"$f":"ROUNDDOWN(+F352*H352,2)","v":0.52}]
[null,null,"SF-00084","Pino de aco com furo, haste = 27 mm (acao direta)","cento",5.0000000000000001E-3,"Sinapi 87503",35.613,"Sinapi 37395",null,0.18]
[null,null,"SF-00084","Argamassa Traço 1:2:8 (Cimento, Cal E Areia Média) Para Emboço/Massa Única/Assentamento De Alvenaria De Vedação, Preparo Mecânico Com Betoneira 400 L. Af_06/2014","m3",9.7999999999999997E-3,"Sinapi 87503",{"$f":"OFFSET(INDEX('Composições Auxiliares'!A:L,MATCH(D354,'Composições Auxiliares'!A:A,0),12),2,0)","v":354.81000000000006},"Sinapi 87292",{"$f":"ROUNDDOWN(H354*F354,2)","v":3.47}]
[null,null,"SF-00084","Pedreiro com Encargos Complementares","h",1.37,"Sinapi 87503",18.117000000000001,"Sinapi 88309",null,null,{"$f":"ROUND(+F355*H355,2)","v":24.82}]
[null,null,"SF-00084","Servente com Encargos Complementares","h",0.68500000000000005,"Sinapi 87503",13.167000000000002,"Sinapi 88316",null,null,9.02]
[null,null,"",null,null,null,null,""]
["SF-00085","Fechamento ou shaft em gesso acartonado tipo drywall","",null,"m2",null,"Sinapi 96370",""]
[null,null,"",null,null,null,null,""]
[null,null,"SF-00085","Pino de aco com arruela conica, diametro arruela = *23* mm e Comp haste = *27* mm (acao indireta)","cento",2.4299999999999999E-2,"Sinapi 96370",41.418000000000006,"Sinapi 37586",null,{"$f":"ROUND(H360*F360,2)","v":1.01},null,{"$f":"SUM(J360:L370)","v":41.510000000000005}]
[null,null,"SF-00085","Chapa de gesso acartonado, Standard (ST), cor branca, E = 12,5 mm, 1200 x 2400 mm (L x C)","m2",1.0529999999999999,"Sinapi 96370",17.199000000000002,"Sinapi 39413",null,18.11]
[null,null,"SF-00085","Perfil guia, formato U, em aco zincado, para estrutura parede drywall, E = 0,5 mm, 70 x 3000 mm (L x C)","m",0.76039999999999996,"Sinapi 96370",3.7890000000000001,"Sinapi 39419",null,2.88]
[null,null,"SF-00085","Perfil montante, formato C, em aco zincado, para estrutura parede drywall, E = 0,5 mm, 70 x 3000 mm (L x C)","m",1.9910000000000001,"Sinapi 96370",4.3020000000000005,"Sinapi 39422",null,8.57]
[null,null,"SF-00085","Fita de papel microperfurado, 50 x 150 mm, para tratamento de juntas de chapa de gesso para drywall","m",1.2513000000000001,"Sinapi 96370",0.19800000000000001,"Sinapi 39431",null,0.25]
[null,null,"SF-00085","Fita de papel reforcada com lamina de metal para reforco de cantos de chapa de gesso para drywall","m",0.74070000000000003,"Sinapi 96370",2.5470000000000002,"Sinapi 39432",null,1.89]
[null,null,"SF-00085","Massa de rejunte em po para drywall, a base de gesso, secagem rapida, para tratamento de juntas de chapa de gesso (com adicao de agua)","kg",0.51639999999999997,"Sinapi 96370",3.42,"Sinapi 39434",null,{"$f":"ROUNDDOWN(H366*F366,2)","v":1.76}]
[null,null,"SF-00085","Parafuso dry wall, em aco fosfatizado, cabeca trombeta e ponta agulha (TA), comprimento 25 mm","un",10.0039,"Sinapi 96370",5.3999999999999999E-2,"Sinapi 39435",null,0.54]
[null,null,"SF-00085","Parafuso dry wall, em aco zincado, cabeca lentilha e ponta broca (LB), largura 4,2 mm, comprimento 13 mm","un",0.80759999999999998,"Sinapi 96370",0.12600000000000003,"Sinapi 39443",null,0.1]
[null,null,"SF-00085","Montador de estrutura metálica com encargos complementares","h",0.36359999999999998,"Sinapi 96370",14.301,"Sinapi 88278",null,null,{"$f":"ROUND(H369*F369,2)","v":5.2}]
[null,null,"SF-00085","Servente com Encargos Complementares","h",9.0899999999999995E-2,"Sinapi 96370",13.167000000000002,"Sinapi 88316",null,null,1.2]
[null,null,"",null,null,null,null,""]
["SF-00086","Fixação (encunhamento) de Alvenaria de Vedação","",null,"m",null,"Sinapi 93202",""]
[null,null,"",null,null,null,null,""]
[null,null,"SF-00086","Tijolo ceramico macico *5 x 10 x 20* cm","un",11.2,"Sinapi 93202",0.27900000000000003,"Sinapi 7258",null,{"$f":"ROUND(+F374*H374,2)","v":3.12},null,{"$f":"SUM(J374:L377)","v":15.87}]
[null,null,"SF-00086","Argamassa traço 1:2:9 (cimento, cal e areia média) para emboço/massa única/assentamento de alvenaria de vedação, preparo mecânico com betoneira 600 L. af_06/2014","m3",5.1999999999999998E-3,"Sinapi 93202",{"$f":"OFFSET(INDEX('Composições Auxiliares'!A:L,MATCH(D375,'Composições Auxiliares'!A:A,0),12),2,0)","v":339.64},"Sinapi 87294",{"$f":"ROUNDDOWN(H375*F375,2)","v":1.76}]
[null,null,"SF-00086","Pedreiro com Encargos Complementares","h",0.52900000000000003,"Sinapi 93202",18.117000000000001,"Sinapi 88309",null,null,{"$f":"ROUNDUP(+F376*H376,2)","v":9.59}]
[null,null,"SF-00086","Servente com Encargos Complementares","h",0.106,"Sinapi 93202",13.167000000000002,"Sinapi 88316",null,null,{"$f":"ROUND(+F377*H377,2)","v":1.4}]
[null,null,"",null,null,null,null,""]
["SF-00087","Parede em gesso acartonado (drywall)","",null,"m2",null,"Sinapi 96358",""]
[null,null,"",null,null,null,null,""]
[null,null,"SF-00087","Pino De Aco Com Arruela Conica, Diametro Arruela = *23* Mm E Comp Haste = *27* Mm (Acao Indireta)","cento",2.4299999999999999E-2,"Sinapi 96358",41.418000000000006,"Sinapi 37586",null,{"$f":"ROUND(+F381*H381,2)","v":1.01},null,{"$f":"SUM(J381:L391)","v":65.37}]
[null,null,"SF-00087","Chapa De Gesso Acartonado, Standard (St), Cor Branca, E = 12,5 Mm, 1200 X 2400 Mm (L X C)","m2",2.1059999999999999,"Sinapi 96358",17.199000000000002,"Sinapi 39413",null,{"$f":"ROUNDUP(+F382*H382,2)","v":36.229999999999997}]
[null,null,"SF-00087","Perfil Guia, Formato U, Em Aco Zincado, Para Estrutura Parede Drywall, E = 0,5 Mm, 70 X 3000 Mm (L X C)","m",0.76039999999999996,"Sinapi 96358",3.7890000000000001,"Sinapi 39419",null,2.88]
[null,null,"SF-00087","Perfil Montante, Formato C, Em Aco Zincado, Para Estrutura Parede Drywall, E = 0,5 Mm, 70 X 3000 Mm (L X C)","m",1.9910000000000001,"Sinapi 96358",4.3020000000000005,"Sinapi 39422",null,8.57]
[null,null,"SF-00087","Fita De Papel Microperfurado, 50 X 150 Mm, Para Tratamento De Juntas De Chapa De Gesso Para Drywall","m",2.5026999999999999,"Sinapi 96358",0.19800000000000001,"Sinapi 39431",null,0.5]
[null,null,"SF-00087","Fita De Papel Reforcada Com Lamina De Metal Para Reforco De Cantos De Chapa De Gesso Para Drywall","m",0.74070000000000003,"Sinapi 96358",2.5470000000000002,"Sinapi 39432",null,1.89]
[null,null,"SF-00087","Massa De Rejunte Em Po Para Drywall, A Base De Gesso, Secagem Rapida, Para Tratamento De Juntas De Chapa De Gesso (Com Adicao De Agua)","kg",1.0327,"Sinapi 96358",3.42,"Sinapi 39434",null,3.53]
[null,null,"SF-00087","Parafuso Dry Wall, Em Aco Fosfatizado, Cabeca Trombeta E Ponta Agulha (Ta), Comprimento 25 Mm","un",20.0077,"Sinapi 96358",5.3999999999999999E-2,"Sinapi 39435",null,1.08]
[null,null,{"$f":"IF(AND(D389<>\"\",A387=\"\"),C388,IF(D389<>\"\",A387,\"\"))","v":"SF-00087"},"Parafuso Dry Wall, Em Aco Zincado, Cabeca Lentilha E Ponta Broca (Lb), Largura 4,2 Mm, Comprimento 13 Mm","un",0.80759999999999998,"Sinapi 96358",0.12600000000000003,"Sinapi 39443",null,0.1]
[null,null,"SF-00087","Montador de estrutura metálica com encargos complementares","h",0.54490000000000005,"Sinapi 96358",14.301,"Sinapi 88278",null,null,{"$f":"ROUND(+F390*H390,2)","v":7.79}]
[null,null,"SF-00087","Servente com Encargos Complementares","h",0.13619999999999999,"Sinapi 96358",13.167000000000002,"Sinapi 88316",null,null,1.79]
[null,null,"",null,null,null,null,""]
["SF-00088","Reparos superficiais em painéis de gesso acartonado","",null,"m2",null,"Sinapi 96370 Adaptada",""]
[null,null,"",null,null,null,null,""]
[null,null,"SF-00088","Fita De Papel Microperfurado, 50 X 150 Mm, Para Tratamento De Juntas De Chapa De Gesso Para Drywall","m",1.2513000000000001,"Sinapi 96370",0.19800000000000001,"Sinapi 39431",null,{"$f":"ROUND(+F395*H395,2)","v":0.25},null,{"$f":"SUM(J395:L398)","v":4.59}]
[null,null,"SF-00088","Massa De Rejunte Em Po Para Drywall, A Base De Gesso, Secagem Rapida, Para Tratamento De Juntas De Chapa De Gesso (Com Adicao De Agua)","kg",0.51639999999999997,"Sinapi 96370",3.42,"Sinapi 39434",null,{"$f":"ROUNDDOWN(+F396*H396,2)","v":1.76}]
[null,null,"SF-00088","Montador de estrutura metálica com encargos complementares","h",{"$f":"0.3636/3","v":0.12119999999999999},"Sinapi 96370 Adaptada",14.301,"Sinapi 88278",null,null,{"$f":"ROUNDUP(+F397*H397,2)","v":1.74}]
[null,null,"SF-00088","Servente com Encargos Complementares","h",{"$f":"0.0909*0.7","v":6.3629999999999992E-2},"Sinapi 96370 Adaptada",13.167000000000002,"Sinapi 88316",null,null,{"$f":"ROUND(+F398*H398,2)","v":0.84}]
[null,null,"",null,null,null,null,""]
["SF-00089","Sóculo h=10 cm","",null,"m2",null,"Sinapi 87471 + Sinapi 87545",""]
[null,null,"",null,null,null,null,""]
[null,null,"SF-00089","Tela de aco soldada galvanizada/zincada para alvenaria, fio D = *1,20 a 1,70* mm, malha 15 x 15 mm, (C x L) *50 x 7,5* cm","m",0.78500000000000003,"Sinapi 87471",1.2509999999999999,"Sinapi 34557",null,{"$f":"ROUND(H402*F402,2)","v":0.98},null,{"$f":"SUM(J402:L410)","v":51.970000000000006}]
[null,null,"SF-00089","Pino de aco com furo, haste = 27 mm (acao direta)","cento",9.4000000000000004E-3,"Sinapi 87471",35.613,"Sinapi 37395",null,{"$f":"ROUND(H403*F403,2)","v":0.33}]
[null,null,"SF-00089","Bloco ceramico de vedacao com furos na vertical, 9 x 19 x 39 cm - 4,5 MPa (NBR 15270)","un",13.35,"Sinapi 87471",1.071,"Sinapi 37592",null,14.3]
[null,null,"SF-00089","Argamassa traço 1:2:8 (cimento, cal e areia média) para emboço/massa única/assentamento de alvenaria de vedação, preparo mecânico com betoneira 400 L. af_06/2014","m3",1.04E-2,"Sinapi 87471",{"$f":"OFFSET(INDEX('Composições Auxiliares'!A:L,MATCH(D405,'Composições Auxiliares'!A:A,0),12),2,0)","v":354.81000000000006},"Sinapi 87292",{"$f":"ROUND(H405*F405,2)","v":3.69}]
[null,null,"SF-00089","Pedreiro com Encargos Complementares","h",0.59,"Sinapi 87471",18.117000000000001,"Sinapi 88309",null,null,{"$f":"ROUND(H406*F406,2)","v":10.69}]
[null,null,"SF-00089","Servente com Encargos Complementares","h",0.29499999999999998,"Sinapi 87471",13.167000000000002,"Sinapi 88316",null,null,{"$f":"ROUNDUP(H407*F407,2)","v":3.8899999999999997}]
[null,null,"SF-00089","Argamassa traço 1:2:8 (cimento, cal e areia média) para emboço/massa única/assentamento de alvenaria de vedação, preparo mecânico com betoneira 400 L. af_06/2014","m3",2.1299999999999999E-2,"Sinapi 87545",{"$f":"OFFSET(INDEX('Composições Auxiliares'!A:L,MATCH(D408,'Composições Auxiliares'!A:A,0),12),2,0)","v":354.81000000000006},"Sinapi 87292",{"$f":"ROUND(H408*F408,2)","v":7.56}]
[null,null,"SF-00089","Pedreiro com Encargos Complementares","h",0.46,"Sinapi 87545",18.117000000000001,"Sinapi 88309",null,null,{"$f":"ROUND(H409*F409,2)","v":8.33}]
[null,null,"SF-00089","Servente com Encargos Complementares","h",0.16700000000000001,"Sinapi 87545",13.167000000000002,"Sinapi 88316",null,null,2.2000000000000002]
[null,null,"",null,null,null,null,""]
["SF-00090","Chapisco colante industrializado em vigas e pilares","",null,"m2",null,"Sinapi 87872",""]
[null,null,"",null,null,null,null,""]
[null,null,"SF-00090","Argamassa industrializada para chapisco colante, preparo com misturador de eixo horizontal de 300 kg. AF_06/2014","m3",3.2000000000000002E-3,"Sinapi 87872",{"$f":"OFFSET(INDEX('Composições Auxiliares'!A:L,MATCH(D414,'Composições Auxiliares'!A:A,0),12),2,0)","v":2496.6600000000003},"Sinapi 87396",{"$f":"ROUND(H414*F414,2)","v":7.99},null,null,{"$f":"SUM(J414:L416)","v":10.74}]
[null,null,"SF-00090","Pedreiro com Encargos Complementares","h",0.14099999999999999,"Sinapi 87872",18.117000000000001,"Sinapi 88309",null,null,{"$f":"ROUNDUP(H415*F415,2)","v":2.5599999999999996}]
[null,null,"SF-00090","Servente com Encargos Complementares","h",1.41E-2,"Sinapi 87872",13.167000000000002,"Sinapi 88316",null,null,{"$f":"ROUND(H416*F416,2)","v":0.19}]
[null,null,"",null,null,null,null,""]
["SF-00091","Chapisco com argamassa traço 1:3 ","",null,"m2",null,"Sinapi 87878",""]
[null,null,"",null,null,null,null,""]
[null,null,"SF-00091","Argamassa traço 1:3 (cimento e areia grossa) para chapisco convencional, preparo manual. AF_06/2014","m3",4.1999999999999997E-3,"Sinapi 87878",{"$f":"OFFSET(INDEX('Composições Auxiliares'!A:L,MATCH(D420,'Composições Auxiliares'!A:A,0),12),2,0)","v":366.99},"Sinapi 87377",{"$f":"ROUND(H420*F420,2)","v":1.54},null,null,{"$f":"SUM(J420:L422)","v":2.9}]
[null,null,"SF-00091","Pedreiro com Encargos Complementares","h",7.0000000000000007E-2,"Sinapi 87878",18.117000000000001,"Sinapi 88309",null,null,{"$f":"ROUND(H421*F421,2)","v":1.27}]
[null,null,"SF-00091","Servente com Encargos Complementares","h",7.0000000000000001E-3,"Sinapi 87878",13.167000000000002,"Sinapi 88316",null,null,{"$f":"ROUND(H422*F422,2)","v":0.09}]
[null,null,"",null,null,null,null,""]
["SF-00092","Gesso cola","",null,"m2",null,"Sinapi 87419 Adaptada",""]
[null,null,"",null,null,null,null,""]
[null,null,"SF-00092","Gesseiro com encargos complementares","h",0.4,"Sinapi 87419",18.009,"Sinapi 88269",null,null,{"$f":"ROUND(H426*F426,2)","v":7.2},{"$f":"SUM(J426:L428)","v":11.23}]
[null,null,"SF-00092","Servente com Encargos Complementares","h",0.08,"Sinapi 87419",13.167000000000002,"Sinapi 88316",null,null,{"$f":"ROUND(H427*F427,2)","v":1.05}]
[null,null,"SF-00092","Gesso cola. Ref: Juntalider","kg",0.75,"Senado Federal",3.97,"Pesquisa de Preços",null,{"$f":"ROUND(H428*F428,2)","v":2.98}]
[null,null,"",null,null,null,null,""]
[null,null,"","Fonte para o coeficiente do gesso (0,75 kg/m2) : http://www.gessotrevo.com.br/gesso_cola.php - acesso em 16/08/18",null,null,null,""]
[null,null,"",null,null,null,null,""]
["SF-00093","Reboco com argamassa industrializada e=2,0 cm","",null,"m2",null,"Sinapi 87398 + 87531 Adaptada",""]
[null,null,"",null,null,null,null,""]
[null,null,"SF-00093","Argamassa industrializada multiuso, para revestimento interno e externo e assentamento de blocos diversos","kg",{"$f":"1890*0.02","v":37.800000000000004},"Sinapi 87398 Adaptada",0.32400000000000001,"Sinapi 371",null,{"$f":"ROUND(H434*F434,2)","v":12.25},null,{"$f":"SUM(J434:L437)","v":25.71}]
[null,null,"SF-00093","Servente com Encargos Complementares","h",{"$f":"13.64*0.02","v":0.27280000000000004},"Sinapi 87398 Adaptada",13.167000000000002,"Sinapi 88316",null,null,{"$f":"ROUND(H435*F435,2)","v":3.59}]
[null,null,"SF-00093","Pedreiro com Encargos Complementares","h",0.43,"Sinapi 87531",18.117000000000001,"Sinapi 88309",null,null,{"$f":"ROUND(H436*F436,2)","v":7.79}]
[null,null,"SF-00093","Servente com Encargos Complementares","h",{"$f":"0.158","v":0.158},"Sinapi 87531",13.167000000000002,"Sinapi 88316",null,null,{"$f":"ROUND(H437*F437,2)","v":2.08}]
[null,null,"",null,null,null,null,""]
[null,null,"","Observação: Rendimento de argamassa obtido como referência no SINAPI e no link abaixo. Extrato: \"Revestimento: Em média 17,0 a 19,5 Kg/m2  para cada 1,0 cm de espessura, variando em função da aplicação\".",null,null,null,""]
[null,null,"","https://s3.amazonaws.com/mapa-da-obra-producao/wp-content/uploads/2015/12/2101-matrix-revestimento-interno.pdf",null,null,null,""]
[null,null,"",null,null,null,null,""]
["SF-00094","Regularização com argamassa industrializada e=0,5 cm","",null,"m2",null,"Sinapi 87398 + 87549 Adaptada",""]
[null,null,"",null,null,null,null,""]
[null,null,"SF-00094","Argamassa industrializada multiuso, para revestimento interno e externo e assentamento de blocos diversos","kg",{"$f":"1890*0.005","v":9.4500000000000011},"Sinapi 87398 Adaptada",0.32400000000000001,"Sinapi 371",null,{"$f":"ROUND(H444*F444,2)","v":3.06},null,{"$f":"SUM(J444:L447)","v":7.92}]
[null,null,"SF-00094","Servente com Encargos Complementares","h",{"$f":"13.64*0.005","v":6.8200000000000011E-2},"Sinapi 87398 Adaptada",13.167000000000002,"Sinapi 88316",null,null,{"$f":"ROUND(H445*F445,2)","v":0.9}]
[null,null,"SF-00094","Pedreiro com Encargos Complementares","h",0.2,"Sinapi 87549",18.117000000000001,"Sinapi 88309",null,null,{"$f":"ROUNDUP(H446*F446,2)","v":3.63}]
[null,null,"SF-00094","Servente com Encargos Complementares","h",2.5000000000000001E-2,"Sinapi 87549",13.167000000000002,"Sinapi 88316",null,null,{"$f":"ROUND(H447*F447,2)","v":0.33}]
[null,null,"",null,null,null,null,""]
["SF-00095","Tratamento de trincas superficiais ","",null,"m",null,"Pini 06.103.000460.SER Adaptada",""]
[null,null,"",null,null,null,null,""]
[null,null,"SF-00095","Servente com Encargos Complementares","h",0.6,"Pini 06.103.000460.SER",13.167000000000002,"Sinapi 88316",null,null,{"$f":"ROUND(H451*F451,2)","v":7.9},{"$f":"SUM(J451:L454)","v":14.440000000000001}]
[null,null,"SF-00095","Pedreiro com Encargos Complementares","h",0.155,"Pini 06.103.000460.SER",18.117000000000001,"Sinapi 88309",null,null,{"$f":"ROUND(H452*F452,2)","v":2.81}]
[null,null,{"$f":"IF(AND(D453<>\"\",A451=\"\"),C452,IF(D453<>\"\",A451,\"\"))","v":"SF-00095"},"Tela de poliéster adesiva largura 150mm e reforço central de 50mm","m",1.05,"Pini 06.103.000460.SER",3.3480000000000003,"Pini 06.103.000460.SER",null,{"$f":"ROUND(H453*F453,2)","v":3.52}]
[null,null,"SF-00095","Primer a base de poliuretano","l",{"$f":"0.15*0.01","v":1.5E-3},"Senado Federal",138.18,"Pesquisa de Preços",null,{"$f":"ROUND(H454*F454,2)","v":0.21}]
[null,null,"",null,null,null,null,""]
[null,null,"","Observação: Rendimento do primer obtido de acordo com recomendação do fabricante. Consumo médio. ",null,null,null,""]
[null,null,"","https://www.reisereis.com.br/produto/rrprimer-primer-pu-para-concreto",null,null,null,""]
[null,null,"","http://www.viapol.com.br/produtos/viapol/selantes/primers/viapol-primer-pu/",null,null,null,""]
[null,null,"",null,null,null,null,""]
["SF-00096","Aplicação de fundo selador base água","",null,"m2",null,"Sinapi 88414",""]
[null,null,"",null,null,null,null,""]
[null,null,"SF-00096","Pintor com encargos complementares","h",0.106,"Sinapi 88414",18.045000000000002,"Sinapi 88310",null,null,{"$f":"ROUNDUP(H462*F462,2)","v":1.92},{"$f":"SUM(J462:L464)","v":3.3}]
[null,null,"SF-00096","Servente com Encargos Complementares","h",2.7E-2,"Sinapi 8841487418",13.167000000000002,"Sinapi 88316",null,null,{"$f":"ROUND(H463*F463,2)","v":0.36}]
[null,null,"SF-00096","Fundo selador a base d'água","l",0.16,"Sinapi 88414",6.39,"Pesquisa de Preços",null,{"$f":"ROUND(H464*F464,2)","v":1.02}]
[null,null,"",null,null,null,null,""]
["SF-00097","Fundo anticorrosivo e de aderência (base água)","",null,"m2",null,"Sinapi 74064/1 Adaptada",""]
[null,null,"",null,null,null,null,""]
[null,null,"SF-00097","Pintor com encargos complementares","h",0.4,"Sinapi 74064/1",18.045000000000002,"Sinapi 88310",null,null,{"$f":"ROUND(H468*F468,2)","v":7.22},{"$f":"SUM(J468:L470)","v":16.899999999999999}]
[null,null,"SF-00097","Servente com Encargos Complementares","h",0.3,"Sinapi 74064/1",13.167000000000002,"Sinapi 88316",null,null,{"$f":"ROUND(H469*F469,2)","v":3.95}]
[null,null,"SF-00097","Fundo anticorrosivo e de aderência a base de água","l",0.24,"Sinapi 74064/1",23.89,"Pesquisa de Preços",null,{"$f":"ROUND(H470*F470,2)","v":5.73}]
[null,null,"",null,null,null,null,""]
["SF-00098","Massa acrílica","",null,"m2",null,"Sinapi 96132",""]
[null,null,"",null,null,null,null,""]
[null,null,"SF-00098","Lixa em folha para parede ou madeira, numero 120 (cor vermelha)","un",0.1,"Sinapi 96132",0.56700000000000006,"Sinapi 3767",null,{"$f":"ROUNDDOWN(H474*F474,2)","v":0.05},null,{"$f":"SUM(J474:L477)","v":13.58}]
[null,null,"SF-00098","Massa acrílica para paredes interior/exterior","gl",0.24399999999999999,"Sinapi 96132",26.28,"Sinapi 4056",null,{"$f":"ROUND(H475*F475,2)","v":6.41}]
[null,null,"SF-00098","Pintor com encargos complementares","h",0.33400000000000002,"Sinapi 96132",18.045000000000002,"Sinapi 88310",null,null,{"$f":"ROUND(H476*F476,2)","v":6.03}]
[null,null,"SF-00098","Servente com Encargos Complementares","h",8.3000000000000004E-2,"Sinapi 96132",13.167000000000002,"Sinapi 88316",null,null,{"$f":"ROUND(H477*F477,2)","v":1.0900000000000001}]
[null,null,"",null,null,null,null,""]
["SF-00099","Massa corrida","",null,"m2",null,"Sinapi 88497",""]
[null,null,"",null,null,null,null,""]
[null,null,"SF-00099","Lixa em folha para parede ou madeira, numero 120 (cor vermelha)","un",0.1,"Sinapi 88497",0.56700000000000006,"Sinapi 3767",null,{"$f":"ROUNDDOWN(H481*F481,2)","v":0.05},null,{"$f":"SUM(J481:L484)","v":10.379999999999999}]
[null,null,"SF-00099","Massa corrida PVA para paredes internas","18L",4.8899999999999999E-2,"Sinapi 88497",65.610000000000014,"Sinapi 4051",null,{"$f":"ROUNDDOWN(H482*F482,2)","v":3.2}]
[null,null,"SF-00099","Pintor com encargos complementares","h",0.312,"Sinapi 88497",18.045000000000002,"Sinapi 88310",null,null,{"$f":"ROUND(H483*F483,2)","v":5.63}]
[null,null,"SF-00099","Servente com Encargos Complementares","h",0.114,"Sinapi 88497",13.167000000000002,"Sinapi 88316",null,null,{"$f":"ROUND(H484*F484,2)","v":1.5}]
[null,null,"",null,null,null,null,""]
["SF-00100","Pintura com tinta látex acrílica Premium (paredes)","",null,"m2",null,"Sinapi 88489",""]
[null,null,"",null,null,null,null,""]
[null,null,"SF-00100","Pintor com encargos complementares","h",0.187,"Sinapi 88489",18.045000000000002,"Sinapi 88310",null,null,{"$f":"ROUNDUP(H488*F488,2)","v":3.38},{"$f":"SUM(J488:L490)","v":10.17}]
[null,null,"SF-00100","Servente com Encargos Complementares","h",6.9000000000000006E-2,"Sinapi 88489",13.167000000000002,"Sinapi 88316",null,null,{"$f":"ROUND(H489*F489,2)","v":0.91}]
[null,null,"SF-00100","Tinta acrilica premium, cor branco fosco","l",0.33,"Sinapi 88489",17.811,"Sinapi 7356",null,{"$f":"ROUND(H490*F490,2)","v":5.88}]
[null,null,"",null,null,null,null,""]
["SF-00101","Pintura em verniz sintético ","",null,"m2",null,"Sinapi 6082 Adaptada",""]
[null,null,"",null,null,null,null,""]
[null,null,"SF-00101","Lixa em folha para parede ou madeira, numero 120 (cor vermelha)","un",1,"Sinapi 6082",0.56700000000000006,"Sinapi 3767",null,{"$f":"ROUND(H494*F494,2)","v":0.56999999999999995},null,{"$f":"SUM(J494:L497)","v":13.93}]
[null,null,"SF-00101","Verniz a base de água para madeira","l",7.4999999999999997E-2,"Sinapi 6082",29.17,"Pesquisa de Preços",null,2.19]
[null,null,"SF-00101","Pintor com encargos complementares","h",0.4,"Sinapi 6082",18.045000000000002,"Sinapi 88310",null,null,{"$f":"ROUND(H496*F496,2)","v":7.22}]
[null,null,"SF-00101","Servente com Encargos Complementares","h",0.3,"Sinapi 6082",13.167000000000002,"Sinapi 88316",null,null,3.95]
[null,null,"",null,null,null,null,""]
["SF-00102","Pintura esmalte acetinado (metais e madeiras)","",null,"m2",null,"Sinapi 73924/2 Adaptada",""]
[null,null,"",null,null,null,null,""]
[null,null,"SF-00102","Pintor com encargos complementares","h",0.5,"Sinapi 73924/2",18.045000000000002,"Sinapi 88310",null,null,{"$f":"ROUNDUP(H501*F501,2)","v":9.0299999999999994},{"$f":"SUM(J501:L504)","v":21.06}]
[null,null,"SF-00102","Servente com Encargos Complementares","h",0.5,"Sinapi 73924/2",13.167000000000002,"Sinapi 88316",null,null,{"$f":"ROUNDUP(H502*F502,2)","v":6.59}]
[null,null,"SF-00102","Lixa em folha para ferro, numero 150","un",0.6,"Sinapi 73924/2",2.403,"Sinapi 3768",null,{"$f":"ROUND(H503*F503,2)","v":1.44}]
[null,null,"SF-00102","Tinta esmalte sintetico a base de água","l",0.16,"Sinapi 73924/2",24.97,"Pesquisa de Preços",null,{"$f":"ROUND(H504*F504,2)","v":4}]
[null,null,"",null,null,null,null,""]
["SF-00103","Pintura tinta látex acrílica standard (tetos)","",null,"m2",null,"Sinapi 88488",""]
[null,null,"",null,null,null,null,""]
[null,null,"SF-00103","Pintor com encargos complementares","h",0.24399999999999999,"Sinapi 88488",18.045000000000002,"Sinapi 88310",null,null,{"$f":"ROUND(H508*F508,2)","v":4.4000000000000004},{"$f":"SUM(J508:L510)","v":11.45}]
[null,null,"SF-00103","Servente com Encargos Complementares","h",8.8999999999999996E-2,"Sinapi 88488",13.167000000000002,"Sinapi 88316",null,null,{"$f":"ROUND(H509*F509,2)","v":1.17}]
[null,null,"SF-00103","Tinta acrilica premium, cor branco fosco","l",0.33,"Sinapi 88488",17.811,"Sinapi 7356",null,{"$f":"ROUND(H510*F510,2)","v":5.88}]
[null,null,"",null,null,null,null,""]
["SF-00104","Cerâmica para revestimento de superfícies internas ou externas – Linha Administrativa","",null,"m2",null,"Sinapi 87273 Adaptada",""]
[null,null,"",null,null,null,null,""]
[null,null,"SF-00104","Revestimento em ceramica esmaltada extra, PEI maior ou igual a 4, formato maior a 2025 cm2","m2",1.08,"Sinapi 87273",42.318000000000005,"Sinapi 10515",null,{"$f":"ROUND(H514*F514,2)","v":45.7},null,{"$f":"SUM(J514:L518)","v":67.27}]
[null,null,"SF-00104","Argamassa colante AC-II","kg",6.14,"Sinapi 87273",0.72000000000000008,"Sinapi 34353",null,4.42]
[null,null,"SF-00104","Rejunte colorido, cimenticio","kg",0.22,"Sinapi 87273",2.286,"Sinapi 34357",null,{"$f":"ROUND(H516*F516,2)","v":0.5}]
[null,null,"SF-00104","Azulejista ou ladrilhista com encargos complementares","h",0.66,"Sinapi 87273",18.045000000000002,"Sinapi 88256",null,null,{"$f":"ROUND(H517*F517,2)","v":11.91}]
[null,null,"SF-00104","Servente com Encargos Complementares","h",0.36,"Sinapi 87273",13.167000000000002,"Sinapi 88316",null,null,{"$f":"ROUND(H518*F518,2)","v":4.74}]
[null,null,"",null,null,null,null,""]
["SF-00105","Contrapiso em argamassa","",null,"m2",null,"Sinapi 87642",""]
[null,null,{"$f":"IF(AND(D521<>\"\",A519=\"\"),C520,IF(D521<>\"\",A519,\"\"))","v":""},null,null,null,null,""]
[null,null,"SF-00105","Argamassa traço 1:4 (cimento e areia média) para contrapiso, preparo manual. AF_06/2014","m3",5.2999999999999999E-2,"Sinapi 87642",{"$f":"OFFSET(INDEX('Composições Auxiliares'!A:L,MATCH(D522,'Composições Auxiliares'!A:A,0),12),2,0)","v":432.42999999999995},"Sinapi 87373",{"$f":"ROUNDDOWN(H522*F522,2)","v":22.91},null,null,{"$f":"SUM(J522:L526)","v":35.380000000000003}]
[null,null,"SF-00105","Pedreiro com Encargos Complementares","h",0.36,"Sinapi 87642",18.117000000000001,"Sinapi 88309",null,null,{"$f":"ROUNDUP(H523*F523,2)","v":6.5299999999999994}]
[null,null,"SF-00105","Servente com Encargos Complementares","h",0.18,"Sinapi 87642",13.167000000000002,"Sinapi 88316",null,null,{"$f":"ROUND(H524*F524,2)","v":2.37}]
[null,null,"SF-00105","Cimento Portland composto CP II-32","kg",0.5,"Sinapi 87642",0.36899999999999999,"Sinapi 1379",null,{"$f":"ROUNDUP(H525*F525,2)","v":0.19}]
[null,null,"SF-00105","Aditivo adesivo liquido para argamassas de revestimentos cimenticios","l",0.435,"Sinapi 87642",7.7670000000000012,"Sinapi 7334",null,{"$f":"ROUND(H526*F526,2)","v":3.38}]
[null,null,"",null,null,null,null,""]
["SF-00106","Contrapiso em argamassa (e=2cm) ou Regularização de contrapiso existente ","",null,"m2",null,"Sinapi 87622",""]
[null,null,"",null,null,null,null,""]
[null,null,"SF-00106","Cimento Portland composto CP II-32","kg",0.5,"Sinapi 87622",0.36899999999999999,"Sinapi 1379",null,{"$f":"ROUNDUP(H530*F530,2)","v":0.19},null,{"$f":"SUM(J530:L534)","v":24.139999999999997}]
[null,null,"SF-00106","Aditivo adesivo liquido para argamassas de revestimentos cimenticios","l",0.435,"Sinapi 87622",7.7670000000000012,"Sinapi 7334",null,{"$f":"ROUND(H531*F531,2)","v":3.38}]
[null,null,"SF-00106","Argamassa traço 1:4 (cimento e areia média) para contrapiso, preparo manual. AF_06/2014","m3",3.1E-2,"Sinapi 87622",{"$f":"OFFSET(INDEX('Composições Auxiliares'!A:L,MATCH(D532,'Composições Auxiliares'!A:A,0),12),2,0)","v":432.42999999999995},"Sinapi 87373",{"$f":"ROUNDDOWN(H532*F532,2)","v":13.4}]
[null,null,"SF-00106","Pedreiro com Encargos Complementares","h",0.28999999999999998,"Sinapi 87622",18.117000000000001,"Sinapi 88309",null,null,{"$f":"ROUNDUP(H533*F533,2)","v":5.26}]
[null,null,"SF-00106","Servente com Encargos Complementares","h",0.14499999999999999,"Sinapi 87622",13.167000000000002,"Sinapi 88316",null,null,{"$f":"ROUND(H534*F534,2)","v":1.91}]
[null,null,"",null,null,null,null,""]
["SF-00107","Granito cinza andorinha para piso","",null,"m2",null,"Sinapi 98671 Adaptada",""]
[null,null,"",null,null,null,null,""]
[null,null,"SF-00107","Argamassa colante tipo ACIII","kg",8.6199999999999992,"Sinapi 98671",1.0980000000000001,"Sinapi 37595",null,{"$f":"ROUNDUP(H538*F538,2)","v":9.4700000000000006},null,{"$f":"SUM(J538:L542)","v":157.13999999999999}]
[null,null,"SF-00107","Marmorista/graniteiro com encargos complementares","h",1.1879999999999999,"Sinapi 98671",14.949,"Sinapi 88274",null,null,{"$f":"ROUND(H539*F539,2)","v":17.760000000000002}]
[null,null,"SF-00107","Servente com Encargos Complementares","h",0.59399999999999997,"Sinapi 98671",13.167000000000002,"Sinapi 88316",null,null,{"$f":"ROUND(H540*F540,2)","v":7.82}]
[null,null,"SF-00107","Rejunte branco, cimenticio","kg",0.14000000000000001,"Sinapi 98671",2.0609999999999999,"Sinapi 34356",null,{"$f":"ROUND(H541*F541,2)","v":0.28999999999999998}]
[null,null,"SF-00107","Granito Cinza Andorinha, com 20 mm de espessura, para piso","m2",1.1599999999999999,"Sinapi 98671",105,"Pesquisa de Preços",null,{"$f":"ROUND(H542*F542,2)","v":121.8}]
[null,null,"",null,null,null,null,""]
["SF-00108","Granito Cinza Andorinha para rodapé","",null,"m2",null,"Sinapi 98671 e Sinapi 98685 Adaptadas",""]
[null,null,"",null,null,null,null,""]
[null,null,"SF-00108","Granito Cinza Andorinha, com 20 mm de espessura e 70 mm de altura, para rodapé","m",{"$f":"1.04/0.07","v":14.857142857142856},"Sinapi 98685 Adaptada",14.7,"Pesquisa de Preços",null,{"$f":"ROUND(H546*F546,2)","v":218.4},null,{"$f":"SUM(J546:L550)","v":253.73999999999998}]
[null,null,"SF-00108","Argamassa colante tipo ACIII","kg",8.6199999999999992,"Sinapi 98671 Adaptada",1.0980000000000001,"Sinapi 37595",null,{"$f":"ROUNDUP(H547*F547,2)","v":9.4700000000000006}]
[null,null,"SF-00108","Marmorista/graniteiro com encargos complementares","h",1.1879999999999999,"Sinapi 98671 Adaptada",14.949,"Sinapi 88274",null,null,{"$f":"ROUND(H548*F548,2)","v":17.760000000000002}]
[null,null,"SF-00108","Servente com Encargos Complementares","h",0.59399999999999997,"Sinapi 98671 Adaptada",13.167000000000002,"Sinapi 88316",null,null,{"$f":"ROUND(H549*F549,2)","v":7.82}]
[null,null,"SF-00108","Rejunte branco, cimenticio","kg",0.14000000000000001,"Sinapi 98671 Adaptada",2.0609999999999999,"Sinapi 34356",null,{"$f":"ROUND(H550*F550,2)","v":0.28999999999999998}]
[null,null,"",null,null,null,null,""]
["SF-00109","Granito Cinza Andorinha para soleira e peitoril","",null,"m2",null,"Sinapi 98671 e Sinapi 98689 Adaptadas",""]
[null,null,"",null,null,null,null,""]
[null,null,"SF-00109","Granito Cinza Andorinha, com 20 mm de espessura e 150 mm de altura, para soleira e peitoril","m",{"$f":"1/0.15","v":6.666666666666667},"Sinapi 98689 Adaptada",18.75,"Pesquisa de Preços",null,{"$f":"ROUND(H554*F554,2)","v":125},null,{"$f":"SUM(J554:L557)","v":212.92}]
[null,null,"SF-00109","Argamassa colante tipo ACIII","kg",{"$f":"1.29/0.15","v":8.6000000000000014},"Sinapi 98671 Adaptada",1.0980000000000001,"Sinapi 37595",null,{"$f":"ROUND(H555*F555,2)","v":9.44}]
[null,null,"SF-00109","Marmorista/graniteiro com encargos complementares","h",{"$f":"0.547/0.15","v":3.6466666666666669},"Sinapi 98671 Adaptada",14.949,"Sinapi 88274",null,null,{"$f":"ROUND(H556*F556,2)","v":54.51}]
[null,null,"SF-00109","Servente com Encargos Complementares","h",{"$f":"0.273/0.15","v":1.8200000000000003},"Sinapi 98671 Adaptada",13.167000000000002,"Sinapi 88316",null,null,{"$f":"ROUNDUP(H557*F557,2)","v":23.970000000000002}]
[null,null,"",null,null,null,null,""]
["SF-00110","Granito Preto São Gabriel para piso","",null,"m2",null,"Sinapi 98671 Adaptada",""]
[null,null,"",null,null,null,null,""]
[null,null,"SF-00110","Argamassa colante tipo ACIII","kg",8.6199999999999992,"Sinapi 98671",1.0980000000000001,"Sinapi 37595",null,{"$f":"ROUNDUP(H561*F561,2)","v":9.4700000000000006},null,{"$f":"SUM(J561:L565)","v":220.94}]
[null,null,"SF-00110","Marmorista/graniteiro com encargos complementares","h",1.1879999999999999,"Sinapi 98671",14.949,"Sinapi 88274",null,null,{"$f":"ROUND(H562*F562,2)","v":17.760000000000002}]
[null,null,"SF-00110","Servente com Encargos Complementares","h",0.59399999999999997,"Sinapi 98671",13.167000000000002,"Sinapi 88316",null,null,{"$f":"ROUND(H563*F563,2)","v":7.82}]
[null,null,"SF-00110","Rejunte branco, cimenticio","kg",0.14000000000000001,"Sinapi 98671",2.0609999999999999,"Sinapi 34356",null,{"$f":"ROUND(H564*F564,2)","v":0.28999999999999998}]
[null,null,"SF-00110","Granito Preto São Gabriel, com 20 mm de espessura, para piso","m2",1.1599999999999999,"Sinapi 98671",160,"Pesquisa de Preços",null,{"$f":"ROUND(H565*F565,2)","v":185.6}]
[null,null,"",null,null,null,null,""]
["SF-00111","Granito Preto São Gabriel para rodapé","",null,"m2",null,"Sinapi 98671 e Sinapi 98685 Adaptadas",""]
[null,null,"",null,null,null,null,""]
[null,null,"SF-00111","Granito Preto São Gabriel, com 20 mm de espessura e 70 mm de altura, para rodapé","m",{"$f":"1.04/0.07","v":14.857142857142856},"Sinapi 98685 Adaptada",24.7,"Pesquisa de Preços",null,{"$f":"ROUND(H569*F569,2)","v":366.97},null,{"$f":"SUM(J569:L573)","v":402.31000000000006}]
[null,null,"SF-00111","Argamassa colante tipo ACIII","kg",8.6199999999999992,"Sinapi 98671 Adaptada",1.0980000000000001,"Sinapi 37595",null,{"$f":"ROUNDUP(H570*F570,2)","v":9.4700000000000006}]
[null,null,"SF-00111","Marmorista/graniteiro com encargos complementares","h",1.1879999999999999,"Sinapi 98671 Adaptada",14.949,"Sinapi 88274",null,null,{"$f":"ROUND(H571*F571,2)","v":17.760000000000002}]
[null,null,"SF-00111","Servente com Encargos Complementares","h",0.59399999999999997,"Sinapi 98671 Adaptada",13.167000000000002,"Sinapi 88316",null,null,{"$f":"ROUND(H572*F572,2)","v":7.82}]
[null,null,"SF-00111","Rejunte branco, cimenticio","kg",0.14000000000000001,"Sinapi 98671 Adaptada",2.0609999999999999,"Sinapi 34356",null,{"$f":"ROUND(H573*F573,2)","v":0.28999999999999998}]
[null,null,"",null,null,null,null,""]
["SF-00112","Granito Preto São Gabriel para soleira e peitoril","",null,"m2",null,"Sinapi 98671 e Sinapi 98689 Adaptadas",""]
[null,null,"",null,null,null,null,""]
[null,null,"SF-00112","Granito Preto São Gabriel, com 20 mm de espessura e 150 mm de altura, para soleira e peitoril","m",{"$f":"1/0.15","v":6.666666666666667},"Sinapi 98689 Adaptada",30,"Pesquisa de Preços",null,{"$f":"ROUND(H577*F577,2)","v":200},null,{"$f":"SUM(J577:L580)","v":287.92}]
[null,null,"SF-00112","Argamassa colante tipo ACIII","kg",{"$f":"1.29/0.15","v":8.6000000000000014},"Sinapi 98671 Adaptada",1.0980000000000001,"Sinapi 37595",null,{"$f":"ROUND(H578*F578,2)","v":9.44}]
[null,null,"SF-00112","Marmorista/graniteiro com encargos complementares","h",{"$f":"0.547/0.15","v":3.6466666666666669},"Sinapi 98671 Adaptada",14.949,"Sinapi 88274",null,null,{"$f":"ROUND(H579*F579,2)","v":54.51}]
[null,null,"SF-00112","Servente com Encargos Complementares","h",{"$f":"0.273/0.15","v":1.8200000000000003},"Sinapi 98671 Adaptada",13.167000000000002,"Sinapi 88316",null,null,{"$f":"ROUNDUP(H580*F580,2)","v":23.970000000000002}]
[null,null,"",null,null,null,null,""]
["SF-00113","Instalação de rodapé de madeira reaproveitado","",null,"m",null,"Sinapi 84162 Adaptada",""]
[null,null,"",null,null,null,null,""]
[null,null,"SF-00113","Cola A Base De Resina Sintetica Para Chapa De Laminado Melaminico","kg",0.04,"Sinapi 84162",18.756,"Sinapi 1339",null,{"$f":"ROUND(H584*F584,2)","v":0.75},null,{"$f":"SUM(J584:L586)","v":5.83}]
[null,null,{"$f":"IF(AND(D585<>\"\",A583=\"\"),C584,IF(D585<>\"\",A583,\"\"))","v":"SF-00113"},"Ajudante especializado com encargos complementares","h",0.15,"Sinapi 84162",15.795000000000002,"Sinapi 88243",null,null,{"$f":"ROUND(H585*F585,2)","v":2.37}]
[null,null,"SF-00113","Carpinteiro de esquadria com encargos complementares","h",0.15,"Sinapi 84162",18.045000000000002,"Sinapi 88261",null,null,{"$f":"ROUND(H586*F586,2)","v":2.71}]
[null,null,"",null,null,null,null,""]
["SF-00114","Mármore Bege Bahia para piso e parede","",null,"m2",null,"Sinapi 98671 Adaptada",""]
[null,null,"",null,null,null,null,""]
[null,null,"SF-00114","Argamassa colante tipo ACIII","kg",8.6199999999999992,"Sinapi 98671",1.0980000000000001,"Sinapi 37595",null,{"$f":"ROUNDUP(H590*F590,2)","v":9.4700000000000006},null,{"$f":"SUM(J590:L594)","v":217.97}]
[null,null,"SF-00114","Marmorista/graniteiro com encargos complementares","h",1.1879999999999999,"Sinapi 98671",14.949,"Sinapi 88274",null,null,{"$f":"ROUND(H591*F591,2)","v":17.760000000000002}]
[null,null,"SF-00114","Servente com Encargos Complementares","h",0.59399999999999997,"Sinapi 98671",13.167000000000002,"Sinapi 88316",null,null,{"$f":"ROUND(H592*F592,2)","v":7.82}]
[null,null,"SF-00114","Rejunte branco, cimenticio","kg",0.14000000000000001,"Sinapi 98671",2.0609999999999999,"Sinapi 34356",null,{"$f":"ROUND(H593*F593,2)","v":0.28999999999999998}]
[null,null,"SF-00114","Mármore Bege Bahia, com 20 mm de espessura, para piso e parede","m2",1.1599999999999999,"Sinapi 98671",157.44,"Pesquisa de Preços",null,{"$f":"ROUND(H594*F594,2)","v":182.63}]
[null,null,"",null,null,null,null,""]
["SF-00115","Mármore Branco Especial para piso e parede","",null,"m2",null,"Sinapi 98672 Adaptada",""]
[null,null,"",null,null,null,null,""]
[null,null,"SF-00115","Argamassa colante tipo ACIII","kg",8.6199999999999992,"Sinapi 98672",1.0980000000000001,"Sinapi 37595",null,{"$f":"ROUNDUP(H598*F598,2)","v":9.4700000000000006},null,{"$f":"SUM(J598:L602)","v":371.74}]
[null,null,"SF-00115","Marmorista/graniteiro com encargos complementares","h",1.1879999999999999,"Sinapi 98672",14.949,"Sinapi 88274",null,null,{"$f":"ROUND(H599*F599,2)","v":17.760000000000002}]
[null,null,"SF-00115","Servente com Encargos Complementares","h",0.59399999999999997,"Sinapi 98672",13.167000000000002,"Sinapi 88316",null,null,{"$f":"ROUND(H600*F600,2)","v":7.82}]
[null,null,"SF-00115","Rejunte branco, cimenticio","kg",0.14000000000000001,"Sinapi 98672",2.0609999999999999,"Sinapi 34356",null,{"$f":"ROUND(H601*F601,2)","v":0.28999999999999998}]
[null,null,"SF-00115","Mármore Branco Especial, com 20 mm de espessura, para piso e parede","m2",1.1599999999999999,"Sinapi 98672",290,"Pesquisa de Preços",null,{"$f":"ROUND(H602*F602,2)","v":336.4}]
[null,null,"",null,null,null,null,""]
["SF-00116","Rodapé de madeira","",null,"m",null,"Sinapi 84162",""]
[null,null,"",null,null,null,null,""]
[null,null,"SF-00116","Ajudante especializado com encargos complementares","h",0.15,"Sinapi 84162",15.795000000000002,"Sinapi 88243",null,null,{"$f":"ROUND(H606*F606,2)","v":2.37},{"$f":"SUM(J606:L609)","v":15.09}]
[null,null,"SF-00116","Carpinteiro de esquadria com encargos complementares","h",0.15,"Sinapi 84162",18.045000000000002,"Sinapi 88261",null,null,{"$f":"ROUND(H607*F607,2)","v":2.71}]
[null,null,"SF-00116","Cola a base de resina sintetica para chapa de laminado melaminico","kg",0.04,"Sinapi 84162",18.756,"Sinapi 1339",null,{"$f":"ROUND(H608*F608,2)","v":0.75}]
[null,null,"SF-00116","Rodape de madeira macica cumaru/ipe champanhe ou equivalente da regiao, *1,5 x 7 cm","m",1.03,"Sinapi 84162",8.9909999999999997,"Sinapi 6186",null,{"$f":"ROUND(H609*F609,2)","v":9.26}]
[null,null,"",null,null,null,null,""]
["SF-00123","Granito Cinza Andorinha 20mm para rodabancada","",null,"m2",null,"Sinapi 98671 e Sinapi 98685 Adaptadas",""]
[null,null,"",null,null,null,null,""]
[null,null,"SF-00123","Granito Cinza Andorinha ou similar, com 20 mm de espessura e 150 mm de altura, polido, para rodabancada","m",{"$f":"1.04/0.15","v":6.9333333333333336},"Sinapi 98685 Adaptada",18.75,"Pesquisa de Preços",null,{"$f":"ROUND(H613*F613,2)","v":130},null,{"$f":"SUM(J613:L617)","v":165.33999999999997}]
[null,null,"SF-00123","Argamassa colante tipo ACIII","kg",8.6199999999999992,"Sinapi 98671 Adaptada",1.0980000000000001,"Sinapi 37595",null,{"$f":"ROUNDUP(H614*F614,2)","v":9.4700000000000006}]
[null,null,"SF-00123","Marmorista/graniteiro com encargos complementares","h",1.1879999999999999,"Sinapi 98671 Adaptada",14.949,"Sinapi 88274",null,null,{"$f":"ROUND(H615*F615,2)","v":17.760000000000002}]
[null,null,"SF-00123","Servente com Encargos Complementares","h",0.59399999999999997,"Sinapi 98671 Adaptada",13.167000000000002,"Sinapi 88316",null,null,{"$f":"ROUND(H616*F616,2)","v":7.82}]
[null,null,"SF-00123","Rejunte branco, cimenticio","kg",0.14000000000000001,"Sinapi 98671 Adaptada",2.0609999999999999,"Sinapi 34356",null,{"$f":"ROUND(H617*F617,2)","v":0.28999999999999998}]
[null,null,"",null,null,null,null,""]
["SF-00124","Granito Cinza Andorinha 25mm para bancadas","",null,"m2",null,"Orse 10759 Adaptada",""]
[null,null,"",null,null,null,null,""]
[null,null,"SF-00124","Granito Cinza Andorinha, com 25 mm de espessura, polido, com testeira para acabamento em meia esquadria, para bancadas","m2",1,"Orse 10759",180,"Pesquisa de Preços",null,{"$f":"ROUND(H621*F621,2)","v":180},null,{"$f":"SUM(J621:L625)","v":209.44}]
[null,null,"SF-00124","Cantoneira ferro galvanizado de abas iguais, 1\" x 1/8\" (L x E) , 1,20kg/m","m",0.6,"Orse 10759",5.7960000000000003,"Sinapi 00567",null,{"$f":"ROUNDDOWN(H622*F622,2)","v":3.47}]
[null,null,"SF-00124","Rejunte epoxi branco","kg",{"$f":"0.0351/1.5/0.6","v":3.9E-2},"Sinapi 86889",31.895999999999997,"Sinapi 37329",null,{"$f":"ROUND(H623*F623,2)","v":1.24}]
[null,null,"SF-00124","Marmorista/graniteiro com encargos complementares","h",0.65,"Orse 10759",14.949,"Sinapi 88274",null,null,{"$f":"ROUND(H624*F624,2)","v":9.7200000000000006}]
[null,null,"SF-00124","Servente com Encargos Complementares","h",1.1399999999999999,"Orse 10759",13.167000000000002,"Sinapi 88316",null,null,15.01]
[null,null,"",null,null,null,null,""]
["SF-00125","Granito Cinza Andorinha 30mm para divisória","",null,"m2",null,"Sinapi 79627",""]
[null,null,"",null,null,null,null,""]
[null,null,"SF-00125","Cimento branco","kg",0.7,"Sinapi 79627",2.214,"Sinapi 1380",null,{"$f":"ROUND(H629*F629,2)","v":1.55},null,{"$f":"SUM(J629:L633)","v":299.73}]
[null,null,"SF-00125","Granito Cinza Andorinha ou similar, com 30 mm de espessura, polido em todas as faces aparentes, para divisórias","m2",1,"Sinapi 79627",195,"Pesquisa de Preços",null,{"$f":"ROUND(H630*F630,2)","v":195}]
[null,null,"SF-00125","Marmorista/graniteiro com encargos complementares","h",4.8,"Sinapi 79627",14.949,"Sinapi 88274",null,null,{"$f":"ROUND(H631*F631,2)","v":71.760000000000005}]
[null,null,"SF-00125","Servente com Encargos Complementares","h",2.2999999999999998,"Sinapi 79627",13.167000000000002,"Sinapi 88316",null,null,{"$f":"ROUNDUP(H632*F632,2)","v":30.290000000000003}]
[null,null,"SF-00125","Argamassa traço 1:4 (cimento e areia média), preparo manual. AF_08/2014","m3",3.3E-3,"Sinapi 79627",{"$f":"OFFSET(INDEX('Composições Auxiliares'!A:L,MATCH(D633,'Composições Auxiliares'!A:A,0),12),2,0)","v":342.36},"Sinapi 88631",{"$f":"ROUND(H633*F633,2)","v":1.1299999999999999}]
[null,null,"",null,null,null,null,""]
["SF-00126","Granito Preto São Gabriel 25mm para bancadas","",null,"m2",null,"Orse 10759 Adaptada",""]
[null,null,"",null,null,null,null,""]
[null,null,"SF-00126","Granito Preto São Gabriel ou similar, com 25 mm de espessura, polido, com testeira para acabamento em meia esquadria, para bancadas","m2",1,"Orse 10759",330,"Pesquisa de Preços",null,{"$f":"ROUND(H637*F637,2)","v":330},null,{"$f":"SUM(J637:L641)","v":359.79}]
[null,null,"SF-00126","Cantoneira ferro galvanizado de abas iguais, 1\" x 1/8\" (L x E) , 1,20kg/m","m",0.6,"Orse 10759",5.7960000000000003,"Sinapi 00567",null,{"$f":"ROUNDDOWN(H638*F638,2)","v":3.47}]
[null,null,"SF-00126","Rejunte epoxi cor","kg",{"$f":"0.0351/1.5/0.6","v":3.9E-2},"Sinapi 86889",40.823999999999998,"Sinapi 37398",null,{"$f":"ROUND(H639*F639,2)","v":1.59}]
[null,null,"SF-00126","Marmorista/graniteiro com encargos complementares","h",0.65,"Orse 10759",14.949,"Sinapi 88274",null,null,{"$f":"ROUND(H640*F640,2)","v":9.7200000000000006}]
[null,null,"SF-00126","Servente com Encargos Complementares","h",1.1399999999999999,"Orse 10759",13.167000000000002,"Sinapi 88316",null,null,15.01]
[null,null,"",null,null,null,null,""]
["SF-00127","Granito Preto São Gabriel 20mm para rodabancada","",null,"m2",null,"Sinapi 98671 e Sinapi 98685 Adaptadas",""]
[null,null,"",null,null,null,null,""]
[null,null,"SF-00127","Granito Preto São Gabriel ou similar, com 20 mm de espessura e 150 mm de altura, polido, para rodabancada","m",{"$f":"1.04/0.15","v":6.9333333333333336},"Sinapi 98685 Adaptada",31.5,"Pesquisa de Preços",null,{"$f":"ROUND(H645*F645,2)","v":218.4},null,{"$f":"SUM(J645:L649)","v":253.73999999999998}]
[null,null,"SF-00127","Argamassa colante tipo ACIII","kg",8.6199999999999992,"Sinapi 98671 Adaptada",1.0980000000000001,"Sinapi 37595",null,{"$f":"ROUNDUP(H646*F646,2)","v":9.4700000000000006}]
[null,null,"SF-00127","Marmorista/graniteiro com encargos complementares","h",1.1879999999999999,"Sinapi 98671 Adaptada",14.949,"Sinapi 88274",null,null,{"$f":"ROUND(H647*F647,2)","v":17.760000000000002}]
[null,null,"SF-00127","Servente com Encargos Complementares","h",0.59399999999999997,"Sinapi 98671 Adaptada",13.167000000000002,"Sinapi 88316",null,null,{"$f":"ROUND(H648*F648,2)","v":7.82}]
[null,null,{"$f":"IF(AND(D649<>\"\",A647=\"\"),C648,IF(D649<>\"\",A647,\"\"))","v":"SF-00127"},"Rejunte branco, cimenticio","kg",0.14000000000000001,"Sinapi 98671 Adaptada",2.0609999999999999,"Sinapi 34356",null,{"$f":"ROUND(H649*F649,2)","v":0.28999999999999998}]
[null,null,"",null,null,null,null,""]
["SF-00128","Instalação de bancada de granito ou mármore reaproveitada","",null,"m2",null,"Orse 10759 Adaptada",""]
[null,null,"",null,null,null,null,""]
[null,null,"SF-00128","Cantoneira ferro galvanizado de abas iguais, 1\" x 1/8\" (L x E) , 1,20kg/m","m",1,"Orse 10759 Adaptada",5.7960000000000003,"Sinapi 00567",null,{"$f":"ROUND(H653*F653,2)","v":5.8},null,{"$f":"SUM(J653:L655)","v":30.53}]
[null,null,"SF-00128","Marmorista/graniteiro com encargos complementares","h",0.65,"Orse 10759",14.949,"Sinapi 88274",null,null,{"$f":"ROUND(H654*F654,2)","v":9.7200000000000006}]
[null,null,"SF-00128","Servente com Encargos Complementares","h",1.1399999999999999,"Orse 10759",13.167000000000002,"Sinapi 88316",null,null,15.01]
[null,null,"",null,null,null,null,""]
["SF-00129","Instalação de rodapé reaproveitado, de mármore ou granito ","",null,"m2",null,"Sinapi 98671 Adaptada",""]
[null,null,"",null,null,null,null,""]
[null,null,"SF-00129","Argamassa colante tipo ACIII","kg",8.6199999999999992,"Sinapi 98671 Adaptada",1.0980000000000001,"Sinapi 37595",null,{"$f":"ROUNDUP(H659*F659,2)","v":9.4700000000000006},null,{"$f":"SUM(J659:L662)","v":35.340000000000003}]
[null,null,"SF-00129","Marmorista/graniteiro com encargos complementares","h",1.1879999999999999,"Sinapi 98671 Adaptada",14.949,"Sinapi 88274",null,null,{"$f":"ROUND(H660*F660,2)","v":17.760000000000002}]
[null,null,"SF-00129","Servente com Encargos Complementares","h",0.59399999999999997,"Sinapi 98671 Adaptada",13.167000000000002,"Sinapi 88316",null,null,{"$f":"ROUND(H661*F661,2)","v":7.82}]
[null,null,"SF-00129","Rejunte branco, cimenticio","kg",0.14000000000000001,"Sinapi 98671 Adaptada",2.0609999999999999,"Sinapi 34356",null,{"$f":"ROUND(H662*F662,2)","v":0.28999999999999998}]
[null,null,"",null,null,null,null,""]
["SF-00130","Instalação de soleira ou peitoril, de mármore ou granito, reaproveitados","",null,"m2",null,"Sinapi 98689 Adaptada",""]
[null,null,"",null,null,null,null,""]
[null,null,"SF-00130","Marmorista/graniteiro com encargos complementares","h",1.1879999999999999,"Sinapi 98689",14.949,"Sinapi 88274",null,null,{"$f":"ROUND(H666*F666,2)","v":17.760000000000002},{"$f":"SUM(J666:L668)","v":35.050000000000004}]
[null,null,"SF-00130","Servente com Encargos Complementares","h",0.59399999999999997,"Sinapi 98689",13.167000000000002,"Sinapi 88316",null,null,{"$f":"ROUND(H667*F667,2)","v":7.82}]
[null,null,"SF-00130","Argamassa colante tipo ACIII","kg",8.6199999999999992,"Sinapi 98689",1.0980000000000001,"Sinapi 37595",null,{"$f":"ROUNDUP(H668*F668,2)","v":9.4700000000000006}]
[null,null,"",null,null,null,null,""]
["SF-00131","Mármore Branco Especial 20mm para rodabancada","",null,"m2",null,"Sinapi 98685 Adaptada",""]
[null,null,"",null,null,null,null,""]
[null,null,"SF-00131","Mármore Branco Especial, com 20 mm de espessura e 150 mm de altura, polido, para rodabancada","m",{"$f":"1.04/0.15","v":6.9333333333333336},"Sinapi 98685 Adaptada",44.25,"Pesquisa de Preços",null,{"$f":"ROUND(H672*F672,2)","v":306.8},null,{"$f":"SUM(J672:L676)","v":342.14000000000004}]
[null,null,"SF-00131","Argamassa colante tipo ACIII","kg",8.6199999999999992,"Sinapi 98671 Adaptada",1.0980000000000001,"Sinapi 37595",null,{"$f":"ROUNDUP(H673*F673,2)","v":9.4700000000000006}]
[null,null,"SF-00131","Marmorista/graniteiro com encargos complementares","h",1.1879999999999999,"Sinapi 98671 Adaptada",14.949,"Sinapi 88274",null,null,{"$f":"ROUND(H674*F674,2)","v":17.760000000000002}]
[null,null,"SF-00131","Servente com Encargos Complementares","h",0.59399999999999997,"Sinapi 98671 Adaptada",13.167000000000002,"Sinapi 88316",null,null,{"$f":"ROUND(H675*F675,2)","v":7.82}]
[null,null,"SF-00131","Rejunte branco, cimenticio","kg",0.14000000000000001,"Sinapi 98671 Adaptada",2.0609999999999999,"Sinapi 34356",null,{"$f":"ROUND(H676*F676,2)","v":0.28999999999999998}]
[null,null,"",null,null,null,null,""]
["SF-00138","Instalação de divisória reaproveitada","",null,"m2",null,"Pini 06.102.000005.SER Adaptada",""]
[null,null,"",null,null,null,null,""]
[null,null,"SF-00138","Instalação de divisórias # 35 mm estruturadas em perfis de alumínio, mão de obra para execução","h",1,"Pini 06.102.000005.SER",12.294,"Pini 06.102.000005.SER",null,null,{"$f":"ROUND(H680*F680,2)","v":12.29},{"$f":"SUM(J680:L680)","v":12.29}]
[null,null,"",null,null,null,null,""]
["SF-00139","Alçapão em forro de gesso acartonado","",null,"m2",null,"Sinapi 74073/1 Adaptada",""]
[null,null,"",null,null,null,null,""]
[null,null,"SF-00139","Perfil tipo cantoneira em L, em aco galvanizado, branco, para forro removivel, *23* x 3000 mm (L x C)","m",{"$f":"2*(1.5+0.67)","v":4.34},"Senado Federal",2.3400000000000003,"Sinapi 39572",null,{"$f":"ROUNDDOWN(H684*F684,2)","v":10.15},null,{"$f":"SUM(J684:L687)","v":98.17}]
[null,null,"SF-00139","Placa de PVC com espessura mínima de 5 mm na cor branca","m2",{"$f":"0.36/0.6/0.6","v":1},"Senado Federal",49.73,"Pesquisa de Preços",null,{"$f":"ROUND(H685*F685,2)","v":49.73}]
[null,null,"SF-00139","Gesseiro com encargos complementares","h",{"$f":"0.29/0.6/0.6","v":0.80555555555555558},"Sinapi 74073/1 Adaptada",18.009,"Sinapi 88269",null,null,{"$f":"ROUND(H686*F686,2)","v":14.51}]
[null,null,"SF-00139","Servente com Encargos Complementares","h",{"$f":"0.65/0.6/0.6","v":1.8055555555555558},"Sinapi 74073/1 Adaptada",13.167000000000002,"Sinapi 88316",null,null,{"$f":"ROUNDUP(H687*F687,2)","v":23.78}]
[null,null,"",null,null,null,null,""]
["SF-00140","Forro de PVC em réguas de 100 x 6000mm","",null,"m2",null,"Sinapi 96486 Adaptada",""]
[null,null,"",null,null,null,null,""]
[null,null,"SF-00140","Arame galvanizado 10 BWG, 3,40 mm (0,0713 kg/m)","kg",4.2599999999999999E-2,"Sinapi 96486",9.2160000000000011,"Sinapi 335",null,{"$f":"ROUNDUP(H691*F691,2)","v":0.4},null,{"$f":"SUM(J691:L698)","v":35.700000000000003}]
[null,null,"SF-00140","Forro de PVC, frisado, branco, regua de 10 cm, espessura de 8 mm a 10 mm e comprimento 6 m (sem colocacao)","m2",1.0955999999999999,"Sinapi 96486",13.41,"Sinapi 36230",null,{"$f":"ROUND(H692*F692,2)","v":14.69}]
[null,null,"SF-00140","Perfil canaleta, formato C, em aco zincado, para estrutura forro drywall, E = 0,5 mm, *46 x 18* (L x H), comprimento 3 m","m",3.8498999999999999,"Sinapi 96486",2.79,"Sinapi 39427",null,10.74]
[null,null,"SF-00140","Pendural ou presilha reguladora, em aco galvanizado, com corpo, mola e rebite, para perfil tipo canaleta de estrutura em forros drywall","un",1.3265,"Sinapi 96486",1.044,"Sinapi 39430",null,{"$f":"ROUNDUP(H694*F694,2)","v":1.39}]
[null,null,"SF-00140","Parafuso dry wall, em aco zincado, cabeca lentilha e ponta broca (LB), largura 4,2 mm, comprimento 13 mm","un",2.1911999999999998,"Sinapi 96486",0.12600000000000003,"Sinapi 39443",null,0.28000000000000003]
[null,null,"SF-00140","Parafuso zincado, autobrocante, flangeado, 4,2 x 19\"","cento",1.32E-2,"Sinapi 96486",14.769,"Sinapi 40547",null,{"$f":"ROUNDUP(H696*F696,2)","v":0.2}]
[null,null,"SF-00140","Parafuso, auto atarrachante, cabeca chata, fenda simples, 1/4 (6,35 mm) x 25 mm","cento",3.3300000000000003E-2,"Sinapi 96486",25.317,"Sinapi 40552",null,{"$f":"ROUNDUP(H697*F697,2)","v":0.85}]
[null,null,"SF-00140","Montador de estrutura metálica com encargos complementares","h",0.49940000000000001,"Sinapi 96486",14.301,"Sinapi 88278",null,null,{"$f":"ROUNDUP(H698*F698,2)","v":7.1499999999999995}]
[null,null,"",null,null,null,null,""]
["SF-00141","Forro de PVC em réguas de 100 x 6000mm, sem estrutura","",null,"m2",null,"Sinapi 96486 Adaptada",""]
[null,null,"",null,null,null,null,""]
[null,null,"SF-00141","Forro de PVC, frisado, branco, regua de 10 cm, espessura de 8 mm a 10 mm e comprimento 6 m (sem colocacao)","m2",1.0955999999999999,"Sinapi 96486",13.41,"Sinapi 36230",null,{"$f":"ROUND(H702*F702,2)","v":14.69},null,{"$f":"SUM(J702:L704)","v":17.36}]
[null,null,"SF-00141","Parafuso dry wall, em aco zincado, cabeca lentilha e ponta broca (LB), largura 4,2 mm, comprimento 13 mm","un",2.1911999999999998,"Sinapi 96486",0.12600000000000003,"Sinapi 39443",null,{"$f":"ROUND(H703*F703,2)","v":0.28000000000000003}]
[null,null,"SF-00141","Montador de estrutura metálica com encargos complementares","h",{"$f":"0.4994/3","v":0.16646666666666668},"Sinapi 96486 Adaptada",14.301,"Sinapi 88278",null,null,{"$f":"ROUNDUP(H704*F704,2)","v":2.3899999999999997}]
[null,null,"",null,null,null,null,""]
["SF-00142","Forro de PVC modular em placas","",null,"m2",null,"Orse 05045",""]
[null,null,"",null,null,null,null,""]
[null,null,"SF-00142","Forro de pvc, em placas 1,25 x 0,625, cor branca ou palha, marca Medabil ou similar, inclusive estrutura de fixação (perfís)","m2",1.1000000000000001,"Orse 05045",63,"Orse 04949",null,{"$f":"ROUND(H708*F708,2)","v":69.3},null,{"$f":"SUM(J708:L708)","v":69.3}]
[null,null,"",null,null,null,null,""]
["SF-00143","Forro em chapas metálicas","",null,"m2",null,"Pini 21.104.000040.SER Adaptada",""]
[null,null,"",null,null,null,null,""]
[null,null,"SF-00143","Ajudante de operação em geral com encargos complementares","h",0.5,"Pini 21.104.000040.SER",14.103,"Sinapi 88241",null,null,{"$f":"ROUNDUP(H712*F712,2)","v":7.06},{"$f":"SUM(J712:L715)","v":140.47}]
[null,null,{"$f":"IF(AND(D713<>\"\",A711=\"\"),C712,IF(D713<>\"\",A711,\"\"))","v":"SF-00143"},"Montador de estrutura metálica com encargos complementares","h",0.5,"Pini 21.104.000040.SER",14.301,"Sinapi 88278",null,null,{"$f":"ROUNDUP(H713*F713,2)","v":7.16}]
[null,null,"SF-00143","Forro em chapa galvanizada","m2",1,"Pini 21.104.000040.SER",79.94,"Pesquisa de Preços",null,{"$f":"ROUND(H714*F714,2)","v":79.94}]
[null,null,"SF-00143","Pintura eletrostática","m2",1,"Senado Federal",46.31,"Pesquisa de Preços",null,46.31]
[null,null,"",null,null,null,null,""]
["SF-00144","Forro em gesso acartonado monolítico","",null,"m2",null,"Sinapi 96114",""]
[null,null,"",null,null,null,null,""]
[null,null,"SF-00144","Arame galvanizado 10 BWG, 3,40 mm (0,0713 kg/m)","kg",4.2599999999999999E-2,"Sinapi 96114",9.2160000000000011,"Sinapi 335",null,{"$f":"ROUNDUP(H719*F719,2)","v":0.4},null,{"$f":"SUM(J719:L729)","v":47.710000000000008}]
[null,null,"SF-00144","Chapa de gesso acartonado, Standard (ST), cor branca, E = 12,5 mm, 1200 x 2400 mm (L x C)","m2",1.0966,"Sinapi 96114",17.199000000000002,"Sinapi 39413",null,{"$f":"ROUND(H720*F720,2)","v":18.86}]
[null,null,"SF-00144","Perfil canaleta, formato C, em aco zincado, para estrutura forro drywall, E = 0,5 mm, *46 x 18* (L x H), comprimento 3 m","m",3.851,"Sinapi 96114",2.79,"Sinapi 39427",null,{"$f":"ROUNDUP(H721*F721,2)","v":10.75}]
[null,null,"SF-00144","Pendural ou presilha reguladora, em aco galvanizado, com corpo, mola e rebite, para perfil tipo canaleta de estrutura em forros drywall","un",1.3265,"Sinapi 96114",1.044,"Sinapi 39430",null,{"$f":"ROUNDUP(H722*F722,2)","v":1.39}]
[null,null,"SF-00144","Fita de papel reforcada com lamina de metal para reforco de cantos de chapa de gesso para drywall","m",1.4395,"Sinapi 96114",2.5470000000000002,"Sinapi 39432",null,{"$f":"ROUNDDOWN(H723*F723,2)","v":3.66}]
[null,null,"SF-00144","Massa de rejunte em po para drywall, a base de gesso, secagem rapida, para tratamento de juntas de chapa de gesso (com adicao de agua)","kg",0.5202,"Sinapi 96114",3.42,"Sinapi 39434",null,1.78]
[null,null,"SF-00144","Parafuso dry wall, em aco fosfatizado, cabeca trombeta e ponta agulha (TA), comprimento 25 mm","un",7.9740000000000002,"Sinapi 96114",5.3999999999999999E-2,"Sinapi 39435",null,0.43]
[null,null,"SF-00144","Parafuso dry wall, em aco zincado, cabeca lentilha e ponta broca (LB), largura 4,2 mm, comprimento 13 mm","un",2.1911999999999998,"Sinapi 96114",0.12600000000000003,"Sinapi 39443",null,0.28000000000000003]
[null,null,"SF-00144","Parafuso zincado, autobrocante, flangeado, 4,2 x 19\"","cento",1.32E-2,"Sinapi 96114",14.769,"Sinapi 40547",null,{"$f":"ROUNDUP(H727*F727,2)","v":0.2}]
[null,null,"SF-00144","Montador de estrutura metálica com encargos complementares","h",0.36280000000000001,"Sinapi 96114",14.301,"Sinapi 88278",null,null,{"$f":"ROUNDDOWN(H728*F728,2)","v":5.18}]
[null,null,"SF-00144","Servente com Encargos Complementares","h",0.36280000000000001,"Sinapi 96114",13.167000000000002,"Sinapi 88316",null,null,{"$f":"ROUND(H729*F729,2)","v":4.78}]
[null,null,"",null,null,null,null,""]
["SF-00145","Forro em gesso acartonado monolítico, sem estrutura","",null,"m2",null,"Sinapi 96114 Adaptada",""]
[null,null,"",null,null,null,null,""]
[null,null,"SF-00145","Chapa de gesso acartonado, Standard (ST), cor branca, E = 12,5 mm, 1200 x 2400 mm (L x C)","m2",1.0966,"Sinapi 96114",17.199000000000002,"Sinapi 39413",null,{"$f":"ROUND(H733*F733,2)","v":18.86},null,{"$f":"SUM(J733:L739)","v":34.97}]
[null,null,"SF-00145","Fita de papel reforcada com lamina de metal para reforco de cantos de chapa de gesso para drywall","m",1.4395,"Sinapi 96114",2.5470000000000002,"Sinapi 39432",null,{"$f":"ROUNDDOWN(H734*F734,2)","v":3.66}]
[null,null,"SF-00145","Massa de rejunte em po para drywall, a base de gesso, secagem rapida, para tratamento de juntas de chapa de gesso (com adicao de agua)","kg",0.5202,"Sinapi 96114",3.42,"Sinapi 39434",null,1.78]
[null,null,"SF-00145","Parafuso dry wall, em aco fosfatizado, cabeca trombeta e ponta agulha (TA), comprimento 25 mm","un",7.9740000000000002,"Sinapi 96114",5.3999999999999999E-2,"Sinapi 39435",null,0.43]
[null,null,"SF-00145","Parafuso dry wall, em aco zincado, cabeca lentilha e ponta broca (LB), largura 4,2 mm, comprimento 13 mm","un",2.1911999999999998,"Sinapi 96114",0.12600000000000003,"Sinapi 39443",null,0.28000000000000003]
[null,null,"SF-00145","Montador de estrutura metálica com encargos complementares","h",0.36280000000000001,"Sinapi 96114",14.301,"Sinapi 88278",null,null,{"$f":"ROUNDDOWN(H738*F738,2)","v":5.18}]
[null,null,"SF-00145","Servente com Encargos Complementares","h",0.36280000000000001,"Sinapi 96114",13.167000000000002,"Sinapi 88316",null,null,{"$f":"ROUND(H739*F739,2)","v":4.78}]
[null,null,"",null,null,null,null,""]
["SF-00146","Forro mineral modulado","",null,"m2",null,"Sinapi 39513",""]
[null,null,"",null,null,null,null,""]
[null,null,"SF-00146","Forro de fibra mineral em placas de 625 x 625 mm, e = 15/16 mm, borda rebaixada, com pintura antimofo, apoiado em perfil de aco galvanizado com 24 mm de base - instalado","m2",1,"Sinapi 39513",80.037000000000006,"Sinapi 39513",null,{"$f":"ROUND(H743*F743,2)","v":80.040000000000006},null,{"$f":"SUM(J743:L743)","v":80.040000000000006}]
[null,null,"",null,null,null,null,""]
["SF-00147","Forro mineral modulado, sem estrutura","",null,"m2",null,"Pini 21.101.000010.SER Adaptada",""]
[null,null,"",null,null,null,null,""]
[null,null,"SF-00147","Ajudante especializado com encargos complementares","h",{"$f":"1.2/4","v":0.3},"Pini 21.101.000010.SER Adaptada",15.795000000000002,"Sinapi 88243",null,null,{"$f":"ROUND(H747*F747,2)","v":4.74},{"$f":"SUM(J747:L748)","v":47.29}]
[null,null,"SF-00147","Placa de fibra mineral para forro, de 625 x 625 mm, E = 15 mm, borda reta, com pintura antimofo (nao inclui perfis)","m2",1,"Pini 21.101.000010.SER",42.554879999999997,"Sinapi 39514",null,{"$f":"ROUND(H748*F748,2)","v":42.55}]
[null,null,"",null,null,null,null,""]
["SF-00148","Instalação de forro de PVC reaproveitado","",null,"m2",null,"Sinapi 72201",""]
[null,null,"",null,null,null,null,""]
[null,null,"SF-00148","Carpinteiro de esquadria com encargos complementares","h",0.3,"Sinapi 72201",18.045000000000002,"Sinapi 88261",null,null,{"$f":"ROUNDUP(H752*F752,2)","v":5.42},{"$f":"SUM(J752:L753)","v":9.370000000000001}]
[null,null,"SF-00148","Servente com Encargos Complementares","h",0.3,"Sinapi 72201",13.167000000000002,"Sinapi 88316",null,null,{"$f":"ROUND(H753*F753,2)","v":3.95}]
[null,null,"",null,null,null,null,""]
["SF-00149","Instalação de forro mineral reaproveitado","",null,"m2",null,"Pini 21.101.000010.SER Adaptada",""]
[null,null,"",null,null,null,null,""]
[null,null,"SF-00149","Ajudante especializado com encargos complementares","h",1.2,"Pini 21.101.000010.SER",15.795000000000002,"Sinapi 88243",null,null,{"$f":"ROUND(H757*F757,2)","v":18.95},{"$f":"SUM(J757:L758)","v":36.11}]
[null,null,"SF-00149","Montador de estrutura metálica com encargos complementares","h",1.2,"Pini 21.101.000010.SER",14.301,"Sinapi 88278",null,null,{"$f":"ROUND(H758*F758,2)","v":17.16}]
[null,null,"",null,null,null,null,""]
["SF-00150","Tabica metálica em forro de gesso acartonado","",null,"m",null,"Sinapi 96121 adaptada",""]
[null,null,"",null,null,null,null,""]
[null,null,"SF-00150","Perfil tabica fechada, lisa, formato Z, em aco galvanizado natural, largura total na horizontal *40* mm, para estrutura forro drywall","m",1.1512,"Sinapi 96121",2.7,"Sinapi 39428",null,{"$f":"ROUND(H762*F762,2)","v":3.11},null,{"$f":"SUM(J762:L765)","v":7.18}]
[null,null,"SF-00150","Parafuso dry wall, em aco zincado, cabeca lentilha e ponta broca (LB), largura 4,2 mm, comprimento 13 mm","un",0.58330000000000004,"Sinapi 96121",0.12600000000000003,"Sinapi 39443",null,7.0000000000000007E-2]
[null,null,"SF-00150","Parafuso, auto atarrachante, cabeca chata, fenda simples, 1/4 (6,35 mm) x 25 mm","cento",7.4899999999999994E-2,"Sinapi 96121",25.317,"Sinapi 40552",null,1.9]
[null,null,"SF-00150","Montador de estrutura metálica com encargos complementares","h",0.14680000000000001,"Sinapi 96121",14.301,"Sinapi 88278",null,null,{"$f":"ROUND(H765*F765,2)","v":2.1}]
[null,null,"",null,null,null,null,""]
["SF-00151","Instalação de revestimento de piso têxtil (carpete) reaproveitado","",null,"m2",null,"Seinfra C1914 Adaptada",""]
[null,null,"",null,null,null,null,""]
[null,null,"SF-00151","Servente com Encargos Complementares","h",0.1,"Seinfra C1914",13.167000000000002,"Sinapi 88316",null,null,{"$f":"ROUNDDOWN(H769*F769,2)","v":1.31},{"$f":"SUM(J769:L771)","v":5.13}]
[null,null,"SF-00151","Pedreiro com Encargos Complementares","h",0.1,"Seinfra C1914",18.117000000000001,"Sinapi 88309",null,null,{"$f":"ROUND(H770*F770,2)","v":1.81}]
[null,null,"SF-00151","Adesivo acrílico / cola de contato","kg",0.1,"Seinfra C1914",20.025000000000002,"Sinapi 4791",null,{"$f":"ROUNDUP(H771*F771,2)","v":2.0099999999999998}]
[null,null,"",null,null,null,null,""]
["SF-00152","Baguetes metálicos","",null,"m",null,"Senado Federal",""]
[null,null,"",null,null,null,null,""]
[null,null,"SF-00152","Vidraceiro com encargos complementares","h",0.5,"Senado Federal",16.758000000000003,"Sinapi 88325",null,null,{"$f":"ROUND(H775*F775,2)","v":8.3800000000000008},{"$f":"SUM(J775:L776)","v":11.370000000000001}]
[null,null,"SF-00152","Baguetes metálicos","m",1.05,"Senado Federal",2.85,"Pesquisa de Preços",null,{"$f":"ROUND(H776*F776,2)","v":2.99}]
[null,null,{"$f":"IF(AND(D777<>\"\",A775=\"\"),C776,IF(D777<>\"\",A775,\"\"))","v":""},null,null,null,null,""]
["SF-00153","Cordão de massa de vidraceiro","",null,"m",null,"Sedop 270629 Adaptada",""]
[null,null,"",null,null,null,null,""]
[null,null,"SF-00153","Vidraceiro com encargos complementares","h",0.5,"Sedop 270629",16.758000000000003,"Sinapi 88325",null,null,{"$f":"ROUND(H780*F780,2)","v":8.3800000000000008},{"$f":"SUM(J780:L781)","v":11.13}]
[null,null,"SF-00153","Massa para vidro","kg",0.6,"Sedop 270629",4.5720000000000001,"Sinapi 10498",null,{"$f":"ROUNDUP(H781*F781,2)","v":2.75}]
[null,null,"",null,null,null,null,""]
["SF-00154","Espelho cristal, e=5 mm","",null,"m2",null,"Sinapi 85005 Adaptada",""]
[null,null,"",null,null,null,null,""]
[null,null,"SF-00154","Parafuso frances M16 em aco galvanizado, comprimento = 45 mm, diametro = 16 mm, cabeca abaulada","un",4,"Sinapi 85005",2.5830000000000002,"Sinapi 442",null,{"$f":"ROUND(H785*F785,2)","v":10.33},null,{"$f":"SUM(J785:L788)","v":347.99999999999994}]
[null,null,"SF-00154","Espelho cristal comum #5mm","m2",1,"Sinapi 85005",298.88099999999997,"Pini 27.107.000100.SER",null,{"$f":"ROUND(H786*F786,2)","v":298.88}]
[null,null,"SF-00154","Servente com Encargos Complementares","h",0.4,"Sinapi 85005",13.167000000000002,"Sinapi 88316",null,null,{"$f":"ROUND(H787*F787,2)","v":5.27}]
[null,null,"SF-00154","Vidraceiro com encargos complementares","h",2,"Sinapi 85005",16.758000000000003,"Sinapi 88325",null,null,33.520000000000003]
[null,null,"",null,null,null,null,""]
["SF-00155","Instalação de vidro reaproveitado","",null,"m2",null,"Sinapi 72117 Adaptada",""]
[null,null,"",null,null,null,null,""]
[null,null,"SF-00155","Servente com Encargos Complementares","h",0.45,"Sinapi 72117",13.167000000000002,"Sinapi 88316",null,null,{"$f":"ROUNDDOWN(H792*F792,2)","v":5.92},{"$f":"SUM(J792:L794)","v":20.78}]
[null,null,"SF-00155","Vidraceiro com encargos complementares","h",0.45,"Sinapi 72117",16.758000000000003,"Sinapi 88325",null,null,{"$f":"ROUND(H793*F793,2)","v":7.54}]
[null,null,"SF-00155","Massa para vidro","kg",1.6,"Sinapi 72117",4.5720000000000001,"Sinapi 10498",null,{"$f":"ROUND(H794*F794,2)","v":7.32}]
[null,null,"",null,null,null,null,""]
["SF-00156","Substituição da calafetação com selante","",null,"m",null,"Senado Federal",""]
[null,null,"",null,null,null,null,""]
[null,null,"SF-00156","Vidraceiro com encargos complementares","h",0.6,"Sedop 270629 Adaptada",16.758000000000003,"Sinapi 88325",null,null,{"$f":"ROUND(H798*F798,2)","v":10.050000000000001},{"$f":"SUM(J798:L799)","v":12.870000000000001}]
[null,null,"SF-00156","Silicone acetico uso geral incolor 280 g","un",0.3,"Senado Federal",9.3870000000000005,"Sinapi 39961",null,{"$f":"ROUND(H799*F799,2)","v":2.82}]
[null,null,"",null,null,null,null,""]
[null,null,"","Observação: foi adotado consumo mediano a partir da tabela em http://www.daybrasil.com.br/assets/uploads/ficha_tecnica/efb759d1c3d8118e05a816645725525d.pdf",null,null,null,""]
[null,null,"",null,null,null,null,""]
["SF-00157","Vidro liso comum transparente 4mm","",null,"m2",null,"Sinapi 72117",""]
[null,null,"",null,null,null,null,""]
[null,null,"SF-00157","Servente com Encargos Complementares","h",0.45,"Sinapi 72117",13.167000000000002,"Sinapi 88316",null,null,{"$f":"ROUNDDOWN(H805*F805,2)","v":5.92},{"$f":"SUM(J805:L808)","v":92.769999999999982}]
[null,null,"SF-00157","Vidraceiro com encargos complementares","h",0.45,"Sinapi 72117",16.758000000000003,"Sinapi 88325",null,null,{"$f":"ROUND(H806*F806,2)","v":7.54}]
[null,null,"SF-00157","Vidro liso incolor 4mm - sem colocacao","m2",1,"Sinapi 72117",71.991,"Sinapi 10492",null,{"$f":"ROUND(H807*F807,2)","v":71.989999999999995}]
[null,null,"SF-00157","Massa para vidro","kg",1.6,"Sinapi 72117",4.5720000000000001,"Sinapi 10498",null,{"$f":"ROUND(H808*F808,2)","v":7.32}]
[null,null,"",null,null,null,null,""]
["SF-00158","Vidro liso comum transparente 6mm","",null,"m2",null,"Sinapi 84959",""]
[null,null,"",null,null,null,null,""]
[null,null,"SF-00158","Servente com Encargos Complementares","h",0.2,"Sinapi 84959",13.167000000000002,"Sinapi 88316",null,null,{"$f":"ROUNDUP(H812*F812,2)","v":2.6399999999999997},{"$f":"SUM(J812:L815)","v":130.54000000000002}]
[null,null,"SF-00158","Vidraceiro com encargos complementares","h",1,"Sinapi 84959",16.758000000000003,"Sinapi 88325",null,null,{"$f":"ROUND(H813*F813,2)","v":16.760000000000002}]
[null,null,"SF-00158","Vidro liso incolor 6mm - sem colocacao","m2",1,"Sinapi 84959",101.997,"Sinapi 10491",null,{"$f":"ROUND(H814*F814,2)","v":102}]
[null,null,"SF-00158","Massa para vidro","kg",2,"Sinapi 84959",4.5720000000000001,"Sinapi 10498",null,{"$f":"ROUND(H815*F815,2)","v":9.14}]
[null,null,"",null,null,null,null,""]
["SF-00159","Instalação de painéis de vidro temperado reaproveitados","",null,"m2",null,"Orse 05041 Adaptada",""]
[null,null,"",null,null,null,null,""]
[null,null,"SF-00159","Vidraceiro com encargos complementares","h",{"$f":"2.2/2","v":1.1000000000000001},"Orse 05041 Adaptada",16.758000000000003,"Sinapi 88325",null,null,{"$f":"ROUND(H819*F819,2)","v":18.43},{"$f":"SUM(J819:L820)","v":32.909999999999997}]
[null,null,"SF-00159","Servente com Encargos Complementares","h",{"$f":"2.2/2","v":1.1000000000000001},"Orse 05041 Adaptada",13.167000000000002,"Sinapi 88316",null,null,{"$f":"ROUND(H820*F820,2)","v":14.48}]
[null,null,"",null,null,null,null,""]
["SF-00160","Mola hidráulica de piso","",null,"un",null,"Sinapi 84886 Adaptada",""]
[null,null,"",null,null,null,null,""]
[null,null,"SF-00160","Vidraceiro com encargos complementares","h",0.75,"Sinapi 84886",16.758000000000003,"Sinapi 88325",null,null,{"$f":"ROUND(H824*F824,2)","v":12.57},{"$f":"SUM(J824:L826)","v":763.47}]
[null,null,"SF-00160","Servente com Encargos Complementares","h",0.3,"Sinapi 84886",13.167000000000002,"Sinapi 88316",null,null,3.95]
[null,null,"SF-00160","Mola hidráulica. Ref.:\nMola: Dorma BTS 75 V/R; Soprano P330.\nImpermeabilizante: Dorma SealProtect","un",1,"Sinapi 84886",746.95,"Pesquisa de Preços",null,{"$f":"ROUND(H826*F826,2)","v":746.95}]
[null,null,"",null,null,null,null,""]
["SF-00161","Instalação de persianas reaproveitadas","",null,"m",null,"Senado Federal",""]
[null,null,"",null,null,null,null,""]
[null,null,"SF-00161","Ajudante especializado com encargos complementares","h",0.33333333333333331,"Senado Federal",15.795000000000002,"Sinapi 88243",null,null,{"$f":"ROUND(H830*F830,2)","v":5.27},{"$f":"SUM(J830:L830)","v":5.27}]
[null,null,"",null,null,null,null,""]
["SF-00166","Tubo de Ligação Bacia Ajustável Completo","",null,"un",null,"Orse 03707 Adaptada",""]
[null,null,"",null,null,null,null,""]
[null,null,"SF-00166","Encanador ou Bombeiro Hidráulico com Encargos Complementares","h",0.2,"Orse 03707",18.081,"Sinapi 88267",null,null,{"$f":"ROUND(H834*F834,2)","v":3.62},{"$f":"SUM(J834:L835)","v":61.96}]
[null,null,"SF-00166","Tubo de ligação em PVC, com anel expansor para vaso sanitário, acabamento cromado, DECA 1968C ou similar","un",1,"Orse 03707",58.337999999999994,"Orse 02898",null,{"$f":"ROUND(H835*F835,2)","v":58.34}]
[null,null,"",null,null,null,null,""]
["SF-00167","Tubo PVC esgoto ou aguas pluviais predial DN 100mm","",null,"m",null,"Sinapi 89512",""]
[null,null,"",null,null,null,null,""]
[null,null,"SF-00167","Adesivo plastico para PVC, frasco com 850 gr","un",4.2900000000000001E-2,89512,48.456000000000003,122,null,{"$f":"ROUND(H839*F839,2)","v":2.08},null,{"$f":"SUM(J839:L844)","v":33.200000000000003}]
[null,null,"SF-00167","Tubo PVC, serie R, DN 100 mm, para esgoto ou aguas pluviais predial (NBR 5688)","m",1.04,89512,13.148999999999999,9841,null,13.67]
[null,null,{"$f":"IF(AND(D841<>\"\",A839=\"\"),C840,IF(D841<>\"\",A839,\"\"))","v":"SF-00167"},"Solucao limpadora para PVC, frasco com 1000 cm3","un",7.0099999999999996E-2,89512,42.075000000000003,20083,null,2.95]
[null,null,"SF-00167","Lixa d'agua em folha, grao 100","un",0.14849999999999999,89512,1.593,38383,null,{"$f":"ROUNDDOWN(H842*F842,2)","v":0.23}]
[null,null,"SF-00167","Auxiliar de encanador ou bombeiro hidráulico com encargos complementares","h",0.44500000000000001,89512,13.977,"Sinapi 88248",null,null,{"$f":"ROUND(H843*F843,2)","v":6.22}]
[null,null,"SF-00167","Encanador ou Bombeiro Hidráulico com Encargos Complementares","h",0.44500000000000001,89512,18.081,"Sinapi 88267",null,null,8.0500000000000007]
[null,null,"",null,null,null,null,""]
["SF-00168","Tubo PVC esgoto ou aguas pluviais predial DN 40mm","",null,"m",null,"Sinapi 89508",""]
[null,null,"",null,null,null,null,""]
[null,null,"SF-00168","Tubo PVC, serie R, DN 40 mm, para esgoto ou aguas pluviais predial (NBR 5688)","m",1.04,"Sinapi 89508",4.7160000000000002,20067,null,{"$f":"ROUNDUP(H848*F848,2)","v":4.91},null,{"$f":"SUM(J848:L851)","v":10.25}]
[null,null,"SF-00168","Lixa d'agua em folha, grao 100","un",3.6999999999999998E-2,"Sinapi 89508",1.593,38383,null,{"$f":"ROUND(H849*F849,2)","v":0.06}]
[null,null,"SF-00168","Auxiliar de encanador ou bombeiro hidráulico com encargos complementares","h",0.16500000000000001,"Sinapi 89508",13.977,"Sinapi 88248",null,null,{"$f":"ROUNDDOWN(H850*F850,2)","v":2.2999999999999998}]
[null,null,"SF-00168","Encanador ou Bombeiro Hidráulico com Encargos Complementares","h",0.16500000000000001,"Sinapi 89508",18.081,"Sinapi 88267",null,null,{"$f":"ROUND(H851*F851,2)","v":2.98}]
[null,null,"",null,null,null,null,""]
["SF-00169","Tubo PVC esgoto ou aguas pluviais predial DN 50mm","",null,"m",null,"Sinapi 89509",""]
[null,null,"",null,null,null,null,""]
[null,null,"SF-00169","Adesivo plastico para PVC, frasco com 850 gr","un",1.2800000000000001E-2,"Sinapi 89509",48.456000000000003,122,null,{"$f":"ROUND(H855*F855,2)","v":0.62},null,{"$f":"SUM(J855:L860)","v":14.75}]
[null,null,"SF-00169","Tubo PVC, serie R, DN 50 mm, para esgoto ou aguas pluviais predial (NBR 5688)","m",1.04,"Sinapi 89509",6.2729999999999997,20068,null,{"$f":"ROUNDUP(H856*F856,2)","v":6.5299999999999994}]
[null,null,"SF-00169","Solucao limpadora para PVC, frasco com 1000 cm3","un",1.9300000000000001E-2,"Sinapi 89509",42.075000000000003,20083,null,0.81]
[null,null,"SF-00169","Lixa d'agua em folha, grao 100","un",3.6999999999999998E-2,"Sinapi 89509",1.593,38383,null,0.06]
[null,null,"SF-00169","Auxiliar de encanador ou bombeiro hidráulico com encargos complementares","h",0.21,"Sinapi 89509",13.977,"Sinapi 88248",null,null,{"$f":"ROUNDDOWN(H859*F859,2)","v":2.93}]
[null,null,"SF-00169","Encanador ou Bombeiro Hidráulico com Encargos Complementares","h",0.21,"Sinapi 89509",18.081,"Sinapi 88267",null,null,{"$f":"ROUND(H860*F860,2)","v":3.8}]
[null,null,"",null,null,null,null,""]
["SF-00170","Tubo PVC esgoto ou aguas pluviais predial DN 75mm","",null,"m",null,"Sinapi 89511",""]
[null,null,"",null,null,null,null,""]
[null,null,"SF-00170","Adesivo plastico para PVC, frasco com 850 gr","un",2.93E-2,"Sinapi 89511",48.456000000000003,122,null,{"$f":"ROUND(H864*F864,2)","v":1.42},null,{"$f":"SUM(J864:L869)","v":22.24}]
[null,null,"SF-00170","Tubo PVC, serie R, DN 75 mm, para esgoto ou aguas pluviais predial (NBR 5688)","m",1.04,"Sinapi 89511",7.9829999999999997,9839,null,8.3000000000000007]
[null,null,"SF-00170","Solucao limpadora para PVC, frasco com 1000 cm3","un",4.5499999999999999E-2,"Sinapi 89511",42.075000000000003,20083,null,{"$f":"ROUNDUP(H866*F866,2)","v":1.92}]
[null,null,"SF-00170","Lixa d'agua em folha, grao 100","un",0.1085,"Sinapi 89511",1.593,38383,null,0.17]
[null,null,"SF-00170","Auxiliar de encanador ou bombeiro hidráulico com encargos complementares","h",0.32500000000000001,"Sinapi 89511",13.977,"Sinapi 88248",null,null,{"$f":"ROUNDUP(H868*F868,2)","v":4.55}]
[null,null,"SF-00170","Encanador ou Bombeiro Hidráulico com Encargos Complementares","h",0.32500000000000001,"Sinapi 89511",18.081,"Sinapi 88267",null,null,{"$f":"ROUND(H869*F869,2)","v":5.88}]
[null,null,"",null,null,null,null,""]
["SF-00171","Tubo PVC soldavel agua fria DN 25mm","",null,"m",null,"Sinapi 89446",""]
[null,null,"",null,null,null,null,""]
[null,null,"SF-00171","Tubo PVC, soldavel, DN 25 mm, agua fria (NBR-5648)","m",1.0609999999999999,"Sinapi 89446",1.7909999999999999,9868,null,{"$f":"ROUND(H873*F873,2)","v":1.9},null,{"$f":"SUM(J873:L875)","v":2.42}]
[null,null,"SF-00171","Auxiliar de encanador ou bombeiro hidráulico com encargos complementares","h",1.6E-2,"Sinapi 89446",13.977,"Sinapi 88248",null,null,{"$f":"ROUNDUP(H874*F874,2)","v":0.23}]
[null,null,"SF-00171","Encanador ou Bombeiro Hidráulico com Encargos Complementares","h",1.6E-2,"Sinapi 89446",18.081,"Sinapi 88267",null,null,{"$f":"ROUND(H875*F875,2)","v":0.28999999999999998}]
[null,null,"",null,null,null,null,""]
["SF-00172","Tubo PVC soldavel agua fria DN 32mm","",null,"m",null,"Sinapi 89447",""]
[null,null,"",null,null,null,null,""]
[null,null,"SF-00172","Tubo PVC, soldavel, DN 32 mm, agua fria (NBR-5648)","m",1.0609999999999999,"Sinapi 89447",3.8429999999999995,9869,null,{"$f":"ROUND(H879*F879,2)","v":4.08},null,{"$f":"SUM(J879:L881)","v":4.7200000000000006}]
[null,null,"SF-00172","Auxiliar de encanador ou bombeiro hidráulico com encargos complementares","h",0.02,"Sinapi 89447",13.977,"Sinapi 88248",null,null,{"$f":"ROUND(H880*F880,2)","v":0.28000000000000003}]
[null,null,"SF-00172","Encanador ou Bombeiro Hidráulico com Encargos Complementares","h",0.02,"Sinapi 89447",18.081,"Sinapi 88267",null,null,0.36]
[null,null,"",null,null,null,null,""]
["SF-00173","Tubo PVC soldavel agua fria DN 40mm","",null,"m",null,"Sinapi 89448",""]
[null,null,"",null,null,null,null,""]
[null,null,"SF-00173","Tubo PVC, soldavel, DN 40 mm, agua fria (NBR-5648)","m",1.0609999999999999,"Sinapi 89448",5.6070000000000002,9874,null,{"$f":"ROUND(H885*F885,2)","v":5.95},null,{"$f":"SUM(J885:L888)","v":6.72}]
[null,null,"SF-00173","Lixa d'agua em folha, grao 100","un",8.0000000000000002E-3,"Sinapi 89448",1.593,38383,null,0.01]
[null,null,"SF-00173","Auxiliar de encanador ou bombeiro hidráulico com encargos complementares","h",2.4E-2,"Sinapi 89448",13.977,"Sinapi 88248",null,null,{"$f":"ROUNDDOWN(H887*F887,2)","v":0.33}]
[null,null,"SF-00173","Encanador ou Bombeiro Hidráulico com Encargos Complementares","h",2.4E-2,"Sinapi 89448",18.081,"Sinapi 88267",null,null,{"$f":"ROUND(H888*F888,2)","v":0.43}]
[null,null,"",null,null,null,null,""]
["SF-00174","Tubo PVC soldavel agua fria DN 50mm","",null,"m",null,"Sinapi 89449",""]
[null,null,"",null,null,null,null,""]
[null,null,"SF-00174","Tubo PVC, soldavel, DN 50 mm, agua fria (NBR-5648)","m",1.0609999999999999,"Sinapi 89449",6.9479999999999995,9875,null,{"$f":"ROUND(H892*F892,2)","v":7.37},null,{"$f":"SUM(J892:L895)","v":8.32}]
[null,null,"SF-00174","Lixa d'agua em folha, grao 100","un",0.01,"Sinapi 89449",1.593,38383,null,0.02]
[null,null,"SF-00174","Auxiliar de encanador ou bombeiro hidráulico com encargos complementares","h",2.9000000000000001E-2,"Sinapi 89449",13.977,"Sinapi 88248",null,null,{"$f":"ROUND(H894*F894,2)","v":0.41}]
[null,null,"SF-00174","Encanador ou Bombeiro Hidráulico com Encargos Complementares","h",2.9000000000000001E-2,"Sinapi 89449",18.081,"Sinapi 88267",null,null,0.52]
[null,null,"",null,null,null,null,""]
["SF-00175","Base registro gaveta 3/4\"","",null,"un",null,"Sinapi 89987 Adaptada",""]
[null,null,"",null,null,null,null,""]
[null,null,"SF-00175","Base registro gaveta 3/4\" em latão, mod 1509 ref: DECA ou similar","un ",1,"Sinapi 89987",35.42,"Pesquisa de preços",null,{"$f":"ROUND(H899*F899,2)","v":35.42},null,{"$f":"SUM(J899:L902)","v":44.17}]
[null,null,"SF-00175","Fita de vedação para tubos e conexões roscáveis, rolo de 50 m x 18 mm","un ",1.2999999999999999E-2,"Sinapi 89987",8.1630000000000003,"Sinapi 3148",null,{"$f":"ROUND(H900*F900,2)","v":0.11}]
[null,null,"SF-00175","Encanador ou Bombeiro Hidráulico com Encargos Complementares","h",0.3,"Sinapi 89987",18.081,"Sinapi 88267",null,null,{"$f":"ROUNDUP(H901*F901,2)","v":5.43}]
[null,null,"SF-00175","Auxiliar de encanador ou bombeiro hidráulico com encargos complementares","h",0.23,"Sinapi 89987",13.977,"Sinapi 88248",null,null,{"$f":"ROUND(H902*F902,2)","v":3.21}]
[null,null,"",null,null,null,null,""]
["SF-00176","Caixa sifonada de PVC DN 150mm","",null,"un",null,"Sinapi 89708",""]
[null,null,{"$f":"IF(AND(D905<>\"\",A903=\"\"),C904,IF(D905<>\"\",A903,\"\"))","v":""},null,null,null,null,""]
[null,null,"SF-00176","Auxiliar de encanador ou bombeiro hidráulico com encargos complementares","h",0.38,"Sinapi 89708",13.977,"Sinapi 88248",null,null,{"$f":"ROUND(H906*F906,2)","v":5.31},{"$f":"SUM(J906:L913)","v":52.320000000000007}]
[null,null,"SF-00176","Encanador ou Bombeiro Hidráulico com Encargos Complementares","h",0.38,"Sinapi 89708",18.081,"Sinapi 88267",null,null,{"$f":"ROUND(H907*F907,2)","v":6.87}]
[null,null,"SF-00176","Adesivo plastico para PVC, frasco com 850 gr","un",1.4800000000000001E-2,"Sinapi 89708",48.456000000000003,"Sinapi 00122",null,{"$f":"ROUND(H908*F908,2)","v":0.72}]
[null,null,"SF-00176","Anel borracha para tubo esgoto predial DN 75 mm (NBR 5688)","un",1,"Sinapi 89708",1.4669999999999999,"Sinapi 297",null,{"$f":"ROUND(H909*F909,2)","v":1.47}]
[null,null,"SF-00176","Lixa d'agua em folha, grao 100","un",5.7000000000000002E-2,"Sinapi 89708",1.593,"Sinapi 38383",null,0.09]
[null,null,"SF-00176","Caixa sifonada PVC, 150 x 185 x 75 mm, com grelha quadrada branca","un",1,"Sinapi 89708",36.378,"Sinapi 11714",null,36.380000000000003]
[null,null,"SF-00176","Pasta lubrificante para tubos e conexoes com junta elastica (uso em PVC, aco, polietileno e outros) ( de *400* g)","un",0.03,"Sinapi 89708",17.739000000000001,"Sinapi 20078",null,0.53]
[null,null,"SF-00176","Solucao limpadora para PVC, frasco com 1000 cm3","un",2.2499999999999999E-2,"Sinapi 89708",42.075000000000003,"Sinapi 20083",null,0.95]
[null,null,"",null,null,null,null,""]
["SF-00177","Caixa sifonada de PVC DN 250mm","",null,"un",null,"Sinapi 89708 Adaptada",""]
[null,null,"",null,null,null,null,""]
[null,null,"SF-00177","Auxiliar de encanador ou bombeiro hidráulico com encargos complementares","h",0.38,"Sinapi 89708",13.977,"Sinapi 88248",null,null,{"$f":"ROUND(H917*F917,2)","v":5.31},{"$f":"SUM(J917:L924)","v":91.179999999999993}]
[null,null,"SF-00177","Encanador ou Bombeiro Hidráulico com Encargos Complementares","h",0.38,"Sinapi 89708",18.081,"Sinapi 88267",null,null,{"$f":"ROUND(H918*F918,2)","v":6.87}]
[null,null,"SF-00177","Adesivo plastico para PVC, frasco com 850 gr","un",1.4800000000000001E-2,"Sinapi 89708",48.456000000000003,"Sinapi 00122",null,{"$f":"ROUND(H919*F919,2)","v":0.72}]
[null,null,"SF-00177","Anel borracha para tubo esgoto predial DN 75 mm (NBR 5688)","un",1,"Sinapi 89708",1.4669999999999999,"Sinapi 297",null,{"$f":"ROUND(H920*F920,2)","v":1.47}]
[null,null,"SF-00177","Lixa d'agua em folha, grao 100","un",5.7000000000000002E-2,"Sinapi 89708",1.593,"Sinapi 38383",null,0.09]
[null,null,"SF-00177","Caixa sifonada PVC, 250 x 230 x 75 mm, com tampa cega branca","un",1,"Sinapi 89708",75.239999999999995,"Sinapi 11880",null,75.239999999999995]
[null,null,"SF-00177","Pasta lubrificante para tubos e conexoes com junta elastica (uso em PVC, aco, polietileno e outros) ( de *400* g)","un",0.03,"Sinapi 89708",17.739000000000001,"Sinapi 20078",null,0.53]
[null,null,"SF-00177","Solucao limpadora para PVC, frasco com 1000 cm3","un",2.2499999999999999E-2,"Sinapi 89708",42.075000000000003,"Sinapi 20083",null,0.95]
[null,null,"",null,null,null,null,""]
["SF-00178","Grelha quadrada para ralo 10x10cm","",null,"un",null,"Orse 09419 Adaptada",""]
[null,null,"",null,null,null,null,""]
[null,null,"SF-00178","Grelha quadrada para ralo, com caixilho, dimensões 10x10cm, em Aço polido, ref.: Moldenox ou similar","un ",1,"Orse 09419",37.39,"Pesquisa de Preços",null,{"$f":"ROUND(H928*F928,2)","v":37.39},null,{"$f":"SUM(J928:L929)","v":39.36}]
[null,null,"SF-00178","Servente com Encargos Complementares","h",0.15,"Orse 09419",13.167000000000002,"Sinapi 88316",null,null,{"$f":"ROUNDDOWN(H929*F929,2)","v":1.97}]
[null,null,"",null,null,null,null,""]
["SF-00179","Grelha quadrada para ralo 15x15cm","",null,"un",null,"Orse 09419 Adaptada",""]
[null,null,"",null,null,null,null,""]
[null,null,"SF-00179","Grelha quadrada para ralo, com caixilho, dimensões 15x15cm, em Aço polido, ref.: Moldenox ou similar","un ",1,"Orse 09419",63.2,"Pesquisa de Preços",null,{"$f":"ROUND(H933*F933,2)","v":63.2},null,{"$f":"SUM(J933:L934)","v":65.17}]
[null,null,"SF-00179","Servente com Encargos Complementares","h",0.15,"Orse 09419",13.167000000000002,"Sinapi 88316",null,null,{"$f":"ROUNDDOWN(H934*F934,2)","v":1.97}]
[null,null,"",null,null,null,null,""]
["SF-00180","Ralo seco PVC DN 100x40mm","",null,"un",null,"Sinapi 89710",""]
[null,null,"",null,null,null,null,""]
[null,null,"SF-00180","Auxiliar de encanador ou bombeiro hidráulico com encargos complementares","h",7.0000000000000007E-2,"Sinapi 89710",13.977,"Sinapi 88248",null,null,{"$f":"ROUND(H938*F938,2)","v":0.98},{"$f":"SUM(J938:L943)","v":8.61}]
[null,null,"SF-00180","Encanador ou Bombeiro Hidráulico com Encargos Complementares","h",7.0000000000000007E-2,"Sinapi 89710",18.081,"Sinapi 88267",null,null,{"$f":"ROUND(H939*F939,2)","v":1.27}]
[null,null,"SF-00180","Adesivo plastico para PVC, frasco com 850 gr","un",4.8999999999999998E-3,"Sinapi 89710",48.456000000000003,"Sinapi 00122",null,{"$f":"ROUNDDOWN(H940*F940,2)","v":0.23}]
[null,null,"SF-00180","Lixa d'agua em folha, grao 100","un",1.7000000000000001E-2,"Sinapi 89710",1.593,"Sinapi 38383",null,{"$f":"ROUND(H941*F941,2)","v":0.03}]
[null,null,"SF-00180","Ralo seco PVC conico, 100 x 40 mm,  com grelha redonda branca","un",1,"Sinapi 89710",5.7780000000000005,"Sinapi 11739",null,5.78]
[null,null,"SF-00180","Solucao limpadora para PVC, frasco com 1000 cm3","un",7.4999999999999997E-3,"Sinapi 89710",42.075000000000003,"Sinapi 20083",null,0.32]
[null,null,"",null,null,null,null,""]
["SF-00181","Assento para bacia convencional – Linha Administrativa","",null,"un",null,"Orse 02056 Adaptada",""]
[null,null,"",null,null,null,null,""]
[null,null,"SF-00181","Assento sanitario de plastico, tipo convencional","un ",1,"Orse 02056",20.646000000000001,"Sinapi 377",null,{"$f":"ROUND(H947*F947,2)","v":20.65},null,{"$f":"SUM(J947:L948)","v":21.959999999999997}]
[null,null,"SF-00181","Servente com Encargos Complementares","h",0.1,"Orse 02056",13.167000000000002,"Sinapi 88316",null,null,{"$f":"ROUNDDOWN(H948*F948,2)","v":1.31}]
[null,null,"",null,null,null,null,""]
["SF-00182","Bacia convencional – Linha Administrativa","",null,"un",null,"Sinapi 95469 Adaptada",""]
[null,null,"",null,null,null,null,""]
[null,null,"SF-00182","Bacia sanitaria (vaso) convencional de louca branca","un ",1,"Sinapi 95469",102.483,"Sinapi 10420",null,{"$f":"ROUND(H952*F952,2)","v":102.48},null,{"$f":"SUM(J952:L958)","v":211.54000000000002}]
[null,null,"SF-00182","Tubo de ligação em PVC, com anel expansor para vaso sanitário, acabamento cromado, DECA 1968C ou similar","un",1,"Orse 03707",58.337999999999994,"Orse 02898",null,{"$f":"ROUND(H953*F953,2)","v":58.34}]
[null,null,"SF-00182","Parafuso niquelado com acabamento cromado para fixar peca sanitaria, inclui porca cega, arruela e bucha de nylon tamanho S-10","un ",2,"Sinapi 95469",12.15,"Sinapi 4384",null,{"$f":"ROUND(H954*F954,2)","v":24.3}]
[null,null,"SF-00182","Vedacao PVC, 100 mm, para saida vaso sanitario","un",1,"Sinapi 95469",1.827,"Sinapi 6138",null,{"$f":"ROUND(H955*F955,2)","v":1.83}]
[null,null,"SF-00182","Rejunte epoxi branco","kg",0.1469,"Sinapi 95469",31.895999999999997,"Sinapi 37329",null,{"$f":"ROUND(H956*F956,2)","v":4.6900000000000004}]
[null,null,"SF-00182","Encanador ou Bombeiro Hidráulico com Encargos Complementares","h",0.78,"Sinapi 95469",18.081,"Sinapi 88267",null,null,{"$f":"ROUND(H957*F957,2)","v":14.1}]
[null,null,"SF-00182","Servente com Encargos Complementares","h",0.44,"Sinapi 95469",13.167000000000002,"Sinapi 88316",null,null,{"$f":"ROUNDUP(H958*F958,2)","v":5.8}]
[null,null,"",null,null,null,null,""]
["SF-00183","Bacia convencional com saída horizontal","",null,"un",null,"Sinapi 95469 Adaptada",""]
[null,null,"",null,null,null,null,""]
[null,null,"SF-00183","Bacia convencional com saída horizontal (Modelo P.90.17 – Linha Ravena – Deca)","un ",1,"Sinapi 95469",175.75,"Pesquisa de Preços",null,{"$f":"ROUND(H962*F962,2)","v":175.75},null,{"$f":"SUM(J962:L967)","v":226.47000000000003}]
[null,null,"SF-00183","Parafuso niquelado com acabamento cromado para fixar peca sanitaria, inclui porca cega, arruela e bucha de nylon tamanho S-10","un ",2,"Sinapi 95469",12.15,"Sinapi 4384",null,{"$f":"ROUND(H963*F963,2)","v":24.3}]
[null,null,"SF-00183","Vedacao PVC, 100 mm, para saida vaso sanitario","un",1,"Sinapi 95469",1.827,"Sinapi 6138",null,{"$f":"ROUND(H964*F964,2)","v":1.83}]
[null,null,"SF-00183","Rejunte epoxi branco","kg",0.1469,"Sinapi 95469",31.895999999999997,"Sinapi 37329",null,{"$f":"ROUND(H965*F965,2)","v":4.6900000000000004}]
[null,null,"SF-00183","Encanador ou Bombeiro Hidráulico com Encargos Complementares","h",0.78,"Sinapi 95469",18.081,"Sinapi 88267",null,null,{"$f":"ROUND(H966*F966,2)","v":14.1}]
[null,null,"SF-00183","Servente com Encargos Complementares","h",0.44,"Sinapi 95469",13.167000000000002,"Sinapi 88316",null,null,{"$f":"ROUNDUP(H967*F967,2)","v":5.8}]
[null,null,"",null,null,null,null,""]
["SF-00184","Cuba oval de embutir",{"$f":"IF(AND(D969<>\"\",A967=\"\"),C968,IF(D969<>\"\",A967,\"\"))","v":""},null,"un",null,"Sinapi 86901 Adaptada",""]
[null,null,"",null,null,null,null,""]
[null,null,"SF-00184","Cuba oval de embutir, mod.: L37, cor branca ref: DECA ou similar","un ",1,"Sinapi 86901",56.6,"Pesquisa de Preços",null,{"$f":"ROUND(H971*F971,2)","v":56.6},null,{"$f":"SUM(J971:L974)","v":87.43}]
[null,null,"SF-00184","Massa plastica para marmore/granito","kg",0.52710000000000001,"Sinapi 86901",27.63,"Sinapi 4823",null,{"$f":"ROUND(H972*F972,2)","v":14.56}]
[null,null,"SF-00184","Servente com Encargos Complementares","h",0.27,"Sinapi 86901",13.167000000000002,"Sinapi 88316",null,null,{"$f":"ROUND(H973*F973,2)","v":3.56}]
[null,null,"SF-00184","Marmorista/graniteiro com encargos complementares","h",0.85,"Sinapi 86901",14.949,"Sinapi 88274",null,null,{"$f":"ROUND(H974*F974,2)","v":12.71}]
[null,null,"",null,null,null,null,""]
["SF-00185","Cuba retangular em aço inox – Linha Administrativa","",null,"un",null,"Sinapi 86900",""]
[null,null,"",null,null,null,null,""]
[null,null,"SF-00185","Cuba aco inox (AISI 304) de embutir com valvula de 3 1/2 \", de *56 x 33 x 12* cm","un ",1,"Sinapi 86900",121.96800000000002,"Sinapi 1747",null,{"$f":"ROUND(H978*F978,2)","v":121.97},null,{"$f":"SUM(J978:L981)","v":139.32999999999998}]
[null,null,"SF-00185","Massa plastica para marmore/granito","kg",0.2974,"Sinapi 86900",27.63,"Sinapi 4823",null,{"$f":"ROUND(H979*F979,2)","v":8.2200000000000006}]
[null,null,"SF-00185","Marmorista/graniteiro com encargos complementares","h",0.48,"Sinapi 86900",14.949,"Sinapi 88274",null,null,{"$f":"ROUNDDOWN(H980*F980,2)","v":7.17}]
[null,null,"SF-00185","Servente com Encargos Complementares","h",0.15,"Sinapi 86900",13.167000000000002,"Sinapi 88316",null,null,{"$f":"ROUNDDOWN(H981*F981,2)","v":1.97}]
[null,null,"",null,null,null,null,""]
["SF-00186","Cuba semiencaixe quadrada com mesa","",null,"un",null,"Sinapi 86901 Adaptada",""]
[null,null,"",null,null,null,null,""]
[null,null,"SF-00186","Cuba semi-encaixe com mesa, mod.: L830 ref: DECA ou similar","un ",1,"Sinapi 86901",506.9,"Pesquisa de Preços",null,{"$f":"ROUND(H985*F985,2)","v":506.9},null,{"$f":"SUM(J985:L988)","v":537.7299999999999}]
[null,null,"SF-00186","Massa plastica para marmore/granito","kg",0.52710000000000001,"Sinapi 86901",27.63,"Sinapi 4823",null,{"$f":"ROUND(H986*F986,2)","v":14.56}]
[null,null,"SF-00186","Servente com Encargos Complementares","h",0.27,"Sinapi 86901",13.167000000000002,"Sinapi 88316",null,null,{"$f":"ROUND(H987*F987,2)","v":3.56}]
[null,null,"SF-00186","Marmorista/graniteiro com encargos complementares","h",0.85,"Sinapi 86901",14.949,"Sinapi 88274",null,null,{"$f":"ROUND(H988*F988,2)","v":12.71}]
[null,null,"",null,null,null,null,""]
["SF-00187","Instalação de lavatório reaproveitado","",null,"un",null,"Sinapi 86904 Adaptada",""]
[null,null,"",null,null,null,null,""]
[null,null,"SF-00187","Parafuso niquelado 3 1/2\" com acabamento cromado para fixar peca sanitaria, inclui porca cega, arruela e bucha de nylon tamanho S-8","un ",2,"Sinapi 86904",9.0090000000000003,"Sinapi 4351",null,{"$f":"ROUND(H992*F992,2)","v":18.02},null,{"$f":"SUM(J992:L995)","v":29.2}]
[null,null,"SF-00187","Rejunte epoxi branco","kg",5.0700000000000002E-2,"Sinapi 86904",31.895999999999997,"Sinapi 37329",null,{"$f":"ROUND(H993*F993,2)","v":1.62}]
[null,null,"SF-00187","Encanador ou Bombeiro Hidráulico com Encargos Complementares","h",0.39,"Sinapi 86904",18.081,"Sinapi 88267",null,null,{"$f":"ROUNDUP(H994*F994,2)","v":7.06}]
[null,null,"SF-00187","Servente com Encargos Complementares","h",0.19,"Sinapi 86904",13.167000000000002,"Sinapi 88316",null,null,{"$f":"ROUND(H995*F995,2)","v":2.5}]
[null,null,"",null,null,null,null,""]
["SF-00188","Instalação de mictório reaproveitado","",null,"un",null,"Sinapi 74234/1",""]
[null,null,"",null,null,null,null,""]
[null,null,"SF-00188","Parafuso niquelado 3 1/2\" com acabamento cromado para fixar peca sanitaria, inclui porca cega, arruela e bucha de nylon tamanho S-8","un ",2,"Sinapi 74234/1",9.0090000000000003,"Sinapi 4351",null,{"$f":"ROUND(H999*F999,2)","v":18.02},null,{"$f":"SUM(J999:L1002)","v":92.22}]
[null,null,"SF-00188","Fita veda rosca em rolos de 18 mm x 10 m (L x C)","un ",7.5999999999999998E-2,"Sinapi 74234/1",2.214,"Sinapi 3146",null,{"$f":"ROUND(H1000*F1000,2)","v":0.17}]
[null,null,"SF-00188","Auxiliar de encanador ou bombeiro hidráulico com encargos complementares","h",{"$f":"3.2-0.05-0.7","v":2.4500000000000002},"Sinapi 74234/1 Adaptada",13.977,"Sinapi 88248",null,null,{"$f":"ROUNDUP(H1001*F1001,2)","v":34.25}]
[null,null,"SF-00188","Encanador ou Bombeiro Hidráulico com Encargos Complementares","h",{"$f":"3.2-0.15-0.85","v":2.2000000000000002},"Sinapi 74234/1 Adaptada",18.081,"Sinapi 88267",null,null,{"$f":"ROUND(H1002*F1002,2)","v":39.78}]
[null,null,"",null,null,null,null,""]
[null,null,"","Obs: Considerando a redução de MO indicada nas composições SINAPI 86887 e SINAPI 40729",null,null,null,""]
[null,null,"",null,null,null,null,""]
["SF-00189","Instalação de vaso sanitário reaproveitado","",null,"un",null,"Sinapi 95471 Adaptada",""]
[null,null,"",null,null,null,null,""]
[null,null,"SF-00189","Parafuso niquelado com acabamento cromado para fixar peca sanitaria, inclui porca cega, arruela e bucha de nylon tamanho S-10","un ",2,"Sinapi 95469",12.15,"Sinapi 4384",null,{"$f":"ROUND(H1008*F1008,2)","v":24.3},null,{"$f":"SUM(J1008:L1012)","v":50.72}]
[null,null,"SF-00189","Vedacao PVC, 100 mm, para saida vaso sanitario","un",1,"Sinapi 95469",1.827,"Sinapi 6138",null,{"$f":"ROUND(H1009*F1009,2)","v":1.83}]
[null,null,"SF-00189","Rejunte epoxi branco","kg",0.1469,"Sinapi 95469",31.895999999999997,"Sinapi 37329",null,{"$f":"ROUND(H1010*F1010,2)","v":4.6900000000000004}]
[null,null,"SF-00189","Encanador ou Bombeiro Hidráulico com Encargos Complementares","h",0.78,"Sinapi 95469",18.081,"Sinapi 88267",null,null,{"$f":"ROUND(H1011*F1011,2)","v":14.1}]
[null,null,"SF-00189","Servente com Encargos Complementares","h",0.44,"Sinapi 95469",13.167000000000002,"Sinapi 88316",null,null,{"$f":"ROUNDUP(H1012*F1012,2)","v":5.8}]
[null,null,"",null,null,null,null,""]
["SF-00190","Lavatório suspenso","",null,"un",null,"Sinapi 86904",""]
[null,null,"",null,null,null,null,""]
[null,null,"SF-00190","Lavatorio louca branca suspenso *40 x 30* cm","un ",1,"Sinapi 86904",66.879000000000005,"Sinapi 10425",null,{"$f":"ROUND(H1016*F1016,2)","v":66.88},null,{"$f":"SUM(J1016:L1020)","v":96.08}]
[null,null,"SF-00190","Parafuso niquelado 3 1/2\" com acabamento cromado para fixar peca sanitaria, inclui porca cega, arruela e bucha de nylon tamanho S-8","un ",2,"Sinapi 86904",9.0090000000000003,"Sinapi 4351",null,{"$f":"ROUND(H1017*F1017,2)","v":18.02}]
[null,null,"SF-00190","Rejunte epoxi branco","kg",5.0700000000000002E-2,"Sinapi 86904",31.895999999999997,"Sinapi 37329",null,{"$f":"ROUND(H1018*F1018,2)","v":1.62}]
[null,null,"SF-00190","Encanador ou Bombeiro Hidráulico com Encargos Complementares","h",0.39,"Sinapi 86904",18.081,"Sinapi 88267",null,null,{"$f":"ROUNDUP(H1019*F1019,2)","v":7.06}]
[null,null,"SF-00190","Servente com Encargos Complementares","h",0.19,"Sinapi 86904",13.167000000000002,"Sinapi 88316",null,null,{"$f":"ROUND(H1020*F1020,2)","v":2.5}]
[null,null,"",null,null,null,null,""]
["SF-00191","Mictório – Linha Administrativa","",null,"un",null,"Sinapi 74234/1 Adaptada",""]
[null,null,"",null,null,null,null,""]
[null,null,"SF-00191","Mictorio sifonado louca branca sem complementos","un ",1,"Sinapi 74234/1",232.983,"Sinapi 10432",null,{"$f":"ROUND(H1024*F1024,2)","v":232.98},null,{"$f":"SUM(J1024:L1028)","v":325.19999999999993}]
[null,null,"SF-00191","Parafuso niquelado 3 1/2\" com acabamento cromado para fixar peca sanitaria, inclui porca cega, arruela e bucha de nylon tamanho S-8","un ",2,"Sinapi 74234/1",9.0090000000000003,"Sinapi 4351",null,{"$f":"ROUND(H1025*F1025,2)","v":18.02}]
[null,null,"SF-00191","Fita veda rosca em rolos de 18 mm x 10 m (L x C)","un ",7.5999999999999998E-2,"Sinapi 74234/1",2.214,"Sinapi 3146",null,{"$f":"ROUND(H1026*F1026,2)","v":0.17}]
[null,null,"SF-00191","Auxiliar de encanador ou bombeiro hidráulico com encargos complementares","h",{"$f":"3.2-0.05-0.7","v":2.4500000000000002},"Sinapi 74234/1 Adaptada",13.977,"Sinapi 88248",null,null,{"$f":"ROUNDUP(H1027*F1027,2)","v":34.25}]
[null,null,"SF-00191","Encanador ou Bombeiro Hidráulico com Encargos Complementares","h",{"$f":"3.2-0.15-0.85","v":2.2000000000000002},"Sinapi 74234/1 Adaptada",18.081,"Sinapi 88267",null,null,{"$f":"ROUND(H1028*F1028,2)","v":39.78}]
[null,null,"",null,null,null,null,""]
[null,null,"","Obs: Considerando a redução de MO indicada nas composições SINAPI 86887 e SINAPI 40729",null,null,null,""]
[null,null,"",null,null,null,null,""]
["SF-00192","Tanque 38 litros – Linha Administrativa","",null,"un",null,"Sinapi 86874 Adaptada",""]
[null,null,{"$f":"IF(AND(D1033<>\"\",A1031=\"\"),C1032,IF(D1033<>\"\",A1031,\"\"))","v":""},null,null,null,null,""]
[null,null,"SF-00192","Tanque de louça com capacidade de 38 litros na cor branca, suspenso, sem coluna","un ",1,"Sinapi 86874",298.57,"Pesquisa de Preços",null,{"$f":"ROUND(H1034*F1034,2)","v":298.57},null,{"$f":"SUM(J1034:L1038)","v":355.97}]
[null,null,"SF-00192","Parafuso niquelado 3 1/2\" com acabamento cromado para fixar peca sanitaria, inclui porca cega, arruela e bucha de nylon tamanho S-8","un ",4,"Sinapi 86874",9.0090000000000003,"Sinapi 4351",null,{"$f":"ROUND(H1035*F1035,2)","v":36.04}]
[null,null,"SF-00192","Rejunte epoxi branco","kg",6.5000000000000002E-2,"Sinapi 86874",31.895999999999997,"Sinapi 37329",null,{"$f":"ROUND(H1036*F1036,2)","v":2.0699999999999998}]
[null,null,"SF-00192","Encanador ou Bombeiro Hidráulico com Encargos Complementares","h",0.82,"Sinapi 86874",18.081,"Sinapi 88267",null,null,{"$f":"ROUNDDOWN(H1037*F1037,2)","v":14.82}]
[null,null,"SF-00192","Servente com Encargos Complementares","h",0.34,"Sinapi 86874",13.167000000000002,"Sinapi 88316",null,null,{"$f":"ROUNDDOWN(H1038*F1038,2)","v":4.47}]
[null,null,"",null,null,null,null,""]
["SF-00193","Acabamento para registro GD – Linha Administrativa","",null,"un",null,"Orse 8436 Adaptada",""]
[null,null,"",null,null,null,null,""]
[null,null,"SF-00193","Acabamento para registro de gaveta de 1 ¼” a 1 ½” (GD), cromado. Ref.: Modelo 4900.C35.GD – Linha Aspen – Deca","un ",1,"Orse 8436",40.75,"Pesquisa de Preços",null,{"$f":"ROUND(H1042*F1042,2)","v":40.75},null,{"$f":"SUM(J1042:L1043)","v":42.2}]
[null,null,"SF-00193","Encanador ou Bombeiro Hidráulico com Encargos Complementares","h",0.08,"Orse 8436",18.081,"Sinapi 88267",null,null,{"$f":"ROUND(H1043*F1043,2)","v":1.45}]
[null,null,"",null,null,null," ",""]
["SF-00194","Acabamento para registro PQ – Linha Administrativa","",null,"un",null,"Orse 8436 Adaptada",""]
[null,null,"",null,null,null,null,""]
[null,null,"SF-00194","Acabamento para registro de gaveta e pressão até 1” (PQ), cromado. Ref.: Modelo, 4900.C35.PQ – Linha Aspen – Deca","un ",1,"Orse 8436",32.299999999999997,"Pesquisa de Preços",null,{"$f":"ROUND(H1047*F1047,2)","v":32.299999999999997},null,{"$f":"SUM(J1047:L1048)","v":33.75}]
[null,null,"SF-00194","Encanador ou Bombeiro Hidráulico com Encargos Complementares","h",0.08,"Orse 8436",18.081,"Sinapi 88267",null,null,{"$f":"ROUND(H1048*F1048,2)","v":1.45}]
[null,null,"",null,null,null,null,""]
["SF-00195","Ducha higiênica – Linha Administrativa","",null,"un",null,"Pini 26.108.000090.SER Adaptada",""]
[null,null,"",null,null,null,null,""]
[null,null,"SF-00195","Ducha higiênica com registro e derivação, com gatilho branco e flexível de 1,2m. Ref.: Modelo 1984.C35.ACT – Linha Aspen – Deca","un ",1,"Pini 26.108.000090.SER",205.785,"Orse 08294",null,{"$f":"ROUND(H1052*F1052,2)","v":205.79},null,{"$f":"SUM(J1052:L1054)","v":221.83}]
[null,null,"SF-00195","Encanador ou Bombeiro Hidráulico com Encargos Complementares","h",0.5,"Pini 26.108.000090.SER",18.081,"Sinapi 88267",null,null,{"$f":"ROUNDUP(H1053*F1053,2)","v":9.0499999999999989}]
[null,null,"SF-00195","Auxiliar de encanador ou bombeiro hidráulico com encargos complementares","h",0.5,"Pini 26.108.000090.SER",13.977,"Sinapi 88248",null,null,{"$f":"ROUND(H1054*F1054,2)","v":6.99}]
[null,null,"",null,null,null,null,""]
["SF-00196","Instalação de metais e acessórios reaproveitados","",null,"un",null,"Sinapi 95541",""]
[null,null,"",null,null,null,null,""]
[null,null,"SF-00196","Encanador ou Bombeiro Hidráulico com Encargos Complementares","h",0.16209999999999999,"Sinapi 95541",18.081,"Sinapi 88267",null,null,{"$f":"ROUND(H1058*F1058,2)","v":2.93},{"$f":"SUM(J1058:L1059)","v":3.25}]
[null,null,"SF-00196","Auxiliar de encanador ou bombeiro hidráulico com encargos complementares","h",2.2700000000000001E-2,"Sinapi 95541",13.977,"Sinapi 88248",null,null,{"$f":"ROUND(H1059*F1059,2)","v":0.32}]
[null,null,"",null,null,null,null,""]
["SF-00197","Ligação flexível 1/2” x 40 cm – Linha Administrativa","",null,"un",null,"Sinapi 86887",""]
[null,null,"",null,null,null,null,""]
[null,null,"SF-00197","Engate / rabicho flexivel inox 1/2 \" x 40 cm","un ",1,"Sinapi 86887",22.581,"Sinapi 11684",null,{"$f":"ROUND(H1063*F1063,2)","v":22.58},null,{"$f":"SUM(J1063:L1066)","v":25.99}]
[null,null,"SF-00197","Fita veda rosca em rolos de 18 mm x 10 m (L x C)","un ",1.7500000000000002E-2,"Sinapi 86887",2.214,"Sinapi 3146",null,{"$f":"ROUND(H1064*F1064,2)","v":0.04}]
[null,null,"SF-00197","Encanador ou Bombeiro Hidráulico com Encargos Complementares","h",0.15,"Sinapi 86887",18.081,"Sinapi 88267",null,null,{"$f":"ROUND(H1065*F1065,2)","v":2.71}]
[null,null,"SF-00197","Servente com Encargos Complementares","h",0.05,"Sinapi 86887",13.167000000000002,"Sinapi 88316",null,null,{"$f":"ROUND(H1066*F1066,2)","v":0.66}]
[null,null,"",null,null,null,null,""]
["SF-00198","Sifão articulado para cozinha – Linha Administrativa","",null,"un",null,"Sinapi 86881 Adaptada",""]
[null,null,"",null,null,null,null,""]
[null,null,"SF-00198","Sifão regulável com tubo de saída corrugado para cozinha, cromado.  Ref.: Modelo VSM182 – Esteves","un ",1,"Sinapi 86881",186.58,"Pesquisa de Preços",null,{"$f":"ROUND(H1070*F1070,2)","v":186.58},null,{"$f":"SUM(J1070:L1073)","v":192.76000000000002}]
[null,null,"SF-00198","Fita veda rosca em rolos de 18 mm x 10 m (L x C)","un ",0.05,"Sinapi 86881",2.214,"Sinapi 3146",null,{"$f":"ROUND(H1071*F1071,2)","v":0.11}]
[null,null,"SF-00198","Servente com Encargos Complementares","h",0.09,"Sinapi 86881",13.167000000000002,"Sinapi 88316",null,null,{"$f":"ROUND(H1072*F1072,2)","v":1.19}]
[null,null,"SF-00198","Encanador ou Bombeiro Hidráulico com Encargos Complementares","h",0.27,"Sinapi 86881",18.081,"Sinapi 88267",null,null,{"$f":"ROUND(H1073*F1073,2)","v":4.88}]
[null,null,"",null,null,null,null,""]
["SF-00199","Sifão para lavatório 1 1/2\"","",null,"un",null,"Sinapi 86881",""]
[null,null,"",null,null,null,null,""]
[null,null,"SF-00199","Sifao em metal cromado para pia ou lavatorio, 1 x 1.1/2 \"","un ",1,"Sinapi 86881",89.991,"Sinapi 6136",null,{"$f":"ROUND(H1077*F1077,2)","v":89.99},null,{"$f":"SUM(J1077:L1080)","v":92.78}]
[null,null,"SF-00199","Fita veda rosca em rolos de 18 mm x 10 m (L x C)","un ",0.04,"Sinapi 86881",2.214,"Sinapi 3146",null,{"$f":"ROUND(H1078*F1078,2)","v":0.09}]
[null,null,"SF-00199","Encanador ou Bombeiro Hidráulico com Encargos Complementares","h",0.12,"Sinapi 86881",18.081,"Sinapi 88267",null,null,{"$f":"ROUND(H1079*F1079,2)","v":2.17}]
[null,null,"SF-00199","Servente com Encargos Complementares","h",0.04,"Sinapi 86881",13.167000000000002,"Sinapi 88316",null,null,{"$f":"ROUND(H1080*F1080,2)","v":0.53}]
[null,null,"",null,null,null,null,""]
["SF-00200","Sifão para tanque – Linha Administrativa","",null,"un",null,"Sinapi 86881 Adaptada",""]
[null,null,"",null,null,null,null,""]
[null,null,"SF-00200","Fita veda rosca em rolos de 18 mm x 10 m (L x C)","un ",0.05,"Sinapi 86881",2.214,"Sinapi 3146",null,{"$f":"ROUND(H1084*F1084,2)","v":0.11},null,{"$f":"SUM(J1084:L1087)","v":101.44999999999999}]
[null,null,"SF-00200","Servente com Encargos Complementares","h",0.09,"Sinapi 86881",13.167000000000002,"Sinapi 88316",null,null,{"$f":"ROUND(H1085*F1085,2)","v":1.19}]
[null,null,"SF-00200","Encanador ou Bombeiro Hidráulico com Encargos Complementares","h",0.27,"Sinapi 86881",18.081,"Sinapi 88267",null,null,{"$f":"ROUND(H1086*F1086,2)","v":4.88}]
[null,null,"SF-00200","Sifao em metal cromado para tanque, 1.1/4 x 1.1/2 \"","un",1,"Sinapi 86881",95.274000000000001,"Sinapi 38638",null,{"$f":"ROUND(H1087*F1087,2)","v":95.27}]
[null,null,"",null,null,null,null,""]
["SF-00201","Torneira de mesa para cozinha bica móvel – Linha Administrativa","",null,"un",null,"Sinapi 86910 Adaptada",""]
[null,null,"",null,null,null,null,""]
[null,null,"SF-00201","Torneira de mesa para cozinha, cromada. Ref.: Deca Targa 1167.C40.CR","un ",1,"Sinapi 86910",253,"Pesquisa de Preços",null,{"$f":"ROUND(H1091*F1091,2)","v":253},null,{"$f":"SUM(J1091:L1094)","v":256.8}]
[null,null,"SF-00201","Fita veda rosca em rolos de 18 mm x 10 m (L x C)","un ",3.04E-2,"Sinapi 86910",2.214,"Sinapi 3146",null,{"$f":"ROUNDDOWN(H1092*F1092,2)","v":0.06}]
[null,null,"SF-00201","Encanador ou Bombeiro Hidráulico com Encargos Complementares","h",0.17,"Sinapi 86910",18.081,"Sinapi 88267",null,null,{"$f":"ROUNDUP(H1093*F1093,2)","v":3.0799999999999996}]
[null,null,"SF-00201","Servente com Encargos Complementares","h",0.05,"Sinapi 86910",13.167000000000002,"Sinapi 88316",null,null,{"$f":"ROUND(H1094*F1094,2)","v":0.66}]
[null,null,"",null,null,null,null,""]
["SF-00202","Torneira de mesa para cozinha bica móvel – Linha Administrativa","",null,"un",null,"Sinapi 86910 Adaptada",""]
[null,null,{"$f":"IF(AND(D1097<>\"\",A1095=\"\"),C1096,IF(D1097<>\"\",A1095,\"\"))","v":""},null,null,null,null,""]
[null,null,"SF-00202","Torneira de mesa bica móvel com arejador articulado para cozinha, cromada. Ref.: Código B5814C2CRB – Linha City – Celite","un ",1,"Sinapi 86910",150.1,"Pesquisa de Preços",null,{"$f":"ROUND(H1098*F1098,2)","v":150.1},null,{"$f":"SUM(J1098:L1101)","v":153.9}]
[null,null,"SF-00202","Fita veda rosca em rolos de 18 mm x 10 m (L x C)","un ",3.04E-2,"Sinapi 86910",2.214,"Sinapi 3146",null,{"$f":"ROUNDDOWN(H1099*F1099,2)","v":0.06}]
[null,null,"SF-00202","Encanador ou Bombeiro Hidráulico com Encargos Complementares","h",0.17,"Sinapi 86910",18.081,"Sinapi 88267",null,null,{"$f":"ROUNDUP(H1100*F1100,2)","v":3.0799999999999996}]
[null,null,"SF-00202","Servente com Encargos Complementares","h",0.05,"Sinapi 86910",13.167000000000002,"Sinapi 88316",null,null,{"$f":"ROUND(H1101*F1101,2)","v":0.66}]
[null,null,"",null,null,null,null,""]
["SF-00203","Torneira de mesa para lavatório – Linha Acessibilidade","",null,"un",null,"Sinapi 86915 Adaptada",""]
[null,null,"",null,null,null,null,""]
[null,null,"SF-00203","Torneira de mesa para lavatório, para uso clínico e apoio à pessoa. Ref.: Deca Link 1196.CLNK","un ",1,"Sinapi 86915",234,"Pesquisa de Preços",null,{"$f":"ROUND(H1105*F1105,2)","v":234},null,{"$f":"SUM(J1105:L1108)","v":236.27}]
[null,null,"SF-00203","Fita veda rosca em rolos de 18 mm x 10 m (L x C)","un ",3.04E-2,"Sinapi 86915",2.214,"Sinapi 3146",null,{"$f":"ROUNDDOWN(H1106*F1106,2)","v":0.06}]
[null,null,"SF-00203","Encanador ou Bombeiro Hidráulico com Encargos Complementares","h",0.1,"Sinapi 86915",18.081,"Sinapi 88267",null,null,{"$f":"ROUND(H1107*F1107,2)","v":1.81}]
[null,null,"SF-00203","Servente com Encargos Complementares","h",0.03,"Sinapi 86915",13.167000000000002,"Sinapi 88316",null,null,{"$f":"ROUND(H1108*F1108,2)","v":0.4}]
[null,null,"",null,null,null,null,""]
["SF-00204","Torneira de mesa para lavatório bica alta – Linha Administrativa","",null,"un",null,"Sinapi 86915 Adaptada",""]
[null,null,"",null,null,null,null,""]
[null,null,"SF-00204","Torneira de mesa para lavatorio, bica alta, com arejador, cromado. Ref.: Código B5810C2CRB – Linha City – Celite","un ",1,"Sinapi 86915",143.52000000000001,"Pesquisa de Preços",null,{"$f":"ROUND(H1112*F1112,2)","v":143.52000000000001},null,{"$f":"SUM(J1112:L1115)","v":145.79000000000002}]
[null,null,"SF-00204","Fita veda rosca em rolos de 18 mm x 10 m (L x C)","un ",3.04E-2,"Sinapi 86915",2.214,"Sinapi 3146",null,{"$f":"ROUNDDOWN(H1113*F1113,2)","v":0.06}]
[null,null,"SF-00204","Encanador ou Bombeiro Hidráulico com Encargos Complementares","h",0.1,"Sinapi 86915",18.081,"Sinapi 88267",null,null,{"$f":"ROUND(H1114*F1114,2)","v":1.81}]
[null,null,"SF-00204","Servente com Encargos Complementares","h",0.03,"Sinapi 86915",13.167000000000002,"Sinapi 88316",null,null,{"$f":"ROUND(H1115*F1115,2)","v":0.4}]
[null,null,"",null,null,null,null,""]
["SF-00205","Torneira de mesa para lavatório bica baixa – Linha Administrativa","",null,"un",null,"Sinapi 86915 Adaptada",""]
[null,null,"",null,null,null,null,""]
[null,null,"SF-00205","Torneira de mesa para lavatorio bica baixa. Ref.: Código B5811C2CRB – Linha City – Celite","un ",1,"Sinapi 86915",110.69,"Pesquisa de Preços",null,{"$f":"ROUND(H1119*F1119,2)","v":110.69},null,{"$f":"SUM(J1119:L1122)","v":112.96000000000001}]
[null,null,"SF-00205","Fita veda rosca em rolos de 18 mm x 10 m (L x C)","un ",3.04E-2,"Sinapi 86915",2.214,"Sinapi 3146",null,{"$f":"ROUNDDOWN(H1120*F1120,2)","v":0.06}]
[null,null,"SF-00205","Encanador ou Bombeiro Hidráulico com Encargos Complementares","h",0.1,"Sinapi 86915",18.081,"Sinapi 88267",null,null,{"$f":"ROUND(H1121*F1121,2)","v":1.81}]
[null,null,"SF-00205","Servente com Encargos Complementares","h",0.03,"Sinapi 86915",13.167000000000002,"Sinapi 88316",null,null,{"$f":"ROUND(H1122*F1122,2)","v":0.4}]
[null,null,"",null,null,null,null,""]
["SF-00206","Torneira de mesa para lavatório com fechamento automático – Linha Administrativa","",null,"un",null,"Sinapi 86915 Adaptada",""]
[null,null,"",null,null,null,null,""]
[null,null,"SF-00206","Torneira cromada de mesa para lavatorio temporizada\npressao bica baixa","un ",1,"Sinapi 86915",137.934,"Sinapi 36796",null,{"$f":"ROUND(H1126*F1126,2)","v":137.93},null,{"$f":"SUM(J1126:L1129)","v":140.20000000000002}]
[null,null,"SF-00206","Fita veda rosca em rolos de 18 mm x 10 m (L x C)","un ",3.04E-2,"Sinapi 86915",2.214,"Sinapi 3146",null,{"$f":"ROUNDDOWN(H1127*F1127,2)","v":0.06}]
[null,null,"SF-00206","Encanador ou Bombeiro Hidráulico com Encargos Complementares","h",0.1,"Sinapi 86915",18.081,"Sinapi 88267",null,null,{"$f":"ROUND(H1128*F1128,2)","v":1.81}]
[null,null,"SF-00206","Servente com Encargos Complementares","h",0.03,"Sinapi 86915",13.167000000000002,"Sinapi 88316",null,null,{"$f":"ROUND(H1129*F1129,2)","v":0.4}]
[null,null,"",null,null,null,null,""]
["SF-00207","Torneira de parede para cozinha bica móvel – Linha Administrativa","",null,"un",null,"Sinapi 86910 Adaptada",""]
[null,null,"",null,null,null,null,""]
[null,null,"SF-00207","Torneira de parede para cozinha bica móvel com arejador articulado, cromada. Ref.: Código B5815C2CRB – Linha City – Celite","un ",1,"Sinapi 86910",151.51,"Pesquisa de Preços",null,{"$f":"ROUND(H1133*F1133,2)","v":151.51},null,{"$f":"SUM(J1133:L1136)","v":155.31}]
[null,null,"SF-00207","Fita veda rosca em rolos de 18 mm x 10 m (L x C)","un ",3.04E-2,"Sinapi 86910",2.214,"Sinapi 3146",null,{"$f":"ROUNDDOWN(H1134*F1134,2)","v":0.06}]
[null,null,"SF-00207","Encanador ou Bombeiro Hidráulico com Encargos Complementares","h",0.17,"Sinapi 86910",18.081,"Sinapi 88267",null,null,{"$f":"ROUNDUP(H1135*F1135,2)","v":3.0799999999999996}]
[null,null,"SF-00207","Servente com Encargos Complementares","h",0.05,"Sinapi 86910",13.167000000000002,"Sinapi 88316",null,null,{"$f":"ROUND(H1136*F1136,2)","v":0.66}]
[null,null,"",null,null,null,null,""]
["SF-00208","Torneira de parede para tanque – Linha Administrativa","",null,"un",null,"Sinapi 86914 Adaptada",""]
[null,null,"",null,null,null,null,""]
[null,null,"SF-00208","Fita veda rosca em rolos de 18 mm x 10 m (L x C)","un ",3.04E-2,"Sinapi 86914",2.214,"Sinapi 3146",null,{"$f":"ROUNDDOWN(H1140*F1140,2)","v":0.06},null,{"$f":"SUM(J1140:L1143)","v":52.51}]
[null,null,"SF-00208","Encanador ou Bombeiro Hidráulico com Encargos Complementares","h",0.15,"Sinapi 86914",18.081,"Sinapi 88267",null,null,{"$f":"ROUND(H1141*F1141,2)","v":2.71}]
[null,null,"SF-00208","Servente com Encargos Complementares","h",0.05,"Sinapi 86914",13.167000000000002,"Sinapi 88316",null,null,{"$f":"ROUND(H1142*F1142,2)","v":0.66}]
[null,null,"SF-00208","Torneira cromada com bico para jardim/tanque 1/2 \" ou 3/4 \" (ref 1153)","un",1,"Sinapi 86914",49.077000000000005,"Sinapi 11762",null,{"$f":"ROUND(H1143*F1143,2)","v":49.08}]
[null,null,"",null,null,null,null,""]
["SF-00209","Válvula de descarga 1 1/2\" – Linha Acessibilidade","",null,"un",null,"Sinapi 40729 Adaptada",""]
[null,null,"",null,null,null,null,""]
[null,null,"SF-00209","Válvula de descarga 1 1/2\" cromada. ref.: modelo 2565.C.112.CONF – linha Hydra Eco Conforto – Deca ","un ",1,"Sinapi 40729",403.86,"Pesquisa de Preços",null,{"$f":"ROUND(H1147*F1147,2)","v":403.86},null,{"$f":"SUM(J1147:L1151)","v":431.05}]
[null,null,"SF-00209","Estopa","kg",0.12,"Sinapi 40729",9,"Sinapi 13",null,{"$f":"ROUND(H1148*F1148,2)","v":1.08}]
[null,null,"SF-00209","Fundo anticorrosivo para metais ferrosos (zarcao)","l",0.08,"Sinapi 40729",19.484999999999999,"Sinapi 7307",null,{"$f":"ROUND(H1149*F1149,2)","v":1.56}]
[null,null,"SF-00209","Ajudante de Pedreiro com Encargos Complementares","h",0.7,"Sinapi 40729",13.113000000000001,"Sinapi 88242",null,null,{"$f":"ROUND(H1150*F1150,2)","v":9.18}]
[null,null,"SF-00209","Encanador ou Bombeiro Hidráulico com Encargos Complementares","h",0.85,"Sinapi 40729",18.081,"Sinapi 88267",null,null,{"$f":"ROUND(H1151*F1151,2)","v":15.37}]
[null,null,"",null,null,null,null,""]
["SF-00210","Válvula de descarga 1 1/2\" – Linha Administrativa","",null,"un",null,"Sinapi 40729",""]
[null,null,"",null,null,null,null,""]
[null,null,"SF-00210","Valvula de descarga metalica, base 1 1/2 \" e acabamento metalico cromado","un ",1,"Sinapi 40729",141.417,"Sinapi 10228",null,{"$f":"ROUND(H1155*F1155,2)","v":141.41999999999999},null,{"$f":"SUM(J1155:L1159)","v":168.61}]
[null,null,"SF-00210","Estopa","kg",0.12,"Sinapi 40729",9,"Sinapi 13",null,{"$f":"ROUND(H1156*F1156,2)","v":1.08}]
[null,null,"SF-00210","Fundo anticorrosivo para metais ferrosos (zarcao)","l",0.08,"Sinapi 40729",19.484999999999999,"Sinapi 7307",null,{"$f":"ROUND(H1157*F1157,2)","v":1.56}]
[null,null,"SF-00210","Ajudante de Pedreiro com Encargos Complementares","h",0.7,"Sinapi 40729",13.113000000000001,"Sinapi 88242",null,null,{"$f":"ROUND(H1158*F1158,2)","v":9.18}]
[null,null,"SF-00210","Encanador ou Bombeiro Hidráulico com Encargos Complementares","h",0.85,"Sinapi 40729",18.081,"Sinapi 88267",null,null,{"$f":"ROUND(H1159*F1159,2)","v":15.37}]
[null,null,"",null,null,null,null,""]
["SF-00211","Válvula de descarga 1 1/4\" – Linha Acessibilidade",{"$f":"IF(AND(D1161<>\"\",A1159=\"\"),C1160,IF(D1161<>\"\",A1159,\"\"))","v":""},null,"un",null,"Sinapi 40729 Adaptada",""]
[null,null,"",null,null,null,null,""]
[null,null,"SF-00211","Válvula de descarga 1 1/4\" . Ref.: Modelo 2565.C.114.CONF – Linha Hydra Eco Conforto – Deca","un ",1,"Sinapi 40729",284.37,"Pesquisa de Preços",null,{"$f":"ROUND(H1163*F1163,2)","v":284.37},null,{"$f":"SUM(J1163:L1167)","v":311.56}]
[null,null,"SF-00211","Estopa","kg",0.12,"Sinapi 40729",9,"Sinapi 13",null,{"$f":"ROUND(H1164*F1164,2)","v":1.08}]
[null,null,"SF-00211","Fundo anticorrosivo para metais ferrosos (zarcao)","l",0.08,"Sinapi 40729",19.484999999999999,"Sinapi 7307",null,{"$f":"ROUND(H1165*F1165,2)","v":1.56}]
[null,null,"SF-00211","Ajudante de Pedreiro com Encargos Complementares","h",0.7,"Sinapi 40729",13.113000000000001,"Sinapi 88242",null,null,{"$f":"ROUND(H1166*F1166,2)","v":9.18}]
[null,null,"SF-00211","Encanador ou Bombeiro Hidráulico com Encargos Complementares","h",0.85,"Sinapi 40729",18.081,"Sinapi 88267",null,null,{"$f":"ROUND(H1167*F1167,2)","v":15.37}]
[null,null,"",null,null,null,null,""]
["SF-00212","Válvula de descarga 1 1/4\" – Linha Administrativa","",null,"un",null,"Sinapi 40729 Adaptada",""]
[null,null,"",null,null,null,null,""]
[null,null,"SF-00212","Valvula de descarga metalica, base 1 1/4 \" e acabamento metalico cromado","un ",1,"Sinapi 40729",114.56100000000001,"Sinapi 11781",null,{"$f":"ROUND(H1171*F1171,2)","v":114.56},null,{"$f":"SUM(J1171:L1175)","v":141.75}]
[null,null,"SF-00212","Estopa","kg",0.12,"Sinapi 40729",9,"Sinapi 13",null,{"$f":"ROUND(H1172*F1172,2)","v":1.08}]
[null,null,"SF-00212","Fundo anticorrosivo para metais ferrosos (zarcao)","l",0.08,"Sinapi 40729",19.484999999999999,"Sinapi 7307",null,{"$f":"ROUND(H1173*F1173,2)","v":1.56}]
[null,null,"SF-00212","Ajudante de Pedreiro com Encargos Complementares","h",0.7,"Sinapi 40729",13.113000000000001,"Sinapi 88242",null,null,{"$f":"ROUND(H1174*F1174,2)","v":9.18}]
[null,null,"SF-00212","Encanador ou Bombeiro Hidráulico com Encargos Complementares","h",0.85,"Sinapi 40729",18.081,"Sinapi 88267",null,null,{"$f":"ROUND(H1175*F1175,2)","v":15.37}]
[null,null,"",null,null,null,null,""]
["SF-00213","Válvula de escoamento para lavatório – Linha Administrativa","",null,"un",null,"Sinapi 86877 Adaptada",""]
[null,null,"",null,null,null,null,""]
[null,null,"SF-00213","Valvula em metal cromado para lavatorio, 1 \" sem ladrao","un ",1,"Sinapi 86877",22.491,"Sinapi 38643",null,{"$f":"ROUND(H1179*F1179,2)","v":22.49},null,{"$f":"SUM(J1179:L1182)","v":26.319999999999997}]
[null,null,"SF-00213","Fita veda rosca em rolos de 18 mm x 10 m (L x C)","un ",0.04,"Sinapi 86877",2.214,"Sinapi 3146",null,{"$f":"ROUND(H1180*F1180,2)","v":0.09}]
[null,null,"SF-00213","Encanador ou Bombeiro Hidráulico com Encargos Complementares","h",0.17,"Sinapi 86877",18.081,"Sinapi 88267",null,null,{"$f":"ROUNDUP(H1181*F1181,2)","v":3.0799999999999996}]
[null,null,"SF-00213","Servente com Encargos Complementares","h",0.05,"Sinapi 86877",13.167000000000002,"Sinapi 88316",null,null,{"$f":"ROUND(H1182*F1182,2)","v":0.66}]
[null,null,"",null,null,null,null,""]
["SF-00214","Válvula de escoamento para tanque – Linha Administrativa","",null,"un",null,"Sinapi 86879 Adaptada",""]
[null,null,"",null,null,null,null,""]
[null,null,"SF-00214","Fita veda rosca em rolos de 18 mm x 10 m (L x C)","un ",0.04,"Sinapi 86879",2.214,"Sinapi 3146",null,{"$f":"ROUND(H1186*F1186,2)","v":0.09},null,{"$f":"SUM(J1186:L1189)","v":22.5}]
[null,null,"SF-00214","Valvula em metal cromado para tanque, 1.1/2 \" sem ladrao","un",1,"Sinapi 86879",18.666,"Sinapi 37588",null,{"$f":"ROUND(H1187*F1187,2)","v":18.670000000000002}]
[null,null,"SF-00214","Encanador ou Bombeiro Hidráulico com Encargos Complementares","h",0.17,"Sinapi 86879",18.081,"Sinapi 88267",null,null,{"$f":"ROUNDUP(H1188*F1188,2)","v":3.0799999999999996}]
[null,null,"SF-00214","Servente com Encargos Complementares","h",0.05,"Sinapi 86879",13.167000000000002,"Sinapi 88316",null,null,{"$f":"ROUND(H1189*F1189,2)","v":0.66}]
[null,null,"",null,null,null,null,""]
["SF-00215","Válvula descarga para mictório – Linha Administrativa","",null,"un",null,"Sinapi 40729 Adaptada",""]
[null,null,"",null,null,null,null,""]
[null,null,"SF-00215","Estopa","kg",0.12,"Sinapi 40729",9,"Sinapi 13",null,{"$f":"ROUND(H1193*F1193,2)","v":1.08},null,{"$f":"SUM(J1193:L1197)","v":148.92000000000002}]
[null,null,"SF-00215","Fundo anticorrosivo para metais ferrosos (zarcao)","l",0.08,"Sinapi 40729",19.484999999999999,"Sinapi 7307",null,1.56]
[null,null,"SF-00215","Valvula de descarga em metal cromado para mictorio com acionamento por pressao e fechamento automatico","h",1,"Sinapi 40729",121.73399999999999,"Sinapi 21112",null,{"$f":"ROUND(H1195*F1195,2)","v":121.73}]
[null,null,"SF-00215","Ajudante de Pedreiro com Encargos Complementares","h",0.7,"Sinapi 40729",13.113000000000001,"Sinapi 88242",null,null,{"$f":"ROUND(H1196*F1196,2)","v":9.18}]
[null,null,"SF-00215","Encanador ou Bombeiro Hidráulico com Encargos Complementares","h",0.85,"Sinapi 40729",18.081,"Sinapi 88267",null,null,{"$f":"ROUND(H1197*F1197,2)","v":15.37}]
[null,null,"",null,null,null,null,""]
["SF-00216","Alarme de emergência para sanitários PNE","",null,"un",null,"Orse 11961 Adaptada",""]
[null,null,"",null,null,null,null,""]
[null,null,"SF-00216","Eletricista com encargos complementares","h",0.17,"Orse 11961",18.297000000000001,"Sinapi 88264",null,null,{"$f":"ROUND(H1201*F1201,2)","v":3.11},{"$f":"SUM(J1201:L1203)","v":300.35000000000002}]
[null,null,"SF-00216","Servente com Encargos Complementares","h",0.17,"Orse 11961",13.167000000000002,"Sinapi 88316",null,null,{"$f":"ROUND(H1202*F1202,2)","v":2.2400000000000002}]
[null,null,"SF-00216","Alarme de emergência audiovisual intermitente com fio. Ref. Planeta Acessível Alarme PCD ou AbaFire AFSAVPNE + AbaFire AFAMPNE ","un ",1,"Orse 11961",295,"Pesquisa de Preços",null,{"$f":"ROUND(H1203*F1203,2)","v":295}]
[null,null,"",null,null,null,null,""]
["SF-00217","Barra de apoio 40cm – Linha Acessibilidade","",null,"un",null,"Pini 26.104.000060.SER Adaptada",""]
[null,null,"",null,null,null,null,""]
[null,null,"SF-00217","Barra de apoio com comprimento de 405mm e espaçamento de 66mm da parede, barra com bitola de 32m, em aço escovado","un ",1,"Pini 26.104.000060.SER",74.900000000000006,"Pesquisa de Preços",null,{"$f":"ROUND(H1207*F1207,2)","v":74.900000000000006},null,{"$f":"SUM(J1207:L1210)","v":108.24000000000001}]
[null,null,"SF-00217","Bucha de nylon, diametro do furo 8 mm, comprimento 40 mm, com parafuso de rosca soberba, cabeca chata, fenda simples, 4,8 x 50 mm","un ",6,"Pini 26.104.000060.SER",0.34200000000000003,"Sinapi 4350",null,{"$f":"ROUND(H1208*F1208,2)","v":2.0499999999999998}]
[null,null,"SF-00217","Pedreiro com Encargos Complementares","h",1,"Pini 26.104.000060.SER",18.117000000000001,"Sinapi 88309",null,null,{"$f":"ROUND(H1209*F1209,2)","v":18.12}]
[null,null,"SF-00217","Servente com Encargos Complementares","h",1,"Pini 26.104.000060.SER",13.167000000000002,"Sinapi 88316",null,null,{"$f":"ROUND(H1210*F1210,2)","v":13.17}]
[null,null,"",null,null,null,null,""]
["SF-00218","Barra de apoio 70cm – Linha Acessibilidade","",null,"un",null,"Pini 26.104.000060.SER Adaptada",""]
[null,null,"",null,null,null,null,""]
[null,null,"SF-00218","Barra de apoio com comprimento de 705mm e espaçamento de 66mm da parede, barra com bitola de 32mm em aço escovado","un ",1,"Pini 26.104.000060.SER",87.9,"Pesquisa de Preços",null,{"$f":"ROUND(H1214*F1214,2)","v":87.9},null,{"$f":"SUM(J1214:L1217)","v":121.24000000000001}]
[null,null,"SF-00218","Bucha de nylon, diametro do furo 8 mm, comprimento 40 mm, com parafuso de rosca soberba, cabeca chata, fenda simples, 4,8 x 50 mm","un ",6,"Pini 26.104.000060.SER",0.34200000000000003,"Sinapi 4350",null,{"$f":"ROUND(H1215*F1215,2)","v":2.0499999999999998}]
[null,null,"SF-00218","Pedreiro com Encargos Complementares","h",1,"Pini 26.104.000060.SER",18.117000000000001,"Sinapi 88309",null,null,{"$f":"ROUND(H1216*F1216,2)","v":18.12}]
[null,null,"SF-00218","Servente com Encargos Complementares","h",1,"Pini 26.104.000060.SER",13.167000000000002,"Sinapi 88316",null,null,{"$f":"ROUND(H1217*F1217,2)","v":13.17}]
[null,null,"",null,null,null,null,""]
["SF-00219","Barra de apoio 80cm – Linha Acessibilidade","",null,"un",null,"Pini 26.104.000060.SER Adaptada",""]
[null,null,"",null,null,null,null,""]
[null,null,"SF-00219","Barra de apoio linha conforto com comprimento de 805mm e espaçamento de 66mm da parede, barra com bitola de 32mm em aço escovado","un ",1,"Pini 26.104.000060.SER",89.9,"Pesquisa de Preços",null,{"$f":"ROUND(H1221*F1221,2)","v":89.9},null,{"$f":"SUM(J1221:L1224)","v":123.24000000000001}]
[null,null,"SF-00219","Bucha de nylon, diametro do furo 8 mm, comprimento 40 mm, com parafuso de rosca soberba, cabeca chata, fenda simples, 4,8 x 50 mm","un ",6,"Pini 26.104.000060.SER",0.34200000000000003,"Sinapi 4350",null,{"$f":"ROUND(H1222*F1222,2)","v":2.0499999999999998}]
[null,null,"SF-00219","Pedreiro com Encargos Complementares","h",1,"Pini 26.104.000060.SER",18.117000000000001,"Sinapi 88309",null,null,{"$f":"ROUND(H1223*F1223,2)","v":18.12}]
[null,null,"SF-00219","Servente com Encargos Complementares","h",1,"Pini 26.104.000060.SER",13.167000000000002,"Sinapi 88316",null,null,{"$f":"ROUND(H1224*F1224,2)","v":13.17}]
[null,null,{"$f":"IF(AND(D1225<>\"\",A1223=\"\"),C1224,IF(D1225<>\"\",A1223,\"\"))","v":""},null,null,null,null,""]
["SF-00220","Barra de apoio lateral fixa 30cm – Linha Acessibilidade","",null,"un",null,"Pini 26.104.000060.SER",""]
[null,null,"",null,null,null,null,""]
[null,null,"SF-00220","Pedreiro com Encargos Complementares","h",1,"Pini 26.104.000060.SER",18.117000000000001,"Sinapi 88309",null,null,{"$f":"ROUND(H1228*F1228,2)","v":18.12},{"$f":"SUM(J1228:L1231)","v":134.24}]
[null,null,"SF-00220","Servente com Encargos Complementares","h",1,"Pini 26.104.000060.SER",13.167000000000002,"Sinapi 88316",null,null,{"$f":"ROUND(H1229*F1229,2)","v":13.17}]
[null,null,"SF-00220","Barra de apoio lateral fixa, com 303mm de comprimento, com a bitola de 32mm e em aço escovado","un",1,"Pini 26.104.000050.SER Adaptada",100.9,"Pesquisa de Preços",null,{"$f":"ROUND(H1230*F1230,2)","v":100.9}]
[null,null,"SF-00220","Bucha de nylon, diametro do furo 8 mm, comprimento 40 mm, com parafuso de rosca soberba, cabeca chata, fenda simples, 4,8 x 50 mm","un ",6,"Pini 26.104.000060.SER",0.34200000000000003,"Sinapi 4350",null,{"$f":"ROUND(H1231*F1231,2)","v":2.0499999999999998}]
[null,null,"",null,null,null,null,""]
["SF-00221","Lavatório suspenso – Linha Acessibilidade","",null,"un",null,"Sinapi 86904 Adaptada",""]
[null,null,"",null,null,null,null,""]
[null,null,"SF-00221","Lavatório para instalação com coluna suspensa, para apoio à pessoa com deficiência. Ref.: Modelo L.39.17 – Linha Spot – Deca","un ",1,"Sinapi 86904",116.91,"Pesquisa de Preços",null,{"$f":"ROUND(H1235*F1235,2)","v":116.91},null,{"$f":"SUM(J1235:L1239)","v":146.11000000000001}]
[null,null,"SF-00221","Parafuso niquelado 3 1/2\" com acabamento cromado para fixar peca sanitaria, inclui porca cega, arruela e bucha de nylon tamanho S-8","un ",2,"Sinapi 86904",9.0090000000000003,"Sinapi 4351",null,{"$f":"ROUND(H1236*F1236,2)","v":18.02}]
[null,null,"SF-00221","Rejunte epoxi branco","kg",5.0700000000000002E-2,"Sinapi 86904",31.895999999999997,"Sinapi 37329",null,{"$f":"ROUND(H1237*F1237,2)","v":1.62}]
[null,null,"SF-00221","Encanador ou Bombeiro Hidráulico com Encargos Complementares","h",0.39,"Sinapi 86904",18.081,"Sinapi 88267",null,null,{"$f":"ROUNDUP(H1238*F1238,2)","v":7.06}]
[null,null,"SF-00221","Servente com Encargos Complementares","h",0.19,"Sinapi 86904",13.167000000000002,"Sinapi 88316",null,null,{"$f":"ROUND(H1239*F1239,2)","v":2.5}]
[null,null,"",null,null,null,null,""]
["SF-00222","Lavatório suspenso com Coluna – Linha Acessibilidade ","",null,"un",null,"Sinapi 86903 Adaptada",""]
[null,null,"",null,null,null,null,""]
[null,null,"SF-00222","Encanador ou Bombeiro Hidráulico com Encargos Complementares","h",0.39,"Sinapi 86903",18.081,"Sinapi 88267",null,null,{"$f":"ROUNDUP(H1243*F1243,2)","v":7.06},{"$f":"SUM(J1243:L1245)","v":148.97}]
[null,null,"SF-00222","Servente com Encargos Complementares","h",0.19,"Sinapi 86903",13.167000000000002,"Sinapi 88316",null,null,{"$f":"ROUND(H1244*F1244,2)","v":2.5}]
[null,null,"SF-00222","Coluna suspensa para lavatório para apoio à pessoa com deficiência. Ref..: Deca Spot CS.39.17","un",1,"Sinapi 86903",139.41,"Pesquisa de Preços",null,{"$f":"ROUND(H1245*F1245,2)","v":139.41}]
[null,null,"",null,null,null,null,""]
["SF-00223","Cabide – Linha Administrativa","",null,"un",null,"Sinapi 95542 Adaptada",""]
[null,null,"",null,null,null,null,""]
[null,null,"SF-00223","Cabide, cromado. Ref.: Modelo 2060.C.FLX – Linha Flex – Deca","un ",1,"Sinapi 95542 Adaptada",46.45,"Pesquisa de Preços",null,{"$f":"ROUND(H1249*F1249,2)","v":46.45},null,{"$f":"SUM(J1249:L1250)","v":49.7}]
[null,null,"SF-00223","Fixação utilizando parafuso e bucha de nylon, somente mão de obra. af_10/2016","un ",1,"Sinapi 95542",{"$f":"OFFSET(INDEX('Composições Auxiliares'!A:L,MATCH(D1250,'Composições Auxiliares'!A:A,0),12),2,0)","v":3.25},"Sinapi 95541",{"$f":"ROUND(H1250*F1250,2)","v":3.25}]
[null,null,"",null,null,null,null,""]
["SF-00224","Papeleira – Linha Administrativa","",null,"un",null,"Sinapi 95542 Adaptada",""]
[null,null,"",null,null,null,null,""]
[null,null,"SF-00224","Papeleira, cromada. Ref.: Modelo 2020.C.FLX – Linha Flex – Deca","un ",1,"Sinapi 95542 Adaptada",87.88,"Pesquisa de Preços",null,{"$f":"ROUND(H1254*F1254,2)","v":87.88},null,{"$f":"SUM(J1254:L1255)","v":91.13}]
[null,null,"SF-00224","Fixação utilizando parafuso e bucha de nylon, somente mão de obra. af_10/2016","un ",1,"Sinapi 95542",{"$f":"OFFSET(INDEX('Composições Auxiliares'!A:L,MATCH(D1255,'Composições Auxiliares'!A:A,0),12),2,0)","v":3.25},"Sinapi 95541",{"$f":"ROUND(H1255*F1255,2)","v":3.25}]
[null,null,"",null,null,null,null,""]
["SF-00225","Porta toalha argola – Linha Administrativa","",null,"un",null,"Sinapi 95542 Adaptada",""]
[null,null,"",null,null,null,null,""]
[null,null,"SF-00225","Porta-toalha em argola, cromado. Ref.: Modelo 2050.C.FLX – Linha Flex – Deca","un ",1,"Sinapi 95542 Adaptada",88.4,"Pesquisa de Preços",null,{"$f":"ROUND(H1259*F1259,2)","v":88.4},null,{"$f":"SUM(J1259:L1260)","v":91.65}]
[null,null,"SF-00225","Fixação utilizando parafuso e bucha de nylon, somente mão de obra. af_10/2016","un ",1,"Sinapi 95542",{"$f":"OFFSET(INDEX('Composições Auxiliares'!A:L,MATCH(D1260,'Composições Auxiliares'!A:A,0),12),2,0)","v":3.25},"Sinapi 95541",{"$f":"ROUND(H1260*F1260,2)","v":3.25}]
[null,null,"",null,null,null,null,""]
["SF-00226","Porta toalha barra – Linha Administrativa","",null,"un",null,"Sinapi 95542 Adaptada",""]
[null,null,"",null,null,null,null,""]
[null,null,"SF-00226","Porta-toalha em barra, cromado. Ref.: Modelo 2040.C.FLX – Linha Flex – Deca","un ",1,"Sinapi 95542",119.03,"Pesquisa de Preços",null,{"$f":"ROUND(H1264*F1264,2)","v":119.03},null,{"$f":"SUM(J1264:L1265)","v":122.28}]
[null,null,"SF-00226","Fixação utilizando parafuso e bucha de nylon, somente mão de obra. af_10/2016","un ",1,"Sinapi 95542",{"$f":"OFFSET(INDEX('Composições Auxiliares'!A:L,MATCH(D1265,'Composições Auxiliares'!A:A,0),12),2,0)","v":3.25},"Sinapi 95541",{"$f":"ROUND(H1265*F1265,2)","v":3.25}]
[null,null,"",null,null,null,null,""]
["SF-00227","Caixa 4x2 de embutir para alvenaria","",null,"un",null,"Sinapi 91941",""]
[null,null,"",null,null,null,null,""]
[null,null,"SF-00227","Auxiliar de eletricista com encargos complementares","h",0.14499999999999999,"Sinapi 91941",14.048999999999999,"Sinapi 88247",null,null,{"$f":"ROUNDDOWN(H1269*F1269,2)","v":2.0299999999999998},{"$f":"SUM(J1269:L1272)","v":6.26}]
[null,null,"SF-00227","Eletricista com encargos complementares","h",0.14499999999999999,"Sinapi 91941",18.297000000000001,"Sinapi 88264",null,null,{"$f":"ROUNDUP(H1270*F1270,2)","v":2.6599999999999997}]
[null,null,"SF-00227","Argamassa traço 1:3 (cimento e areia média), preparo manual. AF_08/2014","m3",8.9999999999999998E-4,"Sinapi 91941",{"$f":"OFFSET(INDEX('Composições Auxiliares'!A:L,MATCH(D1271,'Composições Auxiliares'!A:A,0),12),2,0)","v":366.43999999999994},"Sinapi 88629",{"$f":"ROUND(H1271*F1271,2)","v":0.33}]
[null,null,"SF-00227","Caixa de passagem, em PVC, de 4\" x 2\", para eletroduto flexivel corrugado","un",1,"Sinapi 91941",1.242,"Sinapi 1872",null,{"$f":"ROUND(H1272*F1272,2)","v":1.24}]
[null,null,"",null,null,null,null,""]
["SF-00228","Caixa 4x2 para drywall","",null,"un",null,"Sinapi 91941 Adaptada",""]
[null,null,"",null,null,null,null,""]
[null,null,"SF-00228","Auxiliar de eletricista com encargos complementares","h",0.14499999999999999,"Sinapi 91941",14.048999999999999,"Sinapi 88247",null,null,{"$f":"ROUNDDOWN(H1276*F1276,2)","v":2.0299999999999998},{"$f":"SUM(J1276:L1278)","v":10.41}]
[null,null,"SF-00228","Eletricista com encargos complementares","h",0.14499999999999999,"Sinapi 91941",18.297000000000001,"Sinapi 88264",null,null,{"$f":"ROUNDUP(H1277*F1277,2)","v":2.6599999999999997}]
[null,null,"SF-00228","Caixa 4x2 para drywall. Ref.: Tigre Caixa de Embutir Dryfix 4’’x2’’ (código 21007013)","un",1,"Sinapi 91941",5.72,"Pesquisa de Preços",null,{"$f":"ROUND(H1278*F1278,2)","v":5.72}]
[null,null,"",null,null,null,null,""]
["SF-00229","Caixa 4x4 de embutir para alvenaria","",null,"un",null,"Sinapi 91944",""]
[null,null,"",null,null,null,null,""]
[null,null,"SF-00229","Auxiliar de eletricista com encargos complementares","h",0.16600000000000001,"Sinapi 91944",14.048999999999999,"Sinapi 88247",null,null,{"$f":"ROUND(H1282*F1282,2)","v":2.33},{"$f":"SUM(J1282:L1285)","v":8.27}]
[null,null,"SF-00229","Eletricista com encargos complementares","h",0.16600000000000001,"Sinapi 91944",18.297000000000001,"Sinapi 88264",null,null,{"$f":"ROUNDDOWN(H1283*F1283,2)","v":3.03}]
[null,null,"SF-00229","Argamassa traço 1:3 (cimento e areia média), preparo manual. AF_08/2014","m3",1.1999999999999999E-3,"Sinapi 91944",{"$f":"OFFSET(INDEX('Composições Auxiliares'!A:L,MATCH(D1284,'Composições Auxiliares'!A:A,0),12),2,0)","v":366.43999999999994},"Sinapi 88629",{"$f":"ROUND(H1284*F1284,2)","v":0.44}]
[null,null,"SF-00229","Caixa de passagem, em PVC, de 4\" x 4\", para eletroduto flexivel corrugado","un",1,"Sinapi 91944",2.4660000000000002,"Sinapi 1873",null,{"$f":"ROUND(H1285*F1285,2)","v":2.4700000000000002}]
[null,null,"",null,null,null,null,""]
["SF-00230","Caixa 4x4 para drywall","",null,"un",null,"Sinapi 91944 Adaptada",""]
[null,null,"",null,null,null,null,""]
[null,null,{"$f":"IF(AND(D1289<>\"\",A1287=\"\"),C1288,IF(D1289<>\"\",A1287,\"\"))","v":"SF-00230"},"Auxiliar de eletricista com encargos complementares","h",0.16600000000000001,"Sinapi 91944",14.048999999999999,"Sinapi 88247",null,null,{"$f":"ROUND(H1289*F1289,2)","v":2.33},{"$f":"SUM(J1289:L1291)","v":12.989999999999998}]
[null,null,"SF-00230","Eletricista com encargos complementares","h",0.16600000000000001,"Sinapi 91944",18.297000000000001,"Sinapi 88264",null,null,{"$f":"ROUNDDOWN(H1290*F1290,2)","v":3.03}]
[null,null,"SF-00230","Caixa 4x4 para drywall. Ref.: Tigre Caixa de Embutir Dryfix 4’’x4’’ (código 21007110)","un",1,"Sinapi 91944",7.63,"Pesquisa de Preços",null,{"$f":"ROUND(H1291*F1291,2)","v":7.63}]
[null,null,"",null,null,null,null,""]
["SF-00231","Caixa de passagem em alumínio 100x100x50mm","",null,"un",null,"Sinapi 83366 Adaptada",""]
[null,null,"",null,null,null,null,""]
[null,null,"SF-00231","Auxiliar de eletricista com encargos complementares","h",{"$f":"1.25/2","v":0.625},"Sinapi 83366 Adaptada",14.048999999999999,"Sinapi 88247",null,null,{"$f":"ROUND(H1295*F1295,2)","v":8.7799999999999994},{"$f":"SUM(J1295:L1297)","v":46.04}]
[null,null,"SF-00231","Eletricista com encargos complementares","h",{"$f":"1.25/2","v":0.625},"Sinapi 83366 Adaptada",18.297000000000001,"Sinapi 88264",null,null,{"$f":"ROUND(H1296*F1296,2)","v":11.44}]
[null,null,"SF-00231","Caixa de passagem em alumínio c/ tampa, 100x100x50mm. Ref.: Daisa CDT 10; Wetzel CP-1010-6","m",1,"Sinapi 83366",25.82,"Pesquisa de Preços",null,{"$f":"ROUND(H1297*F1297,2)","v":25.82}]
[null,null,"",null,null,null,null,""]
["SF-00232","Caixa de passagem em alumínio 200x200x100mm","",null,"un",null,"Sinapi 83366 Adaptada",""]
[null,null,"",null,null,null,null,""]
[null,null,"SF-00232","Auxiliar de eletricista com encargos complementares","h",{"$f":"1.25/2","v":0.625},"Sinapi 83366 Adaptada",14.048999999999999,"Sinapi 88247",null,null,{"$f":"ROUND(H1301*F1301,2)","v":8.7799999999999994},{"$f":"SUM(J1301:L1303)","v":78.039999999999992}]
[null,null,"SF-00232","Eletricista com encargos complementares","h",{"$f":"1.25/2","v":0.625},"Sinapi 83366 Adaptada",18.297000000000001,"Sinapi 88264",null,null,{"$f":"ROUND(H1302*F1302,2)","v":11.44}]
[null,null,"SF-00232","Caixa de passagem em alumínio c/ tampa, 200x200x100mm. Ref.: Daisa CDT 20; Wetzel CP-2020-10","m",1,"Sinapi 83366",57.82,"Pesquisa de Preços",null,{"$f":"ROUND(H1303*F1303,2)","v":57.82}]
[null,null,"",null,null,null,null,""]
["SF-00233","Caixa de passagem em PVC 150x150x75mm","",null,"un",null,"Orse 08699 Adaptada",""]
[null,null,"",null,null,null,null,""]
[null,null,"SF-00233","Eletricista com encargos complementares","h",0.45,"Orse 8699",18.297000000000001,"Sinapi 88264",null,null,{"$f":"ROUNDUP(H1307*F1307,2)","v":8.24},{"$f":"SUM(J1307:L1309)","v":28.12}]
[null,null,"SF-00233","Servente com Encargos Complementares","h",0.45,"Orse 8699",13.167000000000002,"Sinapi 88316",null,null,{"$f":"ROUNDDOWN(H1308*F1308,2)","v":5.92}]
[null,null,"SF-00233","Caixa de passagem de parede, de embutir, em PVC, dimensoes *150 x 150 x 75* mm","un",1,"Orse 8699",13.959,"Sinapi 39811",null,{"$f":"ROUND(H1309*F1309,2)","v":13.96}]
[null,null,"",null,null,null,null,""]
["SF-00234","Caixa para piso elevado","",null,"un",null,"Sinapi 83366 Adaptada",""]
[null,null,"",null,null,null,null,""]
[null,null,"SF-00234","Eletricista com encargos complementares","h",{"$f":"1.25","v":1.25},"Sinapi 83366",18.297000000000001,"Sinapi 88264",null,null,{"$f":"ROUND(H1313*F1313,2)","v":22.87},{"$f":"SUM(J1313:L1315)","v":233.82}]
[null,null,"SF-00234","Auxiliar de eletricista com encargos complementares","h",{"$f":"1.25","v":1.25},"Sinapi 83366",14.048999999999999,"Sinapi 88247",null,null,{"$f":"ROUND(H1314*F1314,2)","v":17.559999999999999}]
[null,null,"SF-00234","Caixa para piso elevado, 170 mm x 170 mm x 70 mm (dimensões aproximadas), incluindo módulos de tomadas 2P+T (fêmea). Ref.: Caixa: Dutotec DT 72921.00; Engeduto CPE MD 18 SR; Pisoag MOD-2702","un",1,"Sinapi 83366",193.39,"Pesquisa de Preços",null,{"$f":"ROUND(H1315*F1315,2)","v":193.39}]
[null,null,"",null,null,null,null,""]
["SF-00235","Canaleta em alumínio aparente 73mmx25mm","",null,"m",null,"Pini 16.111.000015.SER",""]
[null,null,"",null,null,null,null,""]
[null,null,"SF-00235","Canaleta em alumínio com tampa, divisória interna, 73x25mm, incluindo curvas, conexões e acessórios de fixação. Ref.: Canaleta: Dutotec DT 12241.00 (tipo D), tampa Dutotec DT 15040.00","m",1.1499999999999999,"Pini 16.111.000015.SER",82.79,"Pesquisa de Preços",null,{"$f":"ROUND(H1319*F1319,2)","v":95.21},null,{"$f":"SUM(J1319:L1321)","v":101.03}]
[null,null,"SF-00235","Auxiliar de eletricista com encargos complementares","h",0.18,"Pini 16.111.000015.SER",14.048999999999999,"Sinapi 88247",null,null,{"$f":"ROUND(H1320*F1320,2)","v":2.5299999999999998}]
[null,null,"SF-00235","Eletricista com encargos complementares","h",0.18,"Pini 16.111.000015.SER",18.297000000000001,"Sinapi 88264",null,null,{"$f":"ROUND(H1321*F1321,2)","v":3.29}]
[null,null,"",null,null,null,null,""]
["SF-00236","Condulete de alumínio de 1’’","",null,"un",null,"Sinapi 95802",""]
[null,null,"",null,null,null,null,""]
[null,null,"SF-00236","Auxiliar de eletricista com encargos complementares","h",0.53849999999999998,"Sinapi 95802",14.048999999999999,"Sinapi 88247",null,null,{"$f":"ROUND(H1325*F1325,2)","v":7.57},{"$f":"SUM(J1325:L1328)","v":29.21}]
[null,null,"SF-00236","Eletricista com encargos complementares","h",0.53849999999999998,"Sinapi 95802",18.297000000000001,"Sinapi 88264",null,null,{"$f":"ROUNDUP(H1326*F1326,2)","v":9.86}]
[null,null,"SF-00236","Bucha de nylon sem aba S6, com parafuso de 4,20 x 40 mm em aco zincado com rosca soberba, cabeca chata e fenda Phillips","un",2,"Sinapi 95802",0.16200000000000001,"Sinapi 11950",null,{"$f":"ROUND(H1327*F1327,2)","v":0.32}]
[null,null,"SF-00236","Condulete de aluminio tipo X, para eletroduto roscavel de 1\", com tampa cega","un",1,"Sinapi 95802",11.457000000000001,"Sinapi 2581",null,{"$f":"ROUND(H1328*F1328,2)","v":11.46}]
[null,null,"",null,null,null,null,""]
["SF-00237","Eletrocalha 100x50 mm","",null,"m",null,"Pini 16.113.000350.SER Adaptada",""]
[null,null,"",null,null,null,null,""]
[null,null,"SF-00237","Eletricista com encargos complementares","h",0.45,"Pini 16.113.000350.SER",18.297000000000001,"Sinapi 88264",null,null,{"$f":"ROUNDUP(H1332*F1332,2)","v":8.24},{"$f":"SUM(J1332:L1343)","v":47.05}]
[null,null,"SF-00237","Auxiliar de eletricista com encargos complementares","h",0.45,"Pini 16.113.000350.SER",14.048999999999999,"Sinapi 88247",null,null,{"$f":"ROUND(H1333*F1333,2)","v":6.32}]
[null,null,"SF-00237","Tiro com pistola para fixação de pino Ø 1/4\" em concreto, inclusive cartucho e pino","un ",0.67,"Pini 16.113.000350.SER",6.1559999999999997,"Pini 16.113.000350.SER",null,{"$f":"ROUND(H1334*F1334,2)","v":4.12}]
[null,null,"SF-00237","Eletrocalha perfurada (cabos elétricos) ou lisa (dados), tipo \"U\", de aço galvanizado eletrolítico 100 x 50 mm, fabricado em chapa #20 (0,95 mm)","m",1.05,"Pini 16.113.000350.SER",11.52,"Pesquisa de preços",null,{"$f":"ROUND(H1335*F1335,2)","v":12.1}]
[null,null,"SF-00237","Barra roscada em aço Ø 1/4\", comprimento 1 m, bicromatizada ou zincada","m",0.8,"Pini 16.113.000350.SER",3.1589999999999998,"Pini 16.113.000350.SER",null,2.5299999999999998]
[null,null,"SF-00237","Porca sextavada de aço galvanizado Ø 1/4\"","un ",4.0033000000000003,"Pini 16.113.000350.SER",0.16200000000000001,"Sinapi 39997",null,0.65]
[null,null,"SF-00237","Arruela em aço galvanizado Ø 1/4\"","un ",4.0033000000000003,"Pini 16.113.000350.SER",9.9000000000000005E-2,"Pini 16.113.000350.SER",null,0.4]
[null,null,"SF-00237","Suporte suspensão vertical para eletrocalha 100 x 50 mm largura x aba","un ",0.67,"Pini 16.113.000350.SER",2.5920000000000001,"Pini 16.113.000350.SER",null,1.74]
[null,null,"SF-00237","Prolongador para tirante rosqueado de 1/4\" x 50 mm","un ",1.05,"Pini 16.113.000350.SER",2.8530000000000002,"Pini 16.113.000350.SER",null,3]
[null,null,"SF-00237","Parafuso lentilha 1/4 x 1/2\"","un",2.67,"Pini 16.113.000350.SER",0.52200000000000002,"Pini 16.113.000350.SER",null,{"$f":"ROUNDUP(H1341*F1341,2)","v":1.4}]
[null,null,"SF-00237","Tala auto portante para emenda 50 mm","un ",0.66669999999999996,"Pini 16.113.000350.SER",3.0059999999999998,"Pini 16.113.000350.SER",null,{"$f":"ROUNDUP(H1342*F1342,2)","v":2.0099999999999998}]
[null,null,"SF-00237","Tampa de encaixe para eletrocalha aço galvanizado perfurada ou lisa, 100 mm","m",1.05,"Pini 16.113.000350.SER",4.32,"Pesquisa de preços",null,4.54]
[null,null,"",null,null,null,null,""]
["SF-00238","Eletrocalha 200x100 mm","",null,"m",null,"Pini 16.113.000377.SER Adaptada",""]
[null,null,"",null,null,null,null,""]
[null,null,"SF-00238","Eletricista com encargos complementares","h",0.6,"Pini 16.113.000377.SER",18.297000000000001,"Sinapi 88264",null,null,{"$f":"ROUND(H1347*F1347,2)","v":10.98},{"$f":"SUM(J1347:L1358)","v":82.210000000000008}]
[null,null,"SF-00238","Auxiliar de eletricista com encargos complementares","h",0.6,"Pini 16.113.000377.SER",14.048999999999999,"Sinapi 88247",null,null,{"$f":"ROUND(H1348*F1348,2)","v":8.43}]
[null,null,"SF-00238","Tiro com pistola para fixação de pino Ø 1/4\" em concreto, inclusive cartucho e pino","un ",1.3332999999999999,"Pini 16.113.000377.SER",6.1559999999999997,"Pini 16.113.000377.SER",null,{"$f":"ROUND(H1349*F1349,2)","v":8.2100000000000009}]
[null,null,"SF-00238","Eletrocalha perfurada (cabos elétricos) ou lisa (dados), tipo \"U\", de aço galvanizado eletrolítico 200 x 100 mm, fabricado em chapa #18 (1,25 mm)","m",1.05,"Pini 16.113.000377.SER",27.29,"Pesquisa de preços",null,{"$f":"ROUND(H1350*F1350,2)","v":28.65}]
[null,null,"SF-00238","Barra roscada em aço Ø 1/4\", comprimento 1 m, bicromatizada ou zincada","m",1.6,"Pini 16.113.000377.SER",3.1589999999999998,"Pini 16.113.000377.SER",null,{"$f":"ROUNDUP(H1351*F1351,2)","v":5.0599999999999996}]
[null,null,"SF-00238","Porca sextavada de aço galvanizado Ø 1/4\"","un ",5.3367000000000004,"Pini 16.113.000350.SER",0.16200000000000001,"Sinapi 39997",null,0.86]
[null,null,{"$f":"IF(AND(D1353<>\"\",A1351=\"\"),C1352,IF(D1353<>\"\",A1351,\"\"))","v":"SF-00238"},"Arruela em aço galvanizado Ø 1/4\"","un ",5.34,"Pini 16.113.000377.SER",9.9000000000000005E-2,"Pini 16.113.000377.SER",null,0.53]
[null,null,"SF-00238","Suporte suspensão omega para eletrocalha 200 x 100mm largura x aba","un ",0.67,"Pini 16.113.000377.SER",3.762,"Pini 16.113.000377.SER",null,2.52]
[null,null,"SF-00238","Prolongador para tirante rosqueado de 1/4\" x 50 mm","un ",1.3332999999999999,"Pini 16.113.000377.SER",2.8530000000000002,"Pini 16.113.000377.SER",null,{"$f":"ROUNDUP(H1355*F1355,2)","v":3.8099999999999996}]
[null,null,"SF-00238","Parafuso lentilha 1/4 x 1/2\"","un",2.67,"Pini 16.113.000377.SER",0.52200000000000002,"Pini 16.113.000377.SER",null,{"$f":"ROUNDUP(H1356*F1356,2)","v":1.4}]
[null,null,"SF-00238","Tala auto portante para emenda 100 mm","un ",0.67,"Pini 16.113.000377.SER",5.3820000000000006,"Pini 16.113.000377.SER",null,3.61]
[null,null,"SF-00238","Tampa de encaixe para eletrocalha aço galvanizado perfurada ou lisa, 200 mm","m",1.05,"Pini 16.113.000377.SER",7.76,"Pesquisa de preços",null,8.15]
[null,null,"",null,null,null,null,""]
["SF-00239","Eletrocalha 200x50 mm","",null,"m",null,"Pini 16.113.000356.SER Adaptada",""]
[null,null,"",null,null,null,null,""]
[null,null,"SF-00239","Eletricista com encargos complementares","h",0.5,"Pini 16.113.000356.SER",18.297000000000001,"Sinapi 88264",null,null,{"$f":"ROUND(H1362*F1362,2)","v":9.15},{"$f":"SUM(J1362:L1373)","v":69.77000000000001}]
[null,null,"SF-00239","Auxiliar de eletricista com encargos complementares","h",0.5,"Pini 16.113.000356.SER",14.048999999999999,"Sinapi 88247",null,null,{"$f":"ROUNDUP(H1363*F1363,2)","v":7.0299999999999994}]
[null,null,"SF-00239","Tiro com pistola para fixação de pino Ø 1/4\" em concreto, inclusive cartucho e pino","un ",1.3332999999999999,"Pini 16.113.000356.SER",6.1559999999999997,"Pini 16.113.000356.SER",null,{"$f":"ROUND(H1364*F1364,2)","v":8.2100000000000009}]
[null,null,"SF-00239","Eletrocalha perfurada (cabos elétricos) ou lisa (dados), tipo \"U\", de aço galvanizado eletrolítico 200 x 50 mm, fabricado em chapa #18 (1,25 mm)","m",1.05,"Pini 16.113.000356.SER",20.46,"Pesquisa de preços",null,{"$f":"ROUND(H1365*F1365,2)","v":21.48}]
[null,null,"SF-00239","Barra roscada em aço Ø 1/4\", comprimento 1 m, bicromatizada ou zincada","m",1.6,"Pini 16.113.000356.SER",3.1589999999999998,"Pini 16.113.000356.SER",null,{"$f":"ROUNDUP(H1366*F1366,2)","v":5.0599999999999996}]
[null,null,"SF-00239","Porca sextavada de aço galvanizado Ø 1/4\"","un ",5.3367000000000004,"Pini 16.113.000350.SER",0.16200000000000001,"Sinapi 39997",null,0.86]
[null,null,"SF-00239","Arruela em aço galvanizado Ø 1/4\"","un ",5.34,"Pini 16.113.000356.SER",9.9000000000000005E-2,"Pini 16.113.000356.SER",null,0.53]
[null,null,"SF-00239","Suporte suspensão omega para eletrocalha 200 x 50 mm largura x aba","un ",0.67,"Pini 16.113.000356.SER",3.0870000000000002,"Pini 16.113.000356.SER",null,2.0699999999999998]
[null,null,"SF-00239","Prolongador para tirante rosqueado de 1/4\" x 50 mm","un ",1.3332999999999999,"Pini 16.113.000356.SER",2.8530000000000002,"Pini 16.113.000356.SER",null,{"$f":"ROUNDUP(H1370*F1370,2)","v":3.8099999999999996}]
[null,null,"SF-00239","Parafuso lentilha 1/4 x 1/2\"","un",2.67,"Pini 16.113.000356.SER",0.52200000000000002,"Pini 16.113.000356.SER",null,{"$f":"ROUNDUP(H1371*F1371,2)","v":1.4}]
[null,null,"SF-00239","Tala auto portante para emenda 50 mm","un ",0.67,"Pini 16.113.000356.SER",3.0059999999999998,"Pini 16.113.000356.SER",null,{"$f":"ROUNDUP(H1372*F1372,2)","v":2.0199999999999996}]
[null,null,"SF-00239","Tampa de encaixe para eletrocalha aço galvanizado perfurada ou lisa, 200 mm","m",1.05,"Pini 16.113.000356.SER",7.76,"Pesquisa de preços",null,8.15]
[null,null,"",null,null,null,null,""]
["SF-00240","Eletrocalha 300x100 mm","",null,"m",null,"Pini 16.113.000380.SER Adaptada",""]
[null,null,"",null,null,null,null,""]
[null,null,"SF-00240","Eletricista com encargos complementares","h",0.65,"Pini 16.113.000380.SER",18.297000000000001,"Sinapi 88264",null,null,{"$f":"ROUND(H1377*F1377,2)","v":11.89},{"$f":"SUM(J1377:L1388)","v":95.17}]
[null,null,"SF-00240","Auxiliar de eletricista com encargos complementares","h",0.65,"Pini 16.113.000380.SER",14.048999999999999,"Sinapi 88247",null,null,{"$f":"ROUNDUP(H1378*F1378,2)","v":9.14}]
[null,null,"SF-00240","Tiro com pistola para fixação de pino Ø 1/4\" em concreto, inclusive cartucho e pino","un ",1.3332999999999999,"Pini 16.113.000380.SER",6.1559999999999997,"Pini 16.113.000380.SER",null,{"$f":"ROUND(H1379*F1379,2)","v":8.2100000000000009}]
[null,null,"SF-00240","Eletrocalha perfurada (cabos elétricos) ou lisa (dados), tipo \"U\", de aço galvanizado eletrolítico 300 x 100 mm, fabricado em chapa #18 (1,25 mm)","m",1.05,"Pini 16.113.000380.SER",34.11,"Pesquisa de preços",null,{"$f":"ROUND(H1380*F1380,2)","v":35.82}]
[null,null,"SF-00240","Barra roscada em aço Ø 1/4\", comprimento 1 m, bicromatizada ou zincada","m",1.6,"Pini 16.113.000380.SER",3.1589999999999998,"Pini 16.113.000380.SER",null,{"$f":"ROUNDUP(H1381*F1381,2)","v":5.0599999999999996}]
[null,null,"SF-00240","Porca sextavada de aço galvanizado Ø 1/4\"","un ",5.3367000000000004,"Pini 16.113.000350.SER",0.16200000000000001,"Sinapi 39997",null,0.86]
[null,null,"SF-00240","Arruela em aço galvanizado Ø 1/4\"","un ",5.34,"Pini 16.113.000380.SER",9.9000000000000005E-2,"Pini 16.113.000380.SER",null,0.53]
[null,null,"SF-00240","Suporte suspensão omega para eletrocalha 300 x 100 mm largura x aba","un ",0.67,"Pini 16.113.000380.SER",4.5810000000000004,"Pini 16.113.000380.SER",null,3.07]
[null,null,"SF-00240","Prolongador para tirante rosqueado de 1/4\" x 50 mm","un ",1.3332999999999999,"Pini 16.113.000380.SER",2.8530000000000002,"Pini 16.113.000380.SER",null,{"$f":"ROUNDUP(H1385*F1385,2)","v":3.8099999999999996}]
[null,null,"SF-00240","Parafuso lentilha 1/4 x 1/2\"","un",2.67,"Pini 16.113.000380.SER",0.52200000000000002,"Pini 16.113.000380.SER",null,{"$f":"ROUNDUP(H1386*F1386,2)","v":1.4}]
[null,null,"SF-00240","Tala auto portante para emenda 100 mm","un ",0.67,"Pini 16.113.000380.SER",5.3820000000000006,"Pini 16.113.000380.SER",null,3.61]
[null,null,"SF-00240","Tampa de encaixe para eletrocalha aço galvanizado perfurada ou lisa, 300 mm","m",1.05,"Pini 16.113.000380.SER",11.21,"Pesquisa de preços",null,11.77]
[null,null,"",null,null,null,null,""]
["SF-00241","Eletrocalha 300x50 mm","",null,"m",null,"Pini 16.113.000359.SER Adaptada",""]
[null,null,"",null,null,null,null,""]
[null,null,"SF-00241","Eletricista com encargos complementares","h",0.55000000000000004,"Pini 16.113.000359.SER",18.297000000000001,"Sinapi 88264",null,null,{"$f":"ROUND(H1392*F1392,2)","v":10.06},{"$f":"SUM(J1392:L1403)","v":82.62}]
[null,null,"SF-00241","Auxiliar de eletricista com encargos complementares","h",0.55000000000000004,"Pini 16.113.000359.SER",14.048999999999999,"Sinapi 88247",null,null,{"$f":"ROUND(H1393*F1393,2)","v":7.73}]
[null,null,"SF-00241","Tiro com pistola para fixação de pino Ø 1/4\" em concreto, inclusive cartucho e pino","un ",1.3332999999999999,"Pini 16.113.000359.SER",6.1559999999999997,"Pini 16.113.000359.SER",null,{"$f":"ROUND(H1394*F1394,2)","v":8.2100000000000009}]
[null,null,"SF-00241","Eletrocalha perfurada (cabos elétricos) ou lisa (dados), tipo \"U\", de aço galvanizado eletrolítico 300 x 050 mm, fabricado em chapa #18 (1,25 mm)","m",1.05,"Pini 16.113.000359.SER",27.29,"Pesquisa de preços",null,{"$f":"ROUND(H1395*F1395,2)","v":28.65}]
[null,null,"SF-00241","Barra roscada em aço Ø 1/4\", comprimento 1 m, bicromatizada ou zincada","m",1.6,"Pini 16.113.000359.SER",3.1589999999999998,"Pini 16.113.000359.SER",null,{"$f":"ROUNDUP(H1396*F1396,2)","v":5.0599999999999996}]
[null,null,"SF-00241","Porca sextavada de aço galvanizado Ø 1/4\"","un ",5.3367000000000004,"Pini 16.113.000350.SER",0.16200000000000001,"Sinapi 39997",null,0.86]
[null,null,"SF-00241","Arruela em aço galvanizado Ø 1/4\"","un ",5.34,"Pini 16.113.000359.SER",9.9000000000000005E-2,"Pini 16.113.000359.SER",null,0.53]
[null,null,"SF-00241","Suporte suspensão omega para eletrocalha 300 x 50 mm largura x aba","un ",0.67,"Pini 16.113.000359.SER",3.762,"Pini 16.113.000359.SER",null,2.52]
[null,null,"SF-00241","Prolongador para tirante rosqueado de 1/4\" x 50 mm","un ",1.3332999999999999,"Pini 16.113.000359.SER",2.8530000000000002,"Pini 16.113.000359.SER",null,{"$f":"ROUNDUP(H1400*F1400,2)","v":3.8099999999999996}]
[null,null,"SF-00241","Parafuso lentilha 1/4 x 1/2\"","un",2.67,"Pini 16.113.000359.SER",0.52200000000000002,"Pini 16.113.000359.SER",null,{"$f":"ROUNDUP(H1401*F1401,2)","v":1.4}]
[null,null,"SF-00241","Tala auto portante para emenda 100 mm","un ",0.67,"Pini 16.113.000359.SER",3.0059999999999998,"Pini 16.113.000359.SER",null,{"$f":"ROUNDUP(H1402*F1402,2)","v":2.0199999999999996}]
[null,null,"SF-00241","Tampa de encaixe para eletrocalha aço galvanizado perfurada ou lisa, 300 mm","m",1.05,"Pini 16.113.000359.SER",11.21,"Pesquisa de preços",null,11.77]
[null,null,"",null,null,null,null,""]
["SF-00242","Eletrocalha 400x50 mm","",null,"m",null,"Pini 16.113.000362.SER Adaptada",""]
[null,null,"",null,null,null,null,""]
[null,null,"SF-00242","Eletricista com encargos complementares","h",0.55000000000000004,"Pini 16.113.000362.SER",18.297000000000001,"Sinapi 88264",null,null,{"$f":"ROUND(H1407*F1407,2)","v":10.06},{"$f":"SUM(J1407:L1418)","v":105.82000000000001}]
[null,null,"SF-00242","Auxiliar de eletricista com encargos complementares","h",0.55000000000000004,"Pini 16.113.000362.SER",14.048999999999999,"Sinapi 88247",null,null,{"$f":"ROUND(H1408*F1408,2)","v":7.73}]
[null,null,"SF-00242","Tiro com pistola para fixação de pino Ø 1/4\" em concreto, inclusive cartucho e pino","un ",1.3332999999999999,"Pini 16.113.000362.SER",6.1559999999999997,"Pini 16.113.000362.SER",null,{"$f":"ROUND(H1409*F1409,2)","v":8.2100000000000009}]
[null,null,"SF-00242","Eletrocalha perfurada (cabos elétricos) ou lisa (dados), tipo \"U\", de aço galvanizado eletrolítico 400 x 050 mm, fabricado em chapa #16 (1,55 mm)","m",1.05,"Pini 16.113.000362.SER",45.85,"Pesquisa de preços",null,{"$f":"ROUNDDOWN(H1410*F1410,2)","v":48.14}]
[null,null,"SF-00242","Barra roscada em aço Ø 1/4\", comprimento 1 m, bicromatizada ou zincada","m",1.6,"Pini 16.113.000362.SER",3.1589999999999998,"Pini 16.113.000362.SER",null,{"$f":"ROUNDUP(H1411*F1411,2)","v":5.0599999999999996}]
[null,null,"SF-00242","Porca sextavada de aço galvanizado Ø 1/4\"","un ",5.3367000000000004,"Pini 16.113.000350.SER",0.16200000000000001,"Sinapi 39997",null,{"$f":"ROUND(H1412*F1412,2)","v":0.86}]
[null,null,"SF-00242","Arruela em aço galvanizado Ø 1/4\"","un ",5.34,"Pini 16.113.000362.SER",9.9000000000000005E-2,"Pini 16.113.000362.SER",null,0.53]
[null,null,"SF-00242","Suporte suspensão omega para eletrocalha 400 x 50 mm largura x aba","un ",0.67,"Pini 16.113.000362.SER",3.9149999999999996,"Pini 16.113.000362.SER",null,2.62]
[null,null,"SF-00242","Prolongador para tirante rosqueado de 1/4\" x 50 mm","un ",1.3332999999999999,"Pini 16.113.000362.SER",2.8530000000000002,"Pini 16.113.000362.SER",null,{"$f":"ROUNDUP(H1415*F1415,2)","v":3.8099999999999996}]
[null,null,"SF-00242","Parafuso lentilha 1/4 x 1/2\"","un",2.67,"Pini 16.113.000362.SER",0.52200000000000002,"Pini 16.113.000362.SER",null,{"$f":"ROUNDUP(H1416*F1416,2)","v":1.4}]
[null,null,{"$f":"IF(AND(D1417<>\"\",A1415=\"\"),C1416,IF(D1417<>\"\",A1415,\"\"))","v":"SF-00242"},"Tala auto portante para emenda 100 mm","un ",0.67,"Pini 16.113.000362.SER",3.0059999999999998,"Pini 16.113.000362.SER",null,{"$f":"ROUNDUP(H1417*F1417,2)","v":2.0199999999999996}]
[null,null,"SF-00242","Tampa de encaixe para eletrocalha aço galvanizado perfurada ou lisa, 400 mm","m",1.05,"Pini 16.113.000362.SER",14.65,"Pesquisa de preços",null,15.38]
[null,null,"",null,null,null,null,""]
["SF-00243","Eletrocalha 50x50 mm","",null,"m",null,"Pini 16.113.000344.SER Adaptada",""]
[null,null,"",null,null,null,null,""]
[null,null,"SF-00243","Eletricista com encargos complementares","h",0.45,"Pini 16.113.000344.SER",18.297000000000001,"Sinapi 88264",null,null,{"$f":"ROUNDUP(H1422*F1422,2)","v":8.24},{"$f":"SUM(J1422:L1433)","v":39.79999999999999}]
[null,null,"SF-00243","Auxiliar de eletricista com encargos complementares","h",0.45,"Pini 16.113.000344.SER",14.048999999999999,"Sinapi 88247",null,null,{"$f":"ROUND(H1423*F1423,2)","v":6.32}]
[null,null,"SF-00243","Tiro com pistola para fixação de pino Ø 1/4\" em concreto, inclusive cartucho e pino","un ",0.67,"Pini 16.113.000344.SER",6.1559999999999997,"Pini 16.113.000344.SER",null,{"$f":"ROUND(H1424*F1424,2)","v":4.12}]
[null,null,"SF-00243","Eletrocalha perfurada (cabos elétricos) ou lisa (dados), tipo \"U\", de aço galvanizado eletrolítico 50 x 50 mm, fabricado em chapa #22 (0,8 mm)","m",1.05,"Pini 16.113.000344.SER",6.58,"Pesquisa de preços",null,{"$f":"ROUND(H1425*F1425,2)","v":6.91}]
[null,null,"SF-00243","Barra roscada em aço Ø 1/4\", comprimento 1 m, bicromatizada ou zincada","m",0.8,"Pini 16.113.000344.SER",3.1589999999999998,"Pini 16.113.000344.SER",null,2.5299999999999998]
[null,null,"SF-00243","Porca sextavada de aço galvanizado Ø 1/4\"","un ",4.0033000000000003,"Pini 16.113.000344.SER",0.16200000000000001,"Sinapi 39997",null,0.65]
[null,null,"SF-00243","Arruela em aço galvanizado Ø 1/4\"","un ",4.0033000000000003,"Pini 16.113.000344.SER",9.0000000000000011E-2,"Pini 16.113.000344.SER",null,0.36]
[null,null,"SF-00243","Suporte suspensão vertical para eletrocalha 50 x 50 mm largura x aba","un ",0.67,"Pini 16.113.000344.SER",2.286,"Pini 16.113.000344.SER",null,{"$f":"ROUND(H1429*F1429,2)","v":1.53}]
[null,null,"SF-00243","Prolongador para tirante rosqueado de 1/4\" x 50 mm","un ",1.05,"Pini 16.113.000344.SER",2.8530000000000002,"Pini 16.113.000344.SER",null,3]
[null,null,"SF-00243","Parafuso lentilha 1/4 x 1/2\"","un",2.67,"Pini 16.113.000344.SER",0.52200000000000002,"Pini 16.113.000344.SER",null,{"$f":"ROUNDUP(H1431*F1431,2)","v":1.4}]
[null,null,"SF-00243","Tala auto portante para emenda 50 mm","un ",0.66669999999999996,"Pini 16.113.000344.SER",3.0059999999999998,"Pini 16.113.000344.SER",null,{"$f":"ROUNDUP(H1432*F1432,2)","v":2.0099999999999998}]
[null,null,"SF-00243","Tampa de encaixe para eletrocalha aço galvanizado perfurada ou lisa, 50 mm","m",1.05,"Pini 16.113.000344.SER",2.6,"Pesquisa de preços",null,2.73]
[null,null,"",null,null,null,null,""]
["SF-00244","Eletroduto de aço galvanizado de 1 1/2\"","",null,"m",null,"Sinapi 95752 Adaptada",""]
[null,null,"",null,null,null,null,""]
[null,null,"SF-00244","Eletroduto de aço com costura galvanização eletrolítica Ø 1 1/2\"","m",1.05,"Sinapi 95752",8.270999999999999,"Pini 16.111.000204.SER",null,{"$f":"ROUNDUP(H1437*F1437,2)","v":8.69},null,{"$f":"SUM(J1437:L1441)","v":24.400000000000002}]
[null,null,"SF-00244","Eletricista com encargos complementares","h",0.28210000000000002,"Sinapi 95752",18.297000000000001,"Sinapi 88264",null,null,{"$f":"ROUNDUP(H1438*F1438,2)","v":5.17}]
[null,null,"SF-00244","Auxiliar de eletricista com encargos complementares","h",0.28210000000000002,"Sinapi 95752",14.048999999999999,"Sinapi 88247",null,null,{"$f":"ROUND(H1439*F1439,2)","v":3.96}]
[null,null,"SF-00244","Fixação de tubos verticais de PPR diâmetros menores ou iguais a 40 mm com abraçadeira metálica rígida tipo D 1/2\", fixada em perfilado em alvenaria. af_05/2015","m",2,"Sinapi 95752",{"$f":"OFFSET(INDEX('Composições Auxiliares'!A:L,MATCH(D1440,'Composições Auxiliares'!A:A,0),12),2,0)","v":0.97},"Sinapi 91173",{"$f":"ROUNDUP(H1440*F1440,2)","v":1.94}]
[null,null,"SF-00244","Luva de emenda para eletroduto, aço galvanizado, DN 40 mm (1 1/2''), aparente, instalada em parede - fornecimento e instalação. af_11/2016_p","un",0.33329999999999999,"Sinapi 95752",{"$f":"OFFSET(INDEX('Composições Auxiliares'!A:L,MATCH(D1441,'Composições Auxiliares'!A:A,0),12),2,0)","v":13.9},"Sinapi 95760",{"$f":"ROUNDUP(H1441*F1441,2)","v":4.6399999999999997}]
[null,null,"",null,null,null,null,""]
["SF-00245","Eletroduto de aço galvanizado de 1 1/4\"","",null,"m",null,"Sinapi 95751 Adaptada",""]
[null,null,"",null,null,null,null,""]
[null,null,"SF-00245","Eletroduto de aço com costura galvanização eletrolítica Ø 1 1/4\"","m",1.05,"Sinapi 95751",6.7140000000000004,"Pini 16.111.000203.SER",null,{"$f":"ROUND(H1445*F1445,2)","v":7.05},null,{"$f":"SUM(J1445:L1449)","v":20.71}]
[null,null,"SF-00245","Eletricista com encargos complementares","h",0.247,"Sinapi 95751",18.297000000000001,"Sinapi 88264",null,null,{"$f":"ROUND(H1446*F1446,2)","v":4.5199999999999996}]
[null,null,"SF-00245","Auxiliar de eletricista com encargos complementares","h",0.247,"Sinapi 95751",14.048999999999999,"Sinapi 88247",null,null,{"$f":"ROUND(H1447*F1447,2)","v":3.47}]
[null,null,"SF-00245","Fixação de tubos verticais de PPR diâmetros menores ou iguais a 40 mm com abraçadeira metálica rígida tipo D 1/2\", fixada em perfilado em alvenaria. af_05/2015","m",2,"Sinapi 95751",{"$f":"OFFSET(INDEX('Composições Auxiliares'!A:L,MATCH(D1448,'Composições Auxiliares'!A:A,0),12),2,0)","v":0.97},"Sinapi 91173",{"$f":"ROUND(H1448*F1448,2)","v":1.94}]
[null,null,"SF-00245","Luva de emenda para eletroduto, aço galvanizado, DN 32 mm (1 1/4''), aparente, instalada em parede - fornecimento e instalação. af_11/2016_p","un",0.33329999999999999,"Sinapi 95751",{"$f":"OFFSET(INDEX('Composições Auxiliares'!A:L,MATCH(D1449,'Composições Auxiliares'!A:A,0),12),2,0)","v":11.18},"Sinapi 95759",{"$f":"ROUND(H1449*F1449,2)","v":3.73}]
[null,null,"",null,null,null,null,""]
["SF-00246","Eletroduto de aço galvanizado de 1\"","",null,"m",null,"Sinapi 95750 Adaptada",""]
[null,null,"",null,null,null,null,""]
[null,null,"SF-00246","Eletroduto de aço com costura galvanização eletrolítica Ø 1\"","m",1.05,"Sinapi 95750",5.3820000000000006,"Pini 16.111.000202.SER",null,{"$f":"ROUND(H1453*F1453,2)","v":5.65},null,{"$f":"SUM(J1453:L1457)","v":17.47}]
[null,null,"SF-00246","Eletricista com encargos complementares","h",0.21629999999999999,"Sinapi 95750",18.297000000000001,"Sinapi 88264",null,null,{"$f":"ROUND(H1454*F1454,2)","v":3.96}]
[null,null,"SF-00246","Auxiliar de eletricista com encargos complementares","h",0.21629999999999999,"Sinapi 95750",14.048999999999999,"Sinapi 88247",null,null,{"$f":"ROUND(H1455*F1455,2)","v":3.04}]
[null,null,"SF-00246","Fixação de tubos verticais de PPR diâmetros menores ou iguais a 40 mm com abraçadeira metálica rígida tipo D 1/2\", fixada em perfilado em alvenaria. af_05/2015","m",2,"Sinapi 95750",{"$f":"OFFSET(INDEX('Composições Auxiliares'!A:L,MATCH(D1456,'Composições Auxiliares'!A:A,0),12),2,0)","v":0.97},"Sinapi 91173",{"$f":"ROUND(H1456*F1456,2)","v":1.94}]
[null,null,"SF-00246","Luva de emenda para eletroduto, aço galvanizado, DN 25 mm (1''), aparente, instalada em parede - fornecimento e instalação. af_11/2016_p","un",0.33329999999999999,"Sinapi 95750",{"$f":"OFFSET(INDEX('Composições Auxiliares'!A:L,MATCH(D1457,'Composições Auxiliares'!A:A,0),12),2,0)","v":8.65},"Sinapi 95758",{"$f":"ROUND(H1457*F1457,2)","v":2.88}]
[null,null,"",null,null,null,null,""]
["SF-00247","Eletroduto de aço galvanizado de 2\"","",null,"m",null,"Sinapi 95752 Adaptada",""]
[null,null,"",null,null,null,null,""]
[null,null,"SF-00247","Eletroduto de aço com costura galvanização eletrolítica Ø 2\"","m",1.05,"Sinapi 95752",10.872,"Pini 16.111.000205.SER",null,{"$f":"ROUNDDOWN(H1461*F1461,2)","v":11.41},null,{"$f":"SUM(J1461:L1465)","v":29.769999999999996}]
[null,null,"SF-00247","Eletricista com encargos complementares","h",0.28210000000000002,"Sinapi 95752",18.297000000000001,"Sinapi 88264",null,null,{"$f":"ROUNDUP(H1462*F1462,2)","v":5.17}]
[null,null,"SF-00247","Auxiliar de eletricista com encargos complementares","h",0.28210000000000002,"Sinapi 95752",14.048999999999999,"Sinapi 88247",null,null,{"$f":"ROUND(H1463*F1463,2)","v":3.96}]
[null,null,"SF-00247","Fixação de tubos verticais de PPR diâmetros maiores que 40 mm e menores ou iguais a 75 mm com abraçadeira metálica rígida tipo D 2\", fixada em perfilado em alvenaria. af_05/2015","m",2,"Sinapi 95752",{"$f":"OFFSET(INDEX('Composições Auxiliares'!A:L,MATCH(D1464,'Composições Auxiliares'!A:A,0),12),2,0)","v":1.95},"Sinapi 91174",{"$f":"ROUNDDOWN(H1464*F1464,2)","v":3.9}]
[null,null,"SF-00247","Luva de emenda para eletroduto, aço galvanizado, DN 50 mm (2''), aparente, instalada em parede - fornecimento e instalação. af_11/2016_p","un",0.33329999999999999,"Sinapi 95752",{"$f":"OFFSET(INDEX('Composições Auxiliares'!A:L,MATCH(D1465,'Composições Auxiliares'!A:A,0),12),2,0)","v":15.99},"Sinapi 95760 Adaptada",{"$f":"ROUND(H1465*F1465,2)","v":5.33}]
[null,null,"",null,null,null,null,""]
["SF-00248","Eletroduto de aço galvanizado de 3/4\"","",null,"m",null,"Sinapi 95749 Adaptada",""]
[null,null,"",null,null,null,null,""]
[null,null,"SF-00248","Eletroduto de aço com costura galvanização eletrolítica Ø 3/4\"","m",1.05,"Sinapi 95749",3.3120000000000003,"Pini 16.111.000201.SER",null,{"$f":"ROUNDDOWN(H1469*F1469,2)","v":3.47},null,{"$f":"SUM(J1469:L1473)","v":14.27}]
[null,null,"SF-00248","Eletricista com encargos complementares","h",0.19439999999999999,"Sinapi 95749",18.297000000000001,"Sinapi 88264",null,null,{"$f":"ROUND(H1470*F1470,2)","v":3.56}]
[null,null,"SF-00248","Auxiliar de eletricista com encargos complementares","h",0.19439999999999999,"Sinapi 95749",14.048999999999999,"Sinapi 88247",null,null,{"$f":"ROUND(H1471*F1471,2)","v":2.73}]
[null,null,"SF-00248","Fixação de tubos verticais de PPR diâmetros menores ou iguais a 40 mm com abraçadeira metálica rígida tipo D 1/2\", fixada em perfilado em alvenaria. af_05/2015","m",2,"Sinapi 95749",{"$f":"OFFSET(INDEX('Composições Auxiliares'!A:L,MATCH(D1472,'Composições Auxiliares'!A:A,0),12),2,0)","v":0.97},"Sinapi 91173",{"$f":"ROUNDUP(H1472*F1472,2)","v":1.94}]
[null,null,"SF-00248","Luva de emenda para eletroduto, aço galvanizado, DN 20 mm (3/4''), aparente, instalada em parede - fornecimento e instalação. af_11/2016_p","un",0.33329999999999999,"Sinapi 95749",{"$f":"OFFSET(INDEX('Composições Auxiliares'!A:L,MATCH(D1473,'Composições Auxiliares'!A:A,0),12),2,0)","v":7.6899999999999995},"Sinapi 95757",{"$f":"ROUNDUP(H1473*F1473,2)","v":2.57}]
[null,null,"",null,null,null,null,""]
["SF-00249","Eletroduto de PVC Corrugado Reforçado 1'' (DE 32mm)","",null,"m",null,"Sinapi 91836 Adaptada",""]
[null,null,"",null,null,null,null,""]
[null,null,"SF-00249","Eletroduto PVC flexivel corrugado, reforcado, cor laranja, de 32 mm, para lajes e pisos","m",1.1000000000000001,"Sinapi 91836",4.266,"Sinapi 39245",null,{"$f":"ROUND(H1477*F1477,2)","v":4.6900000000000004},null,{"$f":"SUM(J1477:L1480)","v":9.52}]
[null,null,"SF-00249","Eletricista com encargos complementares","h",0.09,"Sinapi 91836",18.297000000000001,"Sinapi 88264",null,null,{"$f":"ROUND(H1478*F1478,2)","v":1.65}]
[null,null,"SF-00249","Auxiliar de eletricista com encargos complementares","h",0.09,"Sinapi 91836",14.048999999999999,"Sinapi 88247",null,null,{"$f":"ROUND(H1479*F1479,2)","v":1.26}]
[null,null,"SF-00249","Fixação de tubos horizontais de PVC, CPVC ou cobre diâmetros menores ou iguais a 40 mm ou eletrocalhas até 150mm de largura, com abraçadeira metálica rígida tipo d 1/2\u0094, fixada em perfilado em laje. af_05/2015","m",1,"Sinapi 91836",{"$f":"OFFSET(INDEX('Composições Auxiliares'!A:L,MATCH(D1480,'Composições Auxiliares'!A:A,0),12),2,0)","v":1.92},"Sinapi 91170",{"$f":"ROUND(H1480*F1480,2)","v":1.92}]
[null,null,{"$f":"IF(AND(D1481<>\"\",A1479=\"\"),C1480,IF(D1481<>\"\",A1479,\"\"))","v":""},null,null,null,null,""]
["SF-00250","Eletroduto de PVC Corrugado Reforçado 3/4'' (DE 25mm)","",null,"m",null,"Sinapi 91834 Adaptada",""]
[null,null,"",null,null,null,null,""]
[null,null,"SF-00250","Eletricista com encargos complementares","h",7.0000000000000007E-2,"Sinapi 91834",18.297000000000001,"Sinapi 88264",null,null,{"$f":"ROUND(H1484*F1484,2)","v":1.28},{"$f":"SUM(J1484:L1487)","v":6.6199999999999992}]
[null,null,"SF-00250","Auxiliar de eletricista com encargos complementares","h",7.0000000000000007E-2,"Sinapi 91834",14.048999999999999,"Sinapi 88247",null,null,{"$f":"ROUND(H1485*F1485,2)","v":0.98}]
[null,null,"SF-00250","Eletroduto PVC flexivel corrugado, reforcado, cor laranja, de 25 mm, para lajes e pisos","m",1.1000000000000001,"Sinapi 91834",2.214,"Sinapi 39244",null,{"$f":"ROUND(H1486*F1486,2)","v":2.44}]
[null,null,"SF-00250","Fixação de tubos horizontais de PVC, CPVC ou cobre diâmetros menores ou iguais a 40 mm ou eletrocalhas até 150mm de largura, com abraçadeira metálica rígida tipo d 1/2\u0094, fixada em perfilado em laje. af_05/2015","m",1,"Sinapi 91834",{"$f":"OFFSET(INDEX('Composições Auxiliares'!A:L,MATCH(D1487,'Composições Auxiliares'!A:A,0),12),2,0)","v":1.92},"Sinapi 91170",{"$f":"ROUND(H1487*F1487,2)","v":1.92}]
[null,null,"",null,null,null,null,""]
["SF-00251","Eletroduto flexível metálico com capa de PVC 1’’","",null,"m",null,"Sinapi 91846 Adaptada",""]
[null,null,"",null,null,null,null,""]
[null,null,"SF-00251","Eletroduto flexivel, em aco galvanizado, revestido externamente com PVC preto, diametro externo de 32 mm (1\"), tipo sealtubo","m",1.1000000000000001,"Sinapi 91846",14.076000000000001,"Sinapi 2501",null,{"$f":"ROUND(H1491*F1491,2)","v":15.48},null,{"$f":"SUM(J1491:L1494)","v":18.96}]
[null,null,"SF-00251","Arame recozido 16 BWG, 1,60 mm (0,016 kg/m)","kg",2E-3,"Sinapi 91846",8.8469999999999995,"Sinapi 34562",null,{"$f":"ROUND(H1492*F1492,2)","v":0.02}]
[null,null,"SF-00251","Auxiliar de eletricista com encargos complementares","h",0.107,"Sinapi 91846",14.048999999999999,"Sinapi 88247",null,null,{"$f":"ROUND(H1493*F1493,2)","v":1.5}]
[null,null,"SF-00251","Eletricista com encargos complementares","h",0.107,"Sinapi 91846",18.297000000000001,"Sinapi 88264",null,null,{"$f":"ROUND(H1494*F1494,2)","v":1.96}]
[null,null,"",null,null,null,null,""]
["SF-00252","Eletroduto flexível metálico com capa de PVC 3/4\"","",null,"m",null,"Sinapi 91844 Adaptada",""]
[null,null,"",null,null,null,null,""]
[null,null,"SF-00252","Eletroduto flexivel, em aco galvanizado, revestido externamente com PVC preto, diametro externo de 25 mm (3/4\"), tipo sealtubo","m",1.1000000000000001,"Sinapi 91844",10.737,"Sinapi 2504",null,{"$f":"ROUND(H1498*F1498,2)","v":11.81},null,{"$f":"SUM(J1498:L1501)","v":14.64}]
[null,null,"SF-00252","Arame recozido 16 BWG, 1,60 mm (0,016 kg/m)","kg",1.8E-3,"Sinapi 91844",8.8469999999999995,"Sinapi 34562",null,{"$f":"ROUND(H1499*F1499,2)","v":0.02}]
[null,null,"SF-00252","Auxiliar de eletricista com encargos complementares","h",8.6999999999999994E-2,"Sinapi 91844",14.048999999999999,"Sinapi 88247",null,null,{"$f":"ROUND(H1500*F1500,2)","v":1.22}]
[null,null,"SF-00252","Eletricista com encargos complementares","h",8.6999999999999994E-2,"Sinapi 91844",18.297000000000001,"Sinapi 88264",null,null,{"$f":"ROUND(H1501*F1501,2)","v":1.59}]
[null,null,"",null,null,null,null,""]
["SF-00253","Perfilado 38x38mm","",null,"m",null,"Pini 16.113.000972.SER Adaptada",""]
[null,null,"",null,null,null,null,""]
[null,null,"SF-00253","Perfilado perfurado em aço galvanizado # 18, 38 x 38 mm","m",1.05,"Pini 16.113.000972.SER",9.77,"Pesquisa de preços",null,{"$f":"ROUND(H1505*F1505,2)","v":10.26},null,{"$f":"SUM(J1505:L1516)","v":42.169999999999995}]
[null,null,"SF-00253","Auxiliar de eletricista com encargos complementares","h",0.45,"Pini 16.113.000972.SER",14.048999999999999,"Sinapi 88247",null,null,{"$f":"ROUND(H1506*F1506,2)","v":6.32}]
[null,null,"SF-00253","Eletricista com encargos complementares","h",0.45,"Pini 16.113.000972.SER",18.297000000000001,"Sinapi 88264",null,null,{"$f":"ROUNDUP(H1507*F1507,2)","v":8.24}]
[null,null,"SF-00253","Tiro com pistola para fixação de pino Ø 1/4\" em concreto, inclusive cartucho e pino","un ",0.67,"Pini 16.113.000972.SER",6.1559999999999997,"Pini 16.113.000972.SER",null,{"$f":"ROUND(H1508*F1508,2)","v":4.12}]
[null,null,"SF-00253","Suporte curto para perfilado em aço galvanizado # 22, 38 mm x 100 mm","un ",0.67,"Pini 16.113.000972.SER",1.2240000000000002,"Pini 16.113.000972.SER",null,{"$f":"ROUND(H1509*F1509,2)","v":0.82}]
[null,null,"SF-00253","Barra roscada em aço Ø 1/4\", comprimento 1 m, bicromatizada ou zincada","m",0.8,"Pini 16.113.000972.SER",3.1589999999999998,"Pini 16.113.000972.SER",null,2.5299999999999998]
[null,null,"SF-00253","Porca sextavada de aço galvanizado Ø 1/4\"","un ",2.6633,"Pini 16.113.000350.SER",0.16200000000000001,"Sinapi 39997",null,0.43]
[null,null,"SF-00253","Arruela em aço galvanizado Ø 1/4\"","un ",2.6633,"Pini 16.113.000972.SER",9.9000000000000005E-2,"Pini 16.113.000972.SER",null,0.26]
[null,null,"SF-00253","Prolongador para tirante rosqueado de 1/4\" x 50 mm","un ",0.67,"Pini 16.113.000972.SER",2.8530000000000002,"Pini 16.113.000972.SER",null,1.91]
[null,null,"SF-00253","Parafuso lentilha 1/4 x 1/2\"","un ",1.33,"Pini 16.113.000972.SER",0.52200000000000002,"Pini 16.113.000972.SER",null,0.69]
[null,null,"SF-00253","Tala 4 furos para emenda 38 mm","un ",0.33329999999999999,"Pini 16.113.000972.SER",2.8530000000000002,"Pini 16.113.000972.SER",null,0.95]
[null,null,"SF-00253","Tampa de encaixe para perfilado em aço galvanizado 38 mm","m",1.05,"Pini 16.113.000972.SER",5.3730000000000002,"Pini 16.113.000972.SER",null,5.64]
[null,null,"",null,null,null,null,""]
["SF-00254","Espelho 4x2","",null,"un",null,"Sinapi 91947",""]
[null,null,"",null,null,null,null,""]
[null,null,"SF-00254","Espelho / placa de 3 postos 4\" x 2\", para instalacao de tomadas e interruptores","un",1,"Sinapi 91947",2.25,"Sinapi 38094",null,{"$f":"ROUND(H1520*F1520,2)","v":2.25},null,{"$f":"SUM(J1520:L1522)","v":5.03}]
[null,null,"SF-00254","Suporte de fixacao para espelho / placa 4\" x 2\", para 3 modulos, para instalacao de tomadas e interruptores (somente suporte)","un",1,"Sinapi 91947",1.1700000000000002,"Sinapi 38099",null,1.17]
[null,null,"SF-00254","Eletricista com encargos complementares","h",8.7999999999999995E-2,"Sinapi 91947",18.297000000000001,"Sinapi 88264",null,null,{"$f":"ROUND(H1522*F1522,2)","v":1.61}]
[null,null,"",null,null,null,null,""]
["SF-00255","Espelho 4x4","",null,"un",null,"Sinapi 91951",""]
[null,null,"",null,null,null,null,""]
[null,null,"SF-00255","Espelho / placa de 6 postos 4\" x 4\", para instalacao de tomadas e interruptores","un",1,"Sinapi 91951",4.5720000000000001,"Sinapi 38098",null,{"$f":"ROUND(H1526*F1526,2)","v":4.57},null,{"$f":"SUM(J1526:L1528)","v":8.3800000000000008}]
[null,null,"SF-00255","Suporte de fixacao para espelho / placa 4\" x 4\", para 6 modulos, para instalacao de tomadas e interruptores (somente suporte)","un",1,"Sinapi 91951",1.9080000000000001,"Sinapi 38100",null,{"$f":"ROUND(H1527*F1527,2)","v":1.91}]
[null,null,"SF-00255","Eletricista com encargos complementares","h",0.104,"Sinapi 91951",18.297000000000001,"Sinapi 88264",null,null,{"$f":"ROUND(H1528*F1528,2)","v":1.9}]
[null,null,"",null,null,null,null,""]
["SF-00256","Espelho cego redondo","",null,"un",null,"Sinapi 91947",""]
[null,null,"",null,null,null,null,""]
[null,null,"SF-00256","Espelho cego redondo. Ref: Tramontina Lux2 3x3 (57102/091); Pial 8530.","un",1,"Sinapi 91951",3.19,"Pesquisa de Preços",null,{"$f":"ROUND(H1532*F1532,2)","v":3.19},null,{"$f":"SUM(J1532:L1534)","v":7}]
[null,null,"SF-00256","Suporte de fixacao para espelho / placa 4\" x 4\", para 6 modulos, para instalacao de tomadas e interruptores (somente suporte)","un",1,"Sinapi 91951",1.9080000000000001,"Sinapi 38100",null,1.91]
[null,null,"SF-00256","Eletricista com encargos complementares","h",0.104,"Sinapi 91951",18.297000000000001,"Sinapi 88264",null,null,{"$f":"ROUND(H1534*F1534,2)","v":1.9}]
[null,null,"",null,null,null,null,""]
["SF-00257","Interruptor para condulete","",null,"un",null,"Pini 16.115.000191.SER Adaptada",""]
[null,null,"",null,null,null,null,""]
[null,null,"SF-00257","Eletricista com encargos complementares","h",0.3,"Pini 16.115.000191.SER",18.297000000000001,"Sinapi 88264",null,null,{"$f":"ROUND(H1538*F1538,2)","v":5.49},{"$f":"SUM(J1538:L1541)","v":24.65}]
[null,null,"SF-00257","Auxiliar de eletricista com encargos complementares","h",0.3,"Pini 16.115.000191.SER",14.048999999999999,"Sinapi 88247",null,null,4.21]
[null,null,"SF-00257","Tampa para condulete alumínio para eletrodutos de 1\", de sobrepor , com conexões e acessórios. ","un",1,"Pini 16.115.000191.SER",2.89,"Pesquisa de Preços",null,{"$f":"ROUND(H1540*F1540,2)","v":2.89}]
[null,null,"SF-00257","Interruptor para condulete alumínio para eletrodutos de 1’’, de sobrepor, com conexões e acessórios.","un",1,"Pini 16.115.000191.SER",12.06,"Pesquisa de Preços",null,{"$f":"ROUND(H1541*F1541,2)","v":12.06}]
[null,null,"",null,null,null,null,""]
["SF-00258","Módulo cego","",null,"un",null,"Orse 00711 Adaptada",""]
[null,null,"",null,null,null,null,""]
[null,null,{"$f":"IF(AND(D1545<>\"\",A1543=\"\"),C1544,IF(D1545<>\"\",A1543,\"\"))","v":"SF-00258"},"Eletricista com encargos complementares","h",0.1,"Orse 00711",18.297000000000001,"Sinapi 88264",null,null,{"$f":"ROUND(H1545*F1545,2)","v":1.83},{"$f":"SUM(J1545:L1546)","v":3.79}]
[null,null,"SF-00258","Módulo cego","un",1,"Orse 00711",1.96,"Pesquisa de Preços",null,{"$f":"ROUND(H1546*F1546,2)","v":1.96}]
[null,null,"",null,null,null,null,""]
["SF-00259","Módulo interruptor paralelo","",null,"un",null,"Sinapi 91954",""]
[null,null,"",null,null,null,null,""]
[null,null,"SF-00259","Interruptor paralelo 10A, 250V (apenas modulo)","un",1,"Sinapi 91954",6.9210000000000003,"Sinapi 38113",null,{"$f":"ROUND(H1550*F1550,2)","v":6.92},null,{"$f":"SUM(J1550:L1552)","v":16.88}]
[null,null,"SF-00259","Auxiliar de eletricista com encargos complementares","h",0.308,"Sinapi 91954",14.048999999999999,"Sinapi 88247",null,null,{"$f":"ROUND(H1551*F1551,2)","v":4.33}]
[null,null,"SF-00259","Eletricista com encargos complementares","h",0.308,"Sinapi 91954",18.297000000000001,"Sinapi 88264",null,null,{"$f":"ROUNDDOWN(H1552*F1552,2)","v":5.63}]
[null,null,"",null,null,null,null,""]
["SF-00260","Módulo interruptor simples","",null,"un",null,"Sinapi 91952",""]
[null,null,"",null,null,null,null,""]
[null,null,"SF-00260","Interruptor simples 10A, 250V (apenas modulo)","un",1,"Sinapi 91952",5.319,"Sinapi 38112",null,{"$f":"ROUND(H1556*F1556,2)","v":5.32},null,{"$f":"SUM(J1556:L1558)","v":12.59}]
[null,null,"SF-00260","Auxiliar de eletricista com encargos complementares","h",0.22500000000000001,"Sinapi 91952",14.048999999999999,"Sinapi 88247",null,null,{"$f":"ROUND(H1557*F1557,2)","v":3.16}]
[null,null,"SF-00260","Eletricista com encargos complementares","h",0.22500000000000001,"Sinapi 91952",18.297000000000001,"Sinapi 88264",null,null,{"$f":"ROUNDDOWN(H1558*F1558,2)","v":4.1100000000000003}]
[null,null,"",null,null,null,null,""]
["SF-00261","Módulo para saída de fio","",null,"un",null,"Orse 00711 Adaptada",""]
[null,null,"",null,null,null,null,""]
[null,null,"SF-00261","Eletricista com encargos complementares","h",0.1,"Orse 00711",18.297000000000001,"Sinapi 88264",null,null,{"$f":"ROUND(H1562*F1562,2)","v":1.83},{"$f":"SUM(J1562:L1563)","v":3.33}]
[null,null,"SF-00261","Módulo para saída de fio","un",1,"Orse 00711",1.5,"Pesquisa de Preços",null,{"$f":"ROUND(H1563*F1563,2)","v":1.5}]
[null,null,"",null,null,null,null,""]
["SF-00262","Módulo sensor de presença","",null,"un",null,"Sinapi 91954 Adaptada",""]
[null,null,"",null,null,null,null,""]
[null,null,"SF-00262","Eletricista com encargos complementares","h",0.308,"Sinapi 91954",18.297000000000001,"Sinapi 88264",null,null,{"$f":"ROUNDDOWN(H1567*F1567,2)","v":5.63},{"$f":"SUM(J1567:L1569)","v":125.44}]
[null,null,"SF-00262","Auxiliar de eletricista com encargos complementares","h",0.308,"Sinapi 91954",14.048999999999999,"Sinapi 88247",null,null,{"$f":"ROUND(H1568*F1568,2)","v":4.33}]
[null,null,"SF-00262","Módulo sensor de presença","un",1,"Senado Federal",115.48,"Pesquisa de Preços",null,{"$f":"ROUND(H1569*F1569,2)","v":115.48}]
[null,null,"",null,null,null,null,""]
["SF-00263","Módulo tomada 10 A","",null,"un",null,"Sinapi 91998",""]
[null,null,"",null,null,null,null,""]
[null,null,"SF-00263","Tomada 2P+T 10A, 250V (apenas modulo)","un",1,"Sinapi 91998",6.048,"Sinapi 38101",null,{"$f":"ROUND(H1573*F1573,2)","v":6.05},null,{"$f":"SUM(J1573:L1575)","v":13.649999999999999}]
[null,null,"SF-00263","Auxiliar de eletricista com encargos complementares","h",0.23499999999999999,"Sinapi 91998",14.048999999999999,"Sinapi 88247",null,null,{"$f":"ROUND(H1574*F1574,2)","v":3.3}]
[null,null,"SF-00263","Eletricista com encargos complementares","h",0.23499999999999999,"Sinapi 91998",18.297000000000001,"Sinapi 88264",null,null,4.3]
[null,null,"",null,null,null,null,""]
["SF-00264","Módulo tomada 20 A","",null,"un",null,"Sinapi 91999",""]
[null,null,"",null,null,null,null,""]
[null,null,"SF-00264","Tomada 2P+T 20A, 250V (apenas modulo)","un",1,"Sinapi 91998",7.74,"Sinapi 38102",null,{"$f":"ROUND(H1579*F1579,2)","v":7.74},null,{"$f":"SUM(J1579:L1581)","v":15.34}]
[null,null,"SF-00264","Auxiliar de eletricista com encargos complementares","h",0.23499999999999999,"Sinapi 91998",14.048999999999999,"Sinapi 88247",null,null,{"$f":"ROUND(H1580*F1580,2)","v":3.3}]
[null,null,"SF-00264","Eletricista com encargos complementares","h",0.23499999999999999,"Sinapi 91998",18.297000000000001,"Sinapi 88264",null,null,4.3]
[null,null,"",null,null,null,null,""]
["SF-00265","Porta equipamentos para canaleta de alumínio aparente","",null,"un",null,"Pini 16.115.000180.SER Adaptada",""]
[null,null,"",null,null,null,null,""]
[null,null,"SF-00265","Eletricista com encargos complementares","h",0.1,"Pini 16.115.000180.SER",18.297000000000001,"Sinapi 88264",null,null,{"$f":"ROUND(H1585*F1585,2)","v":1.83},{"$f":"SUM(J1585:L1586)","v":20.170000000000002}]
[null,null,"SF-00265","Porta equipamentos para canaleta de alumínio aparente. Ref: Dutotec DT 64440.20 (branco)","un",1,"Pini 16.115.000180.SER",18.34,"Pesquisa de Preços",null,{"$f":"ROUND(H1586*F1586,2)","v":18.34}]
[null,null,"",null,null,null,null,""]
["SF-00266","Tampa cega metálica para caixas de piso 4x2","",null,"un",null,"Orse 00711 Adaptada",""]
[null,null,"",null,null,null,null,""]
[null,null,"SF-00266","Auxiliar de eletricista com encargos complementares","h",0.05,"Orse 00711 Adaptada",14.048999999999999,"Sinapi 88247",null,null,{"$f":"ROUND(H1590*F1590,2)","v":0.7},{"$f":"SUM(J1590:L1591)","v":12.18}]
[null,null,"SF-00266","Tampa cega para caixa de piso 4x2 cromada. ","un",1,"Orse 00711",11.48,"Pesquisa de Preços",null,{"$f":"ROUND(H1591*F1591,2)","v":11.48}]
[null,null,"",null,null,null,null,""]
["SF-00267","Tampa cega metálica para caixas de piso 4x4","",null,"un",null,"Orse 08998 Adaptada",""]
[null,null,"",null,null,null,null,""]
[null,null,"SF-00267","Auxiliar de eletricista com encargos complementares","h",0.05,"Orse 08998 Adaptada",14.048999999999999,"Sinapi 88247",null,null,{"$f":"ROUND(H1595*F1595,2)","v":0.7},{"$f":"SUM(J1595:L1596)","v":14.559999999999999}]
[null,null,"SF-00267","Tampa cega para caixa de piso 4x4 cromada. ","un",1,"Orse 08998",13.86,"Pesquisa de Preços",null,{"$f":"ROUND(H1596*F1596,2)","v":13.86}]
[null,null,"",null,null,null,null,""]
["SF-00268","Tampa cega para condulete","",null,"un",null,"Pini 16.115.000191.SER Adaptada",""]
[null,null,"",null,null,null,null,""]
[null,null,"SF-00268","Eletricista com encargos complementares","h",0.1,"Pini 16.115.000191.SER Adaptada",18.297000000000001,"Sinapi 88264",null,null,{"$f":"ROUND(H1600*F1600,2)","v":1.83},{"$f":"SUM(J1600:L1601)","v":4.6099999999999994}]
[null,null,"SF-00268","Tampa cega para condulete alumínio para eletrodutos de 1’’, de sobrepor, com conexões e acessórios.","un",1,"Pini 16.115.000191.SER",2.78,"Pesquisa de Preços",null,{"$f":"ROUND(H1601*F1601,2)","v":2.78}]
[null,null,"",null,null,null,null,""]
["SF-00269","Tampa RJ45 dupla para condulete","",null,"un",null,{"$f":"G1605","v":"Pini 16.115.000191.SER Adaptada"},""]
[null,null,"",null,null,null,null,""]
[null,null,"SF-00269","Eletricista com encargos complementares","h",0.1,"Pini 16.115.000191.SER Adaptada",18.297000000000001,"Sinapi 88264",null,null,{"$f":"ROUND(H1605*F1605,2)","v":1.83},{"$f":"SUM(J1605:L1606)","v":7.09}]
[null,null,"SF-00269","Espelho para dois módulos RJ45 para condulete alumínio para eletrodutos de 1’’, de sobrepor, com conexões e acessórios.","un",1,"Pini 16.115.000191.SER",5.26,"Pesquisa de Preços",null,{"$f":"ROUND(H1606*F1606,2)","v":5.26}]
[null,null,"",null,null,null,null,""]
["SF-00270","Tomada para condulete","",null,"un",null,"Pini 16.115.000191.SER Adaptada",""]
[null,null,{"$f":"IF(AND(D1609<>\"\",A1607=\"\"),C1608,IF(D1609<>\"\",A1607,\"\"))","v":""},null,null,null,null,""]
[null,null,"SF-00270","Eletricista com encargos complementares","h",0.3,"Pini 16.115.000191.SER",18.297000000000001,"Sinapi 88264",null,null,{"$f":"ROUND(H1610*F1610,2)","v":5.49},{"$f":"SUM(J1610:L1613)","v":24.2}]
[null,null,"SF-00270","Auxiliar de eletricista com encargos complementares","h",0.3,"Pini 16.115.000191.SER",14.048999999999999,"Sinapi 88247",null,null,4.21]
[null,null,"SF-00270","Tampa para condulete alumínio para eletrodutos de 1\", de sobrepor , com conexões e acessórios. ","un",1,"Pini 16.115.000191.SER",2.89,"Pesquisa de Preços",null,{"$f":"ROUND(H1612*F1612,2)","v":2.89}]
[null,null,"SF-00270","Tomada para condulete alumínio para eletrodutos de 1’’, de sobrepor, com conexões e acessórios. ","un",1,"Pini 16.115.000191.SER",11.61,"Pesquisa de Preços",null,11.61]
[null,null,"",null,null,null,null,""]
["SF-00271","Tomada para perfilado e eletrocalha","",null,"un",null,"Pini 16.113.000020.SER Adaptada",""]
[null,null,"",null,null,null,null,""]
[null,null,"SF-00271","Auxiliar de eletricista com encargos complementares","h",0.65,"Pini 16.113.000020.SER",14.048999999999999,"Sinapi 88247",null,null,{"$f":"ROUNDUP(H1617*F1617,2)","v":9.14},{"$f":"SUM(J1617:L1620)","v":34.32}]
[null,null,"SF-00271","Eletricista com encargos complementares","h",0.65,"Pini 16.113.000020.SER",18.297000000000001,"Sinapi 88264",null,null,{"$f":"ROUND(H1618*F1618,2)","v":11.89}]
[null,null,"SF-00271","Caixa com tampa fixa em perfil para tomada em perfilado","un",1,"Pini 16.113.000020.SER",3.1320000000000001,"Pini 16.113.000020.SER",null,{"$f":"ROUND(H1619*F1619,2)","v":3.13}]
[null,null,"SF-00271","Tomada de embutir 2 polos + terra sem placa 250 V 10 A","un",1,"Pini 16.113.000020.SER",10.161,"Pini 16.113.000020.SER",null,10.16]
[null,null,"",null,null,null,null,""]
["SF-00272","Bloco autônomo de emergência","",null,"un",null,"Sinapi 97599 Adaptada",""]
[null,null,"",null,null,null,null,""]
[null,null,"SF-00272","Bloco autônomo (luminária de emergência). Ref.: Aureon BLOKITO BLK 500 (9901.0000.1079.05 – Aclaramento e 9901.0000.1128.05 – balizamento)","un ",1,"Sinapi 97599",181.25,"Pesquisa de Preços",null,{"$f":"ROUND(H1624*F1624,2)","v":181.25},null,{"$f":"SUM(J1624:L1626)","v":185.59}]
[null,null,"SF-00272","Auxiliar de eletricista com encargos complementares","h",7.4800000000000005E-2,"Sinapi 97599",14.048999999999999,"Sinapi 88247",null,null,{"$f":"ROUND(H1625*F1625,2)","v":1.05}]
[null,null,"SF-00272","Eletricista com encargos complementares","h",0.17949999999999999,"Sinapi 97599",18.297000000000001,"Sinapi 88264",null,null,{"$f":"ROUNDUP(H1626*F1626,2)","v":3.2899999999999996}]
[null,null,"",null,null,null,null,""]
["SF-00273","Instalação de luminária reaproveitada","",null,"un",null,"Sinapi 97587 Adaptada",""]
[null,null,"",null,null,null,null,""]
[null,null,"SF-00273","Auxiliar de eletricista com encargos complementares","h",0.12889999999999999,"Sinapi 97587",14.048999999999999,"Sinapi 88247",null,null,{"$f":"ROUND(H1630*F1630,2)","v":1.81},{"$f":"SUM(J1630:L1633)","v":17.21}]
[null,null,"SF-00273","Eletricista com encargos complementares","h",0.30940000000000001,"Sinapi 97587",18.297000000000001,"Sinapi 88264",null,null,{"$f":"ROUND(H1631*F1631,2)","v":5.66}]
[null,null,"SF-00273","Cabo PP 3x2,5mm2 300/500 V, extraflexível (classe 5), com condutor de proteção, com isolação, enchimento e cobertura de PVC","m",1.5,"Senado Federal",5.35,"Pesquisa de Preços",null,{"$f":"ROUND(H1632*F1632,2)","v":8.0299999999999994}]
[null,null,"SF-00273","Plugue (macho) com 3 polos (2P+T), para 10A","un ",1,"Senado Federal",1.71,"Orse 04887",null,1.71]
[null,null,"",null,null,null,null,""]
["SF-00274","Luminária 2x14 W de embutir","",null,"un",null,"Sinapi 97587 Adaptada",""]
[null,null,"",null,null,null,null,""]
[null,null,"SF-00274","Luminária de embutir T5 2 x 14W, ref: Intral DE-500 (cod. 08017); Lumicenter FAA20-E214","un ",1,"Sinapi 97587",81.790000000000006,"Pesquisa de Preços",null,{"$f":"ROUND(H1637*F1637,2)","v":81.790000000000006},null,{"$f":"SUM(J1637:L1644)","v":156.58000000000001}]
[null,null,"SF-00274","Reator eletrônico 2x14W, ref: Philips EB214A26; Philips EL214-28A26; Lumicenter LEB. 214; MarGirus PB 2X14 AF2","un ",1,"Senado Federal",37.68,"Pesquisa de Preços",null,{"$f":"ROUND(H1638*F1638,2)","v":37.68}]
[null,null,"SF-00274","Lâmpada fluorescente T5 de 14W, ref: Osram HE 14W/840 SMARTLUX; Philips TL5-14W-HE/840; GE F14W/T5/840","un ",2,"Senado Federal",7.86,"Pesquisa de Preços",null,15.72]
[null,null,"SF-00274","Cabo PP 3x2,5mm2 300/500 V, extraflexível (classe 5), com condutor de proteção, com isolação, enchimento e cobertura de PVC","m",1.5,"Senado Federal",5.35,"Pesquisa de Preços",null,{"$f":"ROUND(H1640*F1640,2)","v":8.0299999999999994}]
[null,null,"SF-00274","Plugue (macho) com 3 polos (2P+T), para 10A","un ",1,"Senado Federal",1.71,"Orse 04887",null,1.71]
[null,null,"SF-00274","Plugue (fêmea) com 3 polos (2P+T), para 10A","un ",1,"Senado Federal",4.18,"Pesquisa de Preços",null,{"$f":"ROUND(H1642*F1642,2)","v":4.18}]
[null,null,"SF-00274","Auxiliar de eletricista com encargos complementares","h",0.12889999999999999,"Sinapi 97587",14.048999999999999,"Sinapi 88247",null,null,{"$f":"ROUND(H1643*F1643,2)","v":1.81}]
[null,null,"SF-00274","Eletricista com encargos complementares","h",0.30940000000000001,"Sinapi 97587",18.297000000000001,"Sinapi 88264",null,null,{"$f":"ROUND(H1644*F1644,2)","v":5.66}]
[null,null,"",null,null,null,null,""]
["SF-00275","Luminária 2x14 W de sobrepor","",null,"un",null,"Sinapi 97585 Adaptada",""]
[null,null,"",null,null,null,null,""]
[null,null,"SF-00275","Luminária de sobrepor T5 2 x 14W, ref: Intral DS-500 (cod. 08021); Lumicenter FAA20-S214","un ",1,"Sinapi 97585",120.12,"Pesquisa de Preços",null,{"$f":"ROUND(H1648*F1648,2)","v":120.12},null,{"$f":"SUM(J1648:L1655)","v":198.81000000000003}]
[null,null,"SF-00275","Reator eletrônico 2x14W, ref: Philips EB214A26; Philips EL214-28A26; Lumicenter LEB. 214; MarGirus PB 2X14 AF2","un ",1,"Senado Federal",37.68,"Pesquisa de Preços",null,{"$f":"ROUND(H1649*F1649,2)","v":37.68}]
[null,null,"SF-00275","Lâmpada fluorescente T5 de 14W, ref: Osram HE 14W/840 SMARTLUX; Philips TL5-14W-HE/840; GE F14W/T5/840","un ",2,"Senado Federal",7.86,"Pesquisa de Preços",null,{"$f":"ROUND(H1650*F1650,2)","v":15.72}]
[null,null,"SF-00275","Cabo PP 3x2,5mm2 300/500 V, extraflexível (classe 5), com condutor de proteção, com isolação, enchimento e cobertura de PVC","m",1.5,"Senado Federal",5.35,"Pesquisa de Preços",null,{"$f":"ROUND(H1651*F1651,2)","v":8.0299999999999994}]
[null,null,"SF-00275","Plugue (macho) com 3 polos (2P+T), para 10A","un ",1,"Senado Federal",1.71,"Orse 04887",null,1.71]
[null,null,"SF-00275","Plugue (fêmea) com 3 polos (2P+T), para 10A","un ",1,"Senado Federal",4.18,"Pesquisa de Preços",null,4.18]
[null,null,"SF-00275","Auxiliar de eletricista com encargos complementares","h",0.1963,"Sinapi 97585",14.048999999999999,"Sinapi 88247",null,null,{"$f":"ROUNDDOWN(H1654*F1654,2)","v":2.75}]
[null,null,"SF-00275","Eletricista com encargos complementares","h",0.47099999999999997,"Sinapi 97585",18.297000000000001,"Sinapi 88264",null,null,{"$f":"ROUND(H1655*F1655,2)","v":8.6199999999999992}]
[null,null,"",null,null,null,null,""]
["SF-00276","Luminária 2x28 W de embutir","",null,"un",null,"Sinapi 97587 Adaptada",""]
[null,null,"",null,null,null,null,""]
[null,null,"SF-00276","Luminária de embutir T5 2 x 28W, ref: Intral DE-500 (cod. 08025); Lumicenter FAA20-E228","un ",1,"Sinapi 97587",109.94,"Pesquisa de Preços",null,{"$f":"ROUND(H1659*F1659,2)","v":109.94},null,{"$f":"SUM(J1659:L1666)","v":188.63000000000002}]
[null,null,"SF-00276","Reator eletrônico 2x28W, ref: Philips EB228A26; Philips EL214-28A26; Intral REH-T5 2x28/127-220/50-60 (cod. 02475); MarGirus PB 2X28 AF2.","un ",1,"Senado Federal",41.24,"Pesquisa de Preços",null,{"$f":"ROUND(H1660*F1660,2)","v":41.24}]
[null,null,"SF-00276","Lâmpada fluorescente T5 de 28W, ref: Osram HE 28W/840 SMARTLUX; Philips TL5-28W-HE/840; GE F28W/T5/840","un ",2,"Senado Federal",8.0299999999999994,"Pesquisa de Preços",null,{"$f":"ROUND(H1661*F1661,2)","v":16.059999999999999}]
[null,null,"SF-00276","Cabo PP 3x2,5mm2 300/500 V, extraflexível (classe 5), com condutor de proteção, com isolação, enchimento e cobertura de PVC","m",1.5,"Senado Federal",5.35,"Pesquisa de Preços",null,{"$f":"ROUND(H1662*F1662,2)","v":8.0299999999999994}]
[null,null,"SF-00276","Plugue (macho) com 3 polos (2P+T), para 10A","un ",1,"Senado Federal",1.71,"Orse 04887",null,1.71]
[null,null,"SF-00276","Plugue (fêmea) com 3 polos (2P+T), para 10A","un ",1,"Senado Federal",4.18,"Pesquisa de Preços",null,4.18]
[null,null,"SF-00276","Auxiliar de eletricista com encargos complementares","h",0.12889999999999999,"Sinapi 97587",14.048999999999999,"Sinapi 88247",null,null,{"$f":"ROUND(H1665*F1665,2)","v":1.81}]
[null,null,"SF-00276","Eletricista com encargos complementares","h",0.30940000000000001,"Sinapi 97587",18.297000000000001,"Sinapi 88264",null,null,{"$f":"ROUND(H1666*F1666,2)","v":5.66}]
[null,null,"",null,null,null,null,""]
["SF-00277","Luminária 2x28 W de sobrepor","",null,"un",null,"Sinapi 97585 Adaptada",""]
[null,null,"",null,null,null,null,""]
[null,null,"SF-00277","Luminária de sobrepor T5 2 x 28W, ref: Intral DS-500 (cod. 08029); Lumicenter FAA20-S228","un ",1,"Sinapi 97585",98.86,"Pesquisa de Preços",null,{"$f":"ROUND(H1670*F1670,2)","v":98.86},null,{"$f":"SUM(J1670:L1677)","v":181.45000000000002}]
[null,null,"SF-00277","Reator eletrônico 2x28W, ref: Philips EB228A26; Philips EL214-28A26; Intral REH-T5 2x28/127-220/50-60 (cod. 02475); MarGirus PB 2X28 AF2.","un ",1,"Senado Federal",41.24,"Pesquisa de Preços",null,{"$f":"ROUND(H1671*F1671,2)","v":41.24}]
[null,null,"SF-00277","Lâmpada fluorescente T5 de 28W, ref: Osram HE 28W/840 SMARTLUX; Philips TL5-28W-HE/840; GE F28W/T5/840","un ",2,"Senado Federal",8.0299999999999994,"Pesquisa de Preços",null,{"$f":"ROUND(H1672*F1672,2)","v":16.059999999999999}]
[null,null,{"$f":"IF(AND(D1673<>\"\",A1671=\"\"),C1672,IF(D1673<>\"\",A1671,\"\"))","v":"SF-00277"},"Cabo PP 3x2,5mm2 300/500 V, extraflexível (classe 5), com condutor de proteção, com isolação, enchimento e cobertura de PVC","m",1.5,"Senado Federal",5.35,"Pesquisa de Preços",null,{"$f":"ROUND(H1673*F1673,2)","v":8.0299999999999994}]
[null,null,"SF-00277","Plugue (macho) com 3 polos (2P+T), para 10A","un ",1,"Senado Federal",1.71,"Orse 04887",null,1.71]
[null,null,"SF-00277","Plugue (fêmea) com 3 polos (2P+T), para 10A","un ",1,"Senado Federal",4.18,"Pesquisa de Preços",null,4.18]
[null,null,"SF-00277","Auxiliar de eletricista com encargos complementares","h",0.1963,"Sinapi 97587",14.048999999999999,"Sinapi 88247",null,null,{"$f":"ROUNDDOWN(H1676*F1676,2)","v":2.75}]
[null,null,"SF-00277","Eletricista com encargos complementares","h",0.47099999999999997,"Sinapi 97585",18.297000000000001,"Sinapi 88264",null,null,{"$f":"ROUND(H1677*F1677,2)","v":8.6199999999999992}]
[null,null,"",null,null,null,null,""]
["SF-00278","Condutor 10mm²","",null,"m",null,"Sinapi 92980 Adaptada",""]
[null,null,"",null,null,null,null,""]
[null,null,"SF-00278","Auxiliar de eletricista com encargos complementares","h",8.9999999999999993E-3,"Sinapi 92980",14.048999999999999,"Sinapi 88247",null,null,{"$f":"ROUND(H1681*F1681,2)","v":0.13},{"$f":"SUM(J1681:L1684)","v":8.2199999999999989}]
[null,null,"SF-00278","Eletricista com encargos complementares","h",8.9999999999999993E-3,"Sinapi 92980",18.297000000000001,"Sinapi 88264",null,null,{"$f":"ROUND(H1682*F1682,2)","v":0.16}]
[null,null,"SF-00278","Cabo flexível isolado em EPR não halogenado 10 mm² 0,6 a 1 kV","m",1.0269999999999999,"Sinapi 92980",7.6859999999999991,"Pini 16.119.000304.SER",null,{"$f":"ROUND(H1683*F1683,2)","v":7.89}]
[null,null,"SF-00278","Fita isolante adesiva antichama, uso ate 750 V, em rolo de 19 mm x 5 m","un",0.01,"Sinapi 92980",3.1680000000000001,"Sinapi 21127",null,{"$f":"ROUNDUP(H1684*F1684,2)","v":0.04}]
[null,null,"",null,null,null,null,""]
["SF-00279","Condutor 16mm²","",null,"m",null,"Sinapi 92982 Adaptada",""]
[null,null,"",null,null,null,null,""]
[null,null,"SF-00279","Auxiliar de eletricista com encargos complementares","h",1.2999999999999999E-2,"Sinapi 92982",14.048999999999999,"Sinapi 88247",null,null,{"$f":"ROUND(H1688*F1688,2)","v":0.18},{"$f":"SUM(J1688:L1691)","v":12.19}]
[null,null,"SF-00279","Eletricista com encargos complementares","h",1.2999999999999999E-2,"Sinapi 92982",18.297000000000001,"Sinapi 88264",null,null,{"$f":"ROUNDDOWN(H1689*F1689,2)","v":0.23}]
[null,null,"SF-00279","Cabo flexível isolado em EPR não halogenado 16 mm² 0,6 a 1 kV","m",1.0269999999999999,"Sinapi 92982",11.43,"Pini 16.119.000305.SER",null,{"$f":"ROUND(H1690*F1690,2)","v":11.74}]
[null,null,"SF-00279","Fita isolante adesiva antichama, uso ate 750 V, em rolo de 19 mm x 5 m","un",0.01,"Sinapi 92982",3.1680000000000001,"Sinapi 21127",null,{"$f":"ROUNDUP(H1691*F1691,2)","v":0.04}]
[null,null,"",null,null,null,null,""]
["SF-00280","Condutor 2,5 mm²","",null,"m",null,"Sinapi 91926 Adaptada",""]
[null,null,"",null,null,null,null,""]
[null,null,"SF-00280","Auxiliar de eletricista com encargos complementares","h",0.03,"Sinapi 91926",14.048999999999999,"Sinapi 88247",null,null,{"$f":"ROUND(H1695*F1695,2)","v":0.42},{"$f":"SUM(J1695:L1698)","v":2.69}]
[null,null,"SF-00280","Eletricista com encargos complementares","h",0.03,"Sinapi 91926",18.297000000000001,"Sinapi 88264",null,null,{"$f":"ROUND(H1696*F1696,2)","v":0.55000000000000004}]
[null,null,"SF-00280","Cabo de cobre isolado PVC 450/750V 2,5mm² resistente a chamas, livre de halogênios","m",1.19,"Sinapi 91926",1.42,"Pesquisa de Preços",null,{"$f":"ROUND(H1697*F1697,2)","v":1.69}]
[null,null,"SF-00280","Fita isolante adesiva antichama, uso ate 750 V, em rolo de 19 mm x 5 m","un",8.9999999999999993E-3,"Sinapi 91926",3.1680000000000001,"Sinapi 21127",null,{"$f":"ROUND(H1698*F1698,2)","v":0.03}]
[null,null,"",null,null,null,null,""]
["SF-00281","Condutor 3x2,5 mm²","",null,"m",null,"Sinapi 91930 Adaptada",""]
[null,null,"",null,null,null,null,""]
[null,null,"SF-00281","Auxiliar de eletricista com encargos complementares","h",5.1999999999999998E-2,"Sinapi 91930",14.048999999999999,"Sinapi 88247",null,null,{"$f":"ROUND(H1702*F1702,2)","v":0.73},{"$f":"SUM(J1702:L1705)","v":8.2099999999999991}]
[null,null,"SF-00281","Eletricista com encargos complementares","h",5.1999999999999998E-2,"Sinapi 91930",18.297000000000001,"Sinapi 88264",null,null,{"$f":"ROUND(H1703*F1703,2)","v":0.95}]
[null,null,"SF-00281","Cabo de cobre multipolar, classe 5, isolação em EPR, 0,6/1 kV, 3x2,5mm² resistente a chama, livre de halogênios","m",1.19,"Sinapi 91930",5.46,"Pesquisa de Preços",null,{"$f":"ROUND(H1704*F1704,2)","v":6.5}]
[null,null,"SF-00281","Fita isolante adesiva antichama, uso ate 750 V, em rolo de 19 mm x 5 m","un",8.9999999999999993E-3,"Sinapi 91930",3.1680000000000001,"Sinapi 21127",null,{"$f":"ROUND(H1705*F1705,2)","v":0.03}]
[null,null,"",null,null,null,null,""]
["SF-00282","Condutor 4 mm²","",null,"m",null,"Sinapi 91928 Adaptada",""]
[null,null,"",null,null,null,null,""]
[null,null,"SF-00282","Auxiliar de eletricista com encargos complementares","h",0.04,"Sinapi 91928",14.048999999999999,"Sinapi 88247",null,null,{"$f":"ROUND(H1709*F1709,2)","v":0.56000000000000005},{"$f":"SUM(J1709:L1712)","v":3.75}]
[null,null,"SF-00282","Eletricista com encargos complementares","h",0.04,"Sinapi 91928",18.297000000000001,"Sinapi 88264",null,null,{"$f":"ROUND(H1710*F1710,2)","v":0.73}]
[null,null,"SF-00282","Cabo de cobre isolado PVC 450/750V 4mm² resistente a chamas, livre de halogênios","m",1.19,"Sinapi 91928",2.04,"Pesquisa de Preços",null,{"$f":"ROUND(H1711*F1711,2)","v":2.4300000000000002}]
[null,null,"SF-00282","Fita isolante adesiva antichama, uso ate 750 V, em rolo de 19 mm x 5 m","un",8.9999999999999993E-3,"Sinapi 91928",3.1680000000000001,"Sinapi 21127",null,{"$f":"ROUND(H1712*F1712,2)","v":0.03}]
[null,null,"",null,null,null,null,""]
["SF-00283","Condutor 4x2,5 mm²","",null,"m",null,"Sinapi 92980 Adaptada",""]
[null,null,"",null,null,null,null,""]
[null,null,"SF-00283","Auxiliar de eletricista com encargos complementares","h",8.9999999999999993E-3,"Sinapi 92980",14.048999999999999,"Sinapi 88247",null,null,{"$f":"ROUND(H1716*F1716,2)","v":0.13},{"$f":"SUM(J1716:L1719)","v":7.2700000000000005}]
[null,null,"SF-00283","Eletricista com encargos complementares","h",8.9999999999999993E-3,"Sinapi 92980",18.297000000000001,"Sinapi 88264",null,null,{"$f":"ROUND(H1717*F1717,2)","v":0.16}]
[null,null,"SF-00283","Cabo de cobre multipolar, classe 5, isolação em EPR, 0,6/1 kV, 4x2,5mm² resistente a chama, livre de halogênios","m",1.0269999999999999,"Sinapi 92980",6.76,"Pesquisa de Preços",null,{"$f":"ROUND(H1718*F1718,2)","v":6.94}]
[null,null,"SF-00283","Fita isolante adesiva antichama, uso ate 750 V, em rolo de 19 mm x 5 m","un",0.01,"Sinapi 92980",3.1680000000000001,"Sinapi 21127",null,{"$f":"ROUNDUP(H1719*F1719,2)","v":0.04}]
[null,null,"",null,null,null,null,""]
["SF-00284","Condutor 6 mm²","",null,"m",null,"Sinapi 91930 Adaptada",""]
[null,null,"",null,null,null,null,""]
[null,null,"SF-00284","Auxiliar de eletricista com encargos complementares","h",5.1999999999999998E-2,"Sinapi 91930",14.048999999999999,"Sinapi 88247",null,null,{"$f":"ROUND(H1723*F1723,2)","v":0.73},{"$f":"SUM(J1723:L1726)","v":5.1000000000000005}]
[null,null,"SF-00284","Eletricista com encargos complementares","h",5.1999999999999998E-2,"Sinapi 91930",18.297000000000001,"Sinapi 88264",null,null,{"$f":"ROUND(H1724*F1724,2)","v":0.95}]
[null,null,"SF-00284","Cabo de cobre isolado PVC 450/750V 6mm² resistente a chamas, livre de halogênios","m",1.19,"Sinapi 91930",2.85,"Pesquisa de Preços",null,{"$f":"ROUND(H1725*F1725,2)","v":3.39}]
[null,null,"SF-00284","Fita isolante adesiva antichama, uso ate 750 V, em rolo de 19 mm x 5 m","un",8.9999999999999993E-3,"Sinapi 91930",3.1680000000000001,"Sinapi 21127",null,{"$f":"ROUND(H1726*F1726,2)","v":0.03}]
[null,null,"",null,null,null,null,""]
["SF-00285","Quadro elétrico TTA","",null,"cj",null,"Sinapi 74131/006 Adaptada",""]
[null,null,"",null,null,null,null,""]
[null,null,"SF-00285","Quadro elétrico tipo TTA completo com 30 disjuntores terminais, contemplando disjuntores, dispositovos de proteção contra surto (DPS), módulo diferencial residual (DR), borneiras, barramentos e outros itens necessários, conforme especificação","un",1,"Sinapi 74131/006",9899.67,"Pesquisa de Preços",null,{"$f":"ROUND(H1730*F1730,2)","v":9899.67},null,{"$f":"SUM(J1730:L1731)","v":9948.85}]
[null,null,"SF-00285","Auxiliar de eletricista com encargos complementares","h",3.5,"Sinapi 74131/006",14.048999999999999,"Sinapi 88247",null,null,{"$f":"ROUNDUP(H1731*F1731,2)","v":49.18}]
[null,null,"SF-00285","Eletricista com encargos complementares","h",3.5,"Sinapi 74131/006",18.297000000000001,"Sinapi 88264",null,null,{"$f":"ROUND(H1732*F1732,2)","v":64.040000000000006}]
[null,null,"",null,null,null,null,""]
["SF-00293","Instalação de fancolete reaproveitado","",null,"un",null,"Senado Federal",""]
[null,null,"",null,null,null,null,""]
[null,null,"SF-00293","Ajudante de operação em geral com encargos complementares","h",2,"Senado Federal",14.103,"Sinapi 88241",null,null,{"$f":"ROUND(H1736*F1736,2)","v":28.21},{"$f":"SUM(J1736:L1737)","v":66.150000000000006}]
[null,null,{"$f":"IF(AND(D1737<>\"\",A1735=\"\"),C1736,IF(D1737<>\"\",A1735,\"\"))","v":"SF-00293"},"Montador eletromecânico com encargos complementares","h",2,"Senado Federal",18.971999999999998,"Sinapi 88279",null,null,{"$f":"ROUND(H1737*F1737,2)","v":37.94}]
[null,null,"",null,null,null,null,""]
["SF-00294","Instalação de split reaproveitado","",null,"un",null,"Senado Federal",""]
[null,null,"",null,null,null,null,""]
[null,null,"SF-00294","Ajudante de operação em geral com encargos complementares","h",3,"Senado Federal",14.103,"Sinapi 88241",null,null,{"$f":"ROUND(H1741*F1741,2)","v":42.31},{"$f":"SUM(J1741:L1742)","v":99.23}]
[null,null,"SF-00294","Montador eletromecânico com encargos complementares","h",3,"Senado Federal",18.971999999999998,"Sinapi 88279",null,null,{"$f":"ROUND(H1742*F1742,2)","v":56.92}]
[null,null,"",null,null,null,null,""]
["SF-00295","Exaustor axial 340 m3/h","",null,"un",null,"Orse 11148 Adaptada",""]
[null,null,"",null,null,null,null,""]
[null,null,"SF-00295","Eletricista com encargos complementares","h",1,"Orse 11148",18.297000000000001,"Sinapi 88264",null,null,{"$f":"ROUND(H1746*F1746,2)","v":18.3},{"$f":"SUM(J1746:L1748)","v":191.35}]
[null,null,"SF-00295","Auxiliar de eletricista com encargos complementares","h",1,"Orse 11148",14.048999999999999,"Sinapi 88247",null,null,{"$f":"ROUND(H1747*F1747,2)","v":14.05}]
[null,null,"SF-00295","Exaustor axial, 1F/220V/60Hz,  vazão máxima 340 m3/h, pressão estática máxima 104 Pa. Referência Comercial: Multivac Muro150B 220V","un ",1,"Orse 11148",159,"Pesquisa de Preços",null,{"$f":"ROUND(H1748*F1748,2)","v":159}]
[null,null,"",null,null,null,null,""]
["SF-00296","Exaustor axial 865 m3/h","",null,"un",null,"Orse 11148 Adaptada",""]
[null,null,"",null,null,null,null,""]
[null,null,"SF-00296","Eletricista com encargos complementares","h",1,"Orse 11148",18.297000000000001,"Sinapi 88264",null,null,{"$f":"ROUND(H1752*F1752,2)","v":18.3},{"$f":"SUM(J1752:L1754)","v":815.94}]
[null,null,"SF-00296","Auxiliar de eletricista com encargos complementares","h",1,"Orse 11148",14.048999999999999,"Sinapi 88247",null,null,{"$f":"ROUND(H1753*F1753,2)","v":14.05}]
[null,null,"SF-00296","Exaustor axial, 1F/220V/60Hz,  vazão máxima 865 m3/h, pressão estática máxima 582 Pa . Referência Comercial: Multivac AXC 200B","un ",1,"Orse 11148",783.59,"Pesquisa de Preços",null,{"$f":"ROUND(H1754*F1754,2)","v":783.59}]
[null,null,"",null,null,null,null,""]
["SF-00297","Duto chapa galvanizada #22","",null,"m2",null,"Pini 19.104.000012.SER Adaptada",""]
[null,null,"",null,null,null,null,""]
[null,null,"SF-00297","Chapa de aco galvanizada bitola GSG 22, E = 0,80 mm (6,40 kg/m2)","kg",6.6559999999999997,"Pini 19.104.000012.SER",6.0570000000000004,"Sinapi 11049",null,{"$f":"ROUNDDOWN(H1758*F1758,2)","v":40.31},null,{"$f":"SUM(J1758:L1761)","v":166.32}]
[null,null,"SF-00297","Suportes e acessórios de fixação de dutos em chapa de aço #22","cj",1,"Pini 19.104.000012.SER",2.5920000000000001,"Pini 19.104.000012.SER",null,{"$f":"ROUND(H1759*F1759,2)","v":2.59}]
[null,null,"SF-00297","Servente com Encargos Complementares","h",3.84,"Pini 19.104.000012.SER",13.167000000000002,"Sinapi 88316",null,null,{"$f":"ROUND(H1760*F1760,2)","v":50.56}]
[null,null,"SF-00297","Montador eletromecânico com encargos complementares","h",3.84,"Pini 19.104.000012.SER",18.971999999999998,"Sinapi 88279",null,null,{"$f":"ROUNDUP(H1761*F1761,2)","v":72.86}]
[null,null,"",null,null,null,null,""]
["SF-00298","Duto flexível 6”","",null,"m",null,"Pini 19.104.000080.SER Adaptada",""]
[null,null,"",null,null,null,null,""]
[null,null,"SF-00298","Servente com Encargos Complementares","h",0.4,"Pini 19.104.000080.SER",13.167000000000002,"Sinapi 88316",null,null,{"$f":"ROUND(H1765*F1765,2)","v":5.27},{"$f":"SUM(J1765:L1767)","v":28.61}]
[null,null,"SF-00298","Montador eletromecânico com encargos complementares","h",0.4,"Pini 19.104.000080.SER",18.971999999999998,"Sinapi 88279",null,null,{"$f":"ROUND(H1766*F1766,2)","v":7.59}]
[null,null,"SF-00298","Duto flexível com isolamento térmico e barreira de vapor, diâmetro 6”, 6 m de comprimento. Referência Comercial: Multivac Isodec RT 0.6","m",1.05,"Pini 19.104.000080.SER",15,"Pesquisa de Preços",null,{"$f":"ROUND(H1767*F1767,2)","v":15.75}]
[null,null,"",null,null,null,null,""]
["SF-00299","Duto flexível 8”","",null,"m",null,"Pini 19.104.000080.SER Adaptada",""]
[null,null,"",null,null,null,null,""]
[null,null,"SF-00299","Servente com Encargos Complementares","h",0.4,"Pini 19.104.000080.SER",13.167000000000002,"Sinapi 88316",null,null,{"$f":"ROUND(H1771*F1771,2)","v":5.27},{"$f":"SUM(J1771:L1773)","v":30.41}]
[null,null,"SF-00299","Montador eletromecânico com encargos complementares","h",0.4,"Pini 19.104.000080.SER",18.971999999999998,"Sinapi 88279",null,null,{"$f":"ROUND(H1772*F1772,2)","v":7.59}]
[null,null,"SF-00299","Duto flexível com isolamento térmico e barreira de vapor, diâmetro 8”, 6 m de comprimento. Referência: Multivac Isodec RT 0.6","m",1.05,"Pini 19.104.000080.SER",16.71,"Pesquisa de Preços",null,{"$f":"ROUND(H1773*F1773,2)","v":17.55}]
[null,null,"",null,null,null,null,""]
["SF-00300","Difusor de ar quadrado 360x360 mm","",null,"un",null,"Pini 19.104.000200.SER Adaptada",""]
[null,null,"",null,null,null,null,""]
[null,null,"SF-00300","Ajudante de operação em geral com encargos complementares","h",2.5,"Pini 19.104.000200.SER",14.103,"Sinapi 88241",null,null,{"$f":"ROUND(H1777*F1777,2)","v":35.26},{"$f":"SUM(J1777:L1779)","v":201.03}]
[null,null,"SF-00300","Montador eletromecânico com encargos complementares","h",2.5,"Pini 19.104.000200.SER",18.971999999999998,"Sinapi 88279",null,null,{"$f":"ROUND(H1778*F1778,2)","v":47.43}]
[null,null,"SF-00300","Difusor de ar quadrado, 360x360 mm, Referência Comercial: Trox ADLQ-AG Nº4","un ",1,"Pini 19.104.000200.SER",118.34,"Pesquisa de Preços",null,{"$f":"ROUND(H1779*F1779,2)","v":118.34}]
[null,null,"",null,null,null,null,""]
["SF-00301","Difusor de ar quadrado com caixa plenum AK6 360x360 mm","",null,"un",null,"Pini 19.104.000200.SER Adaptada",""]
[null,null,"",null,null,null,null,""]
[null,null,"SF-00301","Ajudante de operação em geral com encargos complementares","h",2.5,"Pini 19.104.000200.SER",14.103,"Sinapi 88241",null,null,{"$f":"ROUND(H1783*F1783,2)","v":35.26},{"$f":"SUM(J1783:L1785)","v":253.14}]
[null,null,"SF-00301","Montador eletromecânico com encargos complementares","h",2.5,"Pini 19.104.000200.SER",18.971999999999998,"Sinapi 88279",null,null,{"$f":"ROUND(H1784*F1784,2)","v":47.43}]
[null,null,"SF-00301","Difusor de ar quadrado com caixa pleno AK6 360x360 mm. Ref.: Trox ADLK-AG Nº4","un ",1,"Pini 19.104.000200.SER",170.45,"Pesquisa de Preços",null,{"$f":"ROUND(H1785*F1785,2)","v":170.45}]
[null,null,"",null,null,null,null,""]
["SF-00302","Difusor de ar quadrado para insuflamento em duas direções perpendiculares 376x376 mm","",null,"un",null,"Pini 19.104.000200.SER Adaptada",""]
[null,null,"",null,null,null,null,""]
[null,null,"SF-00302","Ajudante de operação em geral com encargos complementares","h",2.5,"Pini 19.104.000200.SER",14.103,"Sinapi 88241",null,null,{"$f":"ROUND(H1789*F1789,2)","v":35.26},{"$f":"SUM(J1789:L1791)","v":182.54}]
[null,null,"SF-00302","Montador eletromecânico com encargos complementares","h",2.5,"Pini 19.104.000200.SER",18.971999999999998,"Sinapi 88279",null,null,{"$f":"ROUND(H1790*F1790,2)","v":47.43}]
[null,null,"SF-00302","Difusor de ar quadrado para insuflamento em duas direções perpendiculares 376x376 mm, Referência Comercial: Trox  ADQ-2C-AG","un ",1,"Pini 19.104.000200.SER",99.85,"Pesquisa de Preços",null,{"$f":"ROUND(H1791*F1791,2)","v":99.85}]
[null,null,"",null,null,null,null,""]
["SF-00303","Difusor de ar retangular para insuflamento em duas direções 371x208 mm","",null,"un",null,"Pini 19.104.000200.SER Adaptada",""]
[null,null,"",null,null,null,null,""]
[null,null,"SF-00303","Ajudante de operação em geral com encargos complementares","h",2.5,"Pini 19.104.000200.SER",14.103,"Sinapi 88241",null,null,{"$f":"ROUND(H1795*F1795,2)","v":35.26},{"$f":"SUM(J1795:L1797)","v":142.5}]
[null,null,"SF-00303","Montador eletromecânico com encargos complementares","h",2.5,"Pini 19.104.000200.SER",18.971999999999998,"Sinapi 88279",null,null,{"$f":"ROUND(H1796*F1796,2)","v":47.43}]
[null,null,"SF-00303","Difusor de ar retangular para insuflamento em duas direções (fluxo na direção perpendicular às maiores arestas do retângulo), 371x208 mm. Ref.: Trox ADQ-2","un ",1,"Pini 19.104.000200.SER",59.81,"Pesquisa de Preços",null,{"$f":"ROUND(H1797*F1797,2)","v":59.81}]
[null,null,"",null,null,null,null,""]
["SF-00304","Difusor de ar retangular para insuflamento em três direções 264x432 mm","",null,"un",null,"Pini 19.104.000200.SER Adaptada",""]
[null,null,"",null,null,null,null,""]
[null,null,{"$f":"IF(AND(D1801<>\"\",A1799=\"\"),C1800,IF(D1801<>\"\",A1799,\"\"))","v":"SF-00304"},"Ajudante de operação em geral com encargos complementares","h",2.5,"Pini 19.104.000200.SER",14.103,"Sinapi 88241",null,null,{"$f":"ROUND(H1801*F1801,2)","v":35.26},{"$f":"SUM(J1801:L1803)","v":184.13}]
[null,null,"SF-00304","Montador eletromecânico com encargos complementares","h",2.5,"Pini 19.104.000200.SER",18.971999999999998,"Sinapi 88279",null,null,{"$f":"ROUND(H1802*F1802,2)","v":47.43}]
[null,null,"SF-00304","Difusor de ar retangular para insuflamento em três direções (um fluxo na direção perpendicular às maiores arestas do retângulo e dois fluxos na direção perpendicular às menores arestas), 264x432 mm, Referência Comercial: Trox  ADQ-32-AG","un ",1,"Pini 19.104.000200.SER",101.44,"Pesquisa de Preços",null,{"$f":"ROUND(H1803*F1803,2)","v":101.44}]
[null,null,"",null,null,null,null,""]
["SF-00305","Difusor de ar retangular para insuflamento em três direções 320x562 mm","",null,"un",null,"Pini 19.104.000200.SER Adaptada",""]
[null,null,"",null,null,null,null,""]
[null,null,"SF-00305","Ajudante de operação em geral com encargos complementares","h",2.5,"Pini 19.104.000200.SER",14.103,"Sinapi 88241",null,null,{"$f":"ROUND(H1807*F1807,2)","v":35.26},{"$f":"SUM(J1807:L1809)","v":218.96}]
[null,null,"SF-00305","Montador eletromecânico com encargos complementares","h",2.5,"Pini 19.104.000200.SER",18.971999999999998,"Sinapi 88279",null,null,{"$f":"ROUND(H1808*F1808,2)","v":47.43}]
[null,null,"SF-00305","Difusor de ar retangular para insuflamento em três direções 320x562 mm. Ref.: Trox ADQ-32-AG","un ",1,"Pini 19.104.000200.SER",136.27000000000001,"Pesquisa de Preços",null,{"$f":"ROUND(H1809*F1809,2)","v":136.27000000000001}]
[null,null,"",null,null,null,null,""]
["SF-00306","Difusor de ar retangular para insuflamento em três direções 371x208 mm","",null,"un",null,"Pini 19.104.000200.SER Adaptada",""]
[null,null,"",null,null,null,null,""]
[null,null,"SF-00306","Ajudante de operação em geral com encargos complementares","h",2.5,"Pini 19.104.000200.SER",14.103,"Sinapi 88241",null,null,{"$f":"ROUND(H1813*F1813,2)","v":35.26},{"$f":"SUM(J1813:L1815)","v":157.43}]
[null,null,"SF-00306","Montador eletromecânico com encargos complementares","h",2.5,"Pini 19.104.000200.SER",18.971999999999998,"Sinapi 88279",null,null,{"$f":"ROUND(H1814*F1814,2)","v":47.43}]
[null,null,"SF-00306","Difusor de ar retangular para insuflamento em três direções (dois fluxos na direção perpendicular às maiores arestas do retângulo e um fluxo na direção perpendicular às menores arestas), 371x208 mm. Ref.: Trox ADQ-3","un ",1,"Pini 19.104.000200.SER",74.739999999999995,"Pesquisa de Preços",null,{"$f":"ROUND(H1815*F1815,2)","v":74.739999999999995}]
[null,null,"",null,null,null,null,""]
["SF-00307","Difusor de ar retangular para insuflamento em uma direção 371x208 mm","",null,"un",null,"Pini 19.104.000200.SER Adaptada",""]
[null,null,"",null,null,null,null,""]
[null,null,"SF-00307","Ajudante de operação em geral com encargos complementares","h",2.5,"Pini 19.104.000200.SER",14.103,"Sinapi 88241",null,null,{"$f":"ROUND(H1819*F1819,2)","v":35.26},{"$f":"SUM(J1819:L1821)","v":140.69}]
[null,null,"SF-00307","Montador eletromecânico com encargos complementares","h",2.5,"Pini 19.104.000200.SER",18.971999999999998,"Sinapi 88279",null,null,{"$f":"ROUND(H1820*F1820,2)","v":47.43}]
[null,null,"SF-00307","Difusor de ar retangular para insuflamento em uma direção (fluxo na direção perpendicular às maiores arestas do retângulo), 371x208 mm. Ref.: Trox ADQ-1","un ",1,"Pini 19.104.000200.SER",58,"Pesquisa de Preços",null,{"$f":"ROUND(H1821*F1821,2)","v":58}]
[null,null,"",null,null,null,null,""]
["SF-00308","Grelha para retorno retangular 425x225 mm","",null,"un",null,"Pini 19.104.000906.SER Adaptada",""]
[null,null,"",null,null,null,null,""]
[null,null,"SF-00308","Ajudante de operação em geral com encargos complementares","h",3.5,"Pini 19.104.000906.SER",14.103,"Sinapi 88241",null,null,{"$f":"ROUNDUP(H1825*F1825,2)","v":49.37},{"$f":"SUM(J1825:L1827)","v":183.70000000000002}]
[null,null,"SF-00308","Montador eletromecânico com encargos complementares","h",3.5,"Pini 19.104.000906.SER",18.971999999999998,"Sinapi 88279",null,null,{"$f":"ROUND(H1826*F1826,2)","v":66.400000000000006}]
[null,null,"SF-00308","Grelha para retorno de ar com lâminas fixas e registro, 40 x 20 cm","un ",1,"Pini 19.104.000906.SER",67.932000000000002,"Pini 19.104.000905.SER",null,{"$f":"ROUND(H1827*F1827,2)","v":67.930000000000007}]
[null,null,"",null,null,null,null,""]
["SF-00309","Grelha para retorno retangular 525x325 mm","",null,"un",null,"Pini 19.104.000906.SER Adaptada",""]
[null,null,"",null,null,null,null,""]
[null,null,"SF-00309","Ajudante de operação em geral com encargos complementares","h",3.5,"Pini 19.104.000906.SER",14.103,"Sinapi 88241",null,null,{"$f":"ROUNDUP(H1831*F1831,2)","v":49.37},{"$f":"SUM(J1831:L1833)","v":216.12}]
[null,null,"SF-00309","Montador eletromecânico com encargos complementares","h",3.5,"Pini 19.104.000906.SER",18.971999999999998,"Sinapi 88279",null,null,{"$f":"ROUND(H1832*F1832,2)","v":66.400000000000006}]
[null,null,"SF-00309","Grelha para retorno de ar com lâminas fixas e registro, 50 x 30 cm","un ",1,"Pini 19.104.000906.SER",100.35000000000001,"Pini 19.104.000907.SER",null,{"$f":"ROUND(H1833*F1833,2)","v":100.35}]
[null,null,"",null,null,null,null,""]
["SF-00310","Instalação de difusores, grelhas e acessórios de climatização reaproveitados","",null,"un",null,"Senado Federal",""]
[null,null,"",null,null,null,null,""]
[null,null,"SF-00310","Ajudante de operação em geral com encargos complementares","h",0.5,"Senado Federal",14.103,"Sinapi 88241",null,null,{"$f":"ROUNDUP(H1837*F1837,2)","v":7.06},{"$f":"SUM(J1837:L1838)","v":11.8}]
[null,null,"SF-00310","Montador eletromecânico com encargos complementares","h",0.25,"Senado Federal",18.971999999999998,"Sinapi 88279",null,null,{"$f":"ROUND(H1838*F1838,2)","v":4.74}]
[null,null,"",null,null,null,null,""]
["SF-00311","Instalação de exaustor reaproveitado","",null,"un",null,"Orse 11148 Adaptada",""]
[null,null,"",null,null,null,null,""]
[null,null,"SF-00311","Eletricista com encargos complementares","h",1,"Orse 11148",18.297000000000001,"Sinapi 88264",null,null,{"$f":"ROUND(H1842*F1842,2)","v":18.3},{"$f":"SUM(J1842:L1843)","v":46.400000000000006}]
[null,null,"SF-00311","Auxiliar de eletricista com encargos complementares","h",2,"Orse 11148",14.048999999999999,"Sinapi 88247",null,null,{"$f":"ROUND(H1843*F1843,2)","v":28.1}]
[null,null,"",null,null,null,null,""]
["SF-00312","Preparação para instalação de difusores/grelhas de ar em portas","",null,"un",null,"Senado Federal",""]
[null,null,"",null,null,null,null,""]
[null,null,"SF-00312","Marceneiro com encargos complementares","h",0.5,"Senado Federal",18.333000000000002,"Sinapi 88273",null,null,{"$f":"ROUND(H1847*F1847,2)","v":9.17},{"$f":"SUM(J1847:L1848)","v":16.7}]
[null,null,"SF-00312","Ajudante de carpinteiro com encargos complementares","h",0.5,"Senado Federal",15.065999999999999,"Sinapi 88239",null,null,7.53]
[null,null,"",null,null,null,null,""]
["SF-00313","Bomba para condensado de ar-condicionado para instalação oculta","",null,"un",null,"CPOS 43.20.140 Adaptada",""]
[null,null,"",null,null,null,null,""]
[null,null,"SF-00313","Auxiliar de eletricista com encargos complementares","h",1,"CPOS 43.20.140",14.048999999999999,"Sinapi 88247",null,null,{"$f":"ROUND(H1852*F1852,2)","v":14.05},{"$f":"SUM(J1852:L1854)","v":508.35}]
[null,null,"SF-00313","Eletricista com encargos complementares","h",1,"CPOS 43.20.140",18.297000000000001,"Sinapi 88264",null,null,{"$f":"ROUND(H1853*F1853,2)","v":18.3}]
[null,null,"SF-00313","Bomba para condensado de ar-condicionado para instalação oculta, 1F/220V/60Hz, vazão 14 l/h (a 0 mmca). Ref.: Elgin Mini Orange","un",1,"CPOS 43.20.140",476,"Pesquisa de Preços",null,{"$f":"ROUND(H1854*F1854,2)","v":476}]
[null,null,"",null,null,null,null,""]
["SF-00317","Suporte para unidade condensadora de aparelho split",{"$f":"IF(AND(D1856<>\"\",#REF!=\"\"),#REF!,IF(D1856<>\"\",#REF!,\"\"))","v":{"$error":"#REF!"}},null,"un",null,"SBC 112411 Adaptada",""]
[null,null,{"$f":"IF(AND(D1857<>\"\",#REF!=\"\"),C1856,IF(D1857<>\"\",#REF!,\"\"))","v":{"$error":"#REF!"}},null,null,null,null,""]
[null,null,{"$f":"IF(AND(D1858<>\"\",A1856=\"\"),C1857,IF(D1858<>\"\",A1856,\"\"))","v":"SF-00317"},"Serralheiro com encargos complementares","h",0.85099999999999998,"SBC 112411",18.009,"Sinapi 88315",null,null,{"$f":"ROUND(H1858*F1858,2)","v":15.33},{"$f":"SUM(J1858:L1860)","v":60.52}]
[null,null,"SF-00317","Auxiliar de serralheiro com encargos complementares","h",0.85099999999999998,"SBC 112411",14.472,"Sinapi 88251",null,null,{"$f":"ROUNDDOWN(H1859*F1859,2)","v":12.31}]
[null,null,"SF-00317","Suporte para unidade condensadora de aparelho split ou fancolete","un ",1,"Senado Federal",32.880000000000003,"Pesquisa de Preços",null,{"$f":"ROUND(H1860*F1860,2)","v":32.880000000000003}]
[null,null,"",null,null,null,null,""]
["SF-00318","Suporte para unidade evaporadora de aparelho split ou fancolete","",null,"un",null,"SBC 112411 Adaptada",""]
[null,null,"",null,null,null,null,""]
[null,null,"SF-00318","Serralheiro com encargos complementares","h",0.85099999999999998,"SBC 112411",18.009,"Sinapi 88315",null,null,{"$f":"ROUND(H1864*F1864,2)","v":15.33},{"$f":"SUM(J1864:L1866)","v":72.37}]
[null,null,"SF-00318","Auxiliar de serralheiro com encargos complementares","h",0.85099999999999998,"SBC 112411",14.472,"Sinapi 88251",null,null,{"$f":"ROUNDDOWN(H1865*F1865,2)","v":12.31}]
[null,null,"SF-00318","Suporte para unidade evaporadora de aparelho split ou fancolete","un ",1,"Senado Federal",44.73,"Pesquisa de Preços",null,{"$f":"ROUND(H1866*F1866,2)","v":44.73}]
[null,null,"",null,null,null,null,""]
["SF-00319","Filtro em Y 1\"","",null,"un",null,"Sinapi 95250 Adaptada",""]
[null,null,"",null,null,null,null,""]
[null,null,"SF-00319","Auxiliar de encanador ou bombeiro hidráulico com encargos complementares","h",0.77449999999999997,"Sinapi 95250",13.977,"Sinapi 88248",null,null,{"$f":"ROUND(H1870*F1870,2)","v":10.83},{"$f":"SUM(J1870:L1873)","v":106.81}]
[null,null,"SF-00319","Encanador ou Bombeiro Hidráulico com Encargos Complementares","h",0.77449999999999997,"Sinapi 95250",18.081,"Sinapi 88267",null,null,{"$f":"ROUND(H1871*F1871,2)","v":14}]
[null,null,"SF-00319","Filtro em Y 1\" (DN 25 mm), fabricado em bronze, extremidade com roscas, filtro em aço inoxidável, classe de pressão PN20 ou superior. Ref.: Deca 000.085.100.03","un ",1,"Sinapi 95249",81.900000000000006,"Pesquisa de Preços",null,{"$f":"ROUND(H1872*F1872,2)","v":81.900000000000006}]
[null,null,"SF-00319","Fita veda rosca em rolos de 18 mm x 50 m (L x C)","un ",9.4999999999999998E-3,"Sinapi 95250",8.1630000000000003,"Sinapi 3148",null,{"$f":"ROUND(H1873*F1873,2)","v":0.08}]
[null,null,"",null,null,null,null,""]
["SF-00320","Filtro em Y 3/4\"","",null,"un",null,"Sinapi 95249 Adaptada",""]
[null,null,"",null,null,null,null,""]
[null,null,"SF-00320","Auxiliar de encanador ou bombeiro hidráulico com encargos complementares","h",0.77449999999999997,"Sinapi 95249",13.977,"Sinapi 88248",null,null,{"$f":"ROUND(H1877*F1877,2)","v":10.83},{"$f":"SUM(J1877:L1880)","v":90.81}]
[null,null,"SF-00320","Encanador ou Bombeiro Hidráulico com Encargos Complementares","h",0.77449999999999997,"Sinapi 95249",18.081,"Sinapi 88267",null,null,{"$f":"ROUND(H1878*F1878,2)","v":14}]
[null,null,"SF-00320","Filtro em Y 3/4\" (DN 20 mm), fabricado em bronze, extremidade com roscas, filtro em aço inoxidável, classe de pressão PN20 ou superior. Ref.: Deca 000.085.034.03","un ",1,"Sinapi 95249",65.900000000000006,"Pesquisa de Preços",null,{"$f":"ROUND(H1879*F1879,2)","v":65.900000000000006}]
[null,null,"SF-00320","Fita veda rosca em rolos de 18 mm x 50 m (L x C)","un ",9.4999999999999998E-3,"Sinapi 95249",8.1630000000000003,"Sinapi 3148",null,{"$f":"ROUND(H1880*F1880,2)","v":0.08}]
[null,null,"",null,null,null,null,""]
["SF-00321","Válvula de balanceamento e controle independente da pressão (PIBCV) 2 vias 1\"","",null,"un",null,"Sinapi 95250 Adaptada",""]
[null,null,"",null,null,null,null,""]
[null,null,"SF-00321","Auxiliar de encanador ou bombeiro hidráulico com encargos complementares","h",0.77449999999999997,"Sinapi 95250",13.977,"Sinapi 88248",null,null,{"$f":"ROUND(H1884*F1884,2)","v":10.83},{"$f":"SUM(J1884:L1888)","v":539.61}]
[null,null,"SF-00321","Encanador ou Bombeiro Hidráulico com Encargos Complementares","h",0.77449999999999997,"Sinapi 95250",18.081,"Sinapi 88267",null,null,{"$f":"ROUND(H1885*F1885,2)","v":14}]
[null,null,"SF-00321","Fita veda rosca em rolos de 18 mm x 50 m (L x C)","un ",9.4999999999999998E-3,"Sinapi 95250",8.1630000000000003,"Sinapi 3148",null,{"$f":"ROUND(H1886*F1886,2)","v":0.08}]
[null,null,"SF-00321","Atuador tipo liga/desliga (ON/OFF), com tensão compatível com o restante do sistema (24 V ou 220 V) e mecanicamente compatível com a válvula fornecida. Referência comercial: IMI Hydronic Engineering EMO-T","un ",1,"Senado Federal",128.75,"Pesquisa de Preços",null,{"$f":"ROUND(H1887*F1887,2)","v":128.75}]
[null,null,"SF-00321","Válvula de balanceamento e controle (PIBCV) 2 vias, para controle on-off, diâmetro nominal 1\" (25 mm). Ref.: IMI Hydronic Engineering TA-COMPACT-P DN 25, Honeywell VRN2C","un ",1,"Sinapi 95250",385.95,"Pesquisa de Preços",null,{"$f":"ROUND(H1888*F1888,2)","v":385.95}]
[null,null,"",null,null,null,null,""]
["SF-00322","Válvula de balanceamento e controle independente da pressão (PIBCV) 2 vias 3/4\" ","",null,"un",null,"Sinapi 95249 Adaptada",""]
[null,null,"",null,null,null,null,""]
[null,null,"SF-00322","Auxiliar de encanador ou bombeiro hidráulico com encargos complementares","h",0.77449999999999997,"Sinapi 95249",13.977,"Sinapi 88248",null,null,{"$f":"ROUND(H1892*F1892,2)","v":10.83},{"$f":"SUM(J1892:L1896)","v":519.75}]
[null,null,"SF-00322","Encanador ou Bombeiro Hidráulico com Encargos Complementares","h",0.77449999999999997,"Sinapi 95249",18.081,"Sinapi 88267",null,null,{"$f":"ROUND(H1893*F1893,2)","v":14}]
[null,null,"SF-00322","Fita veda rosca em rolos de 18 mm x 50 m (L x C)","un ",9.4999999999999998E-3,"Sinapi 95249",8.1630000000000003,"Sinapi 3148",null,{"$f":"ROUND(H1894*F1894,2)","v":0.08}]
[null,null,"SF-00322","Atuador tipo liga/desliga (ON/OFF), com tensão compatível com o restante do sistema (24 V ou 220 V) e mecanicamente compatível com a válvula fornecida. Referência comercial: IMI Hydronic Engineering EMO-T","un ",1,"Senado Federal",128.75,"Pesquisa de Preços",null,{"$f":"ROUND(H1895*F1895,2)","v":128.75}]
[null,null,"SF-00322","Válvula de balanceamento e controle (PIBCV) 2 vias, para controle on-off, diâmetro nominal 3/4\" (20 mm). Ref.: IMI Hydronic Engineering TA-COMPACT-P DN 20, Honeywell VRN2B","un ",1,"Sinapi 95249",366.09,"Pesquisa de Preços",null,{"$f":"ROUND(H1896*F1896,2)","v":366.09}]
[null,null,"",null,null,null,null,""]
["SF-00323","Válvula de esfera em bronze 1 1/2\"","",null,"un",null,"Sinapi 95252",""]
[null,null,"",null,null,null,null,""]
[null,null,"SF-00323","Fita veda rosca em rolos de 18 mm x 50 m (L x C)","un ",1.9E-2,"Sinapi 95252",8.1630000000000003,"Sinapi 3148",null,{"$f":"ROUNDDOWN(H1900*F1900,2)","v":0.15},null,{"$f":"SUM(J1900:L1903)","v":84.07}]
[null,null,"SF-00323","Valvula de esfera bruta em bronze, bitola 1  1/2\" (ref 1552-B)","un",1,"Sinapi 95252",58.616999999999997,"Sinapi 11751",null,{"$f":"ROUND(H1901*F1901,2)","v":58.62}]
[null,null,"SF-00323","Auxiliar de encanador ou bombeiro hidráulico com encargos complementares","h",0.78900000000000003,"Sinapi 95252",13.977,"Sinapi 88248",null,null,{"$f":"ROUND(H1902*F1902,2)","v":11.03}]
[null,null,"SF-00323","Encanador ou Bombeiro Hidráulico com Encargos Complementares","h",0.78900000000000003,"Sinapi 95252",18.081,"Sinapi 88267",null,null,{"$f":"ROUND(H1903*F1903,2)","v":14.27}]
[null,null,"",null,null,null,null,""]
["SF-00324","Válvula de esfera em bronze 1 1/4\"","",null,"un",null,"Sinapi 95251",""]
[null,null,"",null,null,null,null,""]
[null,null,"SF-00324","Fita veda rosca em rolos de 18 mm x 50 m (L x C)","un ",1.9E-2,"Sinapi 95251",8.1630000000000003,"Sinapi 3148",null,{"$f":"ROUNDDOWN(H1907*F1907,2)","v":0.15},null,{"$f":"SUM(J1907:L1910)","v":74.099999999999994}]
[null,null,"SF-00324","Valvula de esfera bruta em bronze, bitola 1  1/4\" (ref 1552-B)","un",1,"Sinapi 95251",48.644999999999996,"Sinapi 11750",null,{"$f":"ROUND(H1908*F1908,2)","v":48.65}]
[null,null,"SF-00324","Auxiliar de encanador ou bombeiro hidráulico com encargos complementares","h",0.78900000000000003,"Sinapi 95251",13.977,"Sinapi 88248",null,null,{"$f":"ROUND(H1909*F1909,2)","v":11.03}]
[null,null,"SF-00324","Encanador ou Bombeiro Hidráulico com Encargos Complementares","h",0.78900000000000003,"Sinapi 95251",18.081,"Sinapi 88267",null,null,{"$f":"ROUND(H1910*F1910,2)","v":14.27}]
[null,null,"",null,null,null,null,""]
["SF-00325","Válvula de esfera em bronze 1\"","",null,"un",null,"Sinapi 95250",""]
[null,null,"",null,null,null,null,""]
[null,null,{"$f":"IF(AND(D1914<>\"\",A1912=\"\"),C1913,IF(D1914<>\"\",A1912,\"\"))","v":"SF-00325"},"Fita veda rosca em rolos de 18 mm x 50 m (L x C)","un ",9.4999999999999998E-3,"Sinapi 95250",8.1630000000000003,"Sinapi 3148",null,{"$f":"ROUND(H1914*F1914,2)","v":0.08},null,{"$f":"SUM(J1914:L1917)","v":57.54}]
[null,null,"SF-00325","Valvula de esfera bruta em bronze, bitola 1 \" (ref 1552-B)","un",1,"Sinapi 95250",32.634,"Sinapi 11746",null,{"$f":"ROUND(H1915*F1915,2)","v":32.630000000000003}]
[null,null,"SF-00325","Auxiliar de encanador ou bombeiro hidráulico com encargos complementares","h",0.77449999999999997,"Sinapi 95250",13.977,"Sinapi 88248",null,null,{"$f":"ROUND(H1916*F1916,2)","v":10.83}]
[null,null,"SF-00325","Encanador ou Bombeiro Hidráulico com Encargos Complementares","h",0.77449999999999997,"Sinapi 95250",18.081,"Sinapi 88267",null,null,{"$f":"ROUND(H1917*F1917,2)","v":14}]
[null,null,"",null,null,null,null,""]
["SF-00326","Válvula de esfera em bronze 3/4\" ","",null,"un",null,"Sinapi 95249",""]
[null,null,"",null,null,null,null,""]
[null,null,"SF-00326","Fita veda rosca em rolos de 18 mm x 50 m (L x C)","un ",9.4999999999999998E-3,"Sinapi 95249",8.1630000000000003,"Sinapi 3148",null,{"$f":"ROUND(H1921*F1921,2)","v":0.08},null,{"$f":"SUM(J1921:L1924)","v":49.08}]
[null,null,"SF-00326","Valvula de esfera bruta em bronze, bitola 3/4 \" (ref 1552-B)","un",1,"Sinapi 95249",24.173999999999999,"Sinapi 11749",null,{"$f":"ROUND(H1922*F1922,2)","v":24.17}]
[null,null,"SF-00326","Auxiliar de encanador ou bombeiro hidráulico com encargos complementares","h",0.77449999999999997,"Sinapi 95249",13.977,"Sinapi 88248",null,null,{"$f":"ROUND(H1923*F1923,2)","v":10.83}]
[null,null,"SF-00326","Encanador ou Bombeiro Hidráulico com Encargos Complementares","h",0.77449999999999997,"Sinapi 95249",18.081,"Sinapi 88267",null,null,{"$f":"ROUND(H1924*F1924,2)","v":14}]
[null,null,"",null,null,null,null,""]
["SF-00327","Isolamento elastomérico em formato de prancha autoadesiva","",null,"m2",null,"Senado Federal",""]
[null,null,"",null,null,null,null,""]
[null,null,"SF-00327","Auxiliar de encanador ou bombeiro hidráulico com encargos complementares","h",0.1,"Senado Federal",13.977,"Sinapi 88248",null,null,{"$f":"ROUND(H1928*F1928,2)","v":1.4},{"$f":"SUM(J1928:L1930)","v":93.86999999999999}]
[null,null,"SF-00327","Encanador ou Bombeiro Hidráulico com Encargos Complementares","h",0.1,"Senado Federal",18.081,"Sinapi 88267",null,null,{"$f":"ROUND(H1929*F1929,2)","v":1.81}]
[null,null,"SF-00327","Isolamento elastomérico em formato prancha autoadesiva de espessura M. Ref.: AF/Armaflex M-99/E-A, K-Flex ST","m2",1.05,"Senado Federal",86.34,"Pesquisa de Preços",null,{"$f":"ROUND(H1930*F1930,2)","v":90.66}]
[null,null,"",null,null,null,null,""]
["SF-00328","Isolamento elastomérico para tubulações de cobre de 1 1/8\" / tubulações de ferro de 3/4\"","",null,"m",null,"Sinapi 97330 Adaptada",""]
[null,null,"",null,null,null,null,""]
[null,null,"SF-00328","Isolamento elastomérico em formato de tubo ou coquilha de espessura M, próprio para tubulação de cobre de diâmetro nominal 1 1/8\" e para tubulações de ferro de diâmetro nominal 3/4\". Ref.: AF/Armaflex M-28, K-Flex ST","m",1.0210999999999999,"Sinapi 97330",13.28,"Pesquisa de Preços",null,{"$f":"ROUND(H1934*F1934,2)","v":13.56},null,{"$f":"SUM(J1934:L1936)","v":14.18}]
[null,null,"SF-00328","Auxiliar de encanador ou bombeiro hidráulico com encargos complementares","h",{"$f":"0.064*0.3","v":1.9199999999999998E-2},"Sinapi 97330",13.977,"Sinapi 88248",null,null,{"$f":"ROUND(H1935*F1935,2)","v":0.27}]
[null,null,"SF-00328","Encanador ou Bombeiro Hidráulico com Encargos Complementares","h",{"$f":"0.064*0.3","v":1.9199999999999998E-2},"Sinapi 97330",18.081,"Sinapi 88267",null,null,{"$f":"ROUND(H1936*F1936,2)","v":0.35}]
[null,null,"",null,null,null,null,""]
[null,null,"","As seguintes proporções foram consideradas quanto ao tempo de mão de obra: 70% para instalação do tubo e 30% para instalação do isolamento térmico.",null,null,null,""]
[null,null,"",null,null,null,null,""]
["SF-00329","Isolamento elastomérico para tubulações de cobre de 1/2\"","",null,"m",null,"Sinapi 97329 Adaptada",""]
[null,null,"",null,null,null,null,""]
[null,null,"SF-00329","Isolamento elastomérico em formato de tubo ou coquilha de espessura M, próprio para tubulação de cobre de diâmetro nominal 1/2\". Ref.: AF/Armaflex M-12, K-Flex ST","m",1.0210999999999999,"Sinapi 97329",7.2,"Pesquisa de Preços",null,{"$f":"ROUND(H1942*F1942,2)","v":7.35},null,{"$f":"SUM(J1942:L1944)","v":7.93}]
[null,null,"SF-00329","Auxiliar de encanador ou bombeiro hidráulico com encargos complementares","h",{"$f":"0.061*0.3","v":1.83E-2},"Sinapi 97329",13.977,"Sinapi 88248",null,null,{"$f":"ROUNDDOWN(H1943*F1943,2)","v":0.25}]
[null,null,"SF-00329","Encanador ou Bombeiro Hidráulico com Encargos Complementares","h",{"$f":"0.061*0.3","v":1.83E-2},"Sinapi 97329",18.081,"Sinapi 88267",null,null,{"$f":"ROUND(H1944*F1944,2)","v":0.33}]
[null,null,"",null,null,null,null,""]
[null,null,"","As seguintes proporções foram consideradas quanto ao tempo de mão de obra: 70% para instalação do tubo e 30% para instalação do isolamento térmico.",null,null,null,""]
[null,null,"",null,null,null,null,""]
["SF-00330","Isolamento elastomérico para tubulações de cobre de 1/4\"","",null,"m",null,"Sinapi 97327 Adaptada",""]
[null,null,"",null,null,null,null,""]
[null,null,"SF-00330","Isolamento elastomérico em formato de tubo ou coquilha de espessura M, próprio para tubulação de cobre de diâmetro nominal 1/4\". Ref.: AF/Armaflex M-06, K-Flex ST","m",1.0210999999999999,"Sinapi 97327",3.58,"Pesquisa de Preços",null,{"$f":"ROUND(H1950*F1950,2)","v":3.66},null,{"$f":"SUM(J1950:L1952)","v":4.16}]
[null,null,"SF-00330","Auxiliar de encanador ou bombeiro hidráulico com encargos complementares","h",{"$f":"0.052*0.3","v":1.5599999999999999E-2},"Sinapi 97327",13.977,"Sinapi 88248",null,null,{"$f":"ROUND(H1951*F1951,2)","v":0.22}]
[null,null,"SF-00330","Encanador ou Bombeiro Hidráulico com Encargos Complementares","h",{"$f":"0.052*0.3","v":1.5599999999999999E-2},"Sinapi 97327",18.081,"Sinapi 88267",null,null,{"$f":"ROUND(H1952*F1952,2)","v":0.28000000000000003}]
[null,null,"",null,null,null,null,""]
[null,null,"","As seguintes proporções foram consideradas quanto ao tempo de mão de obra: 70% para instalação do tubo e 30% para instalação do isolamento térmico.",null,null,null,""]
[null,null,"",null,null,null,null,""]
["SF-00331","Isolamento elastomérico para tubulações de cobre de 3/4\"","",null,"m",null,"Sinapi 97330 Adaptada",""]
[null,null,"",null,null,null,null,""]
[null,null,"SF-00331","Isolamento elastomérico em formato de tubo ou coquilha de espessura M, próprio para tubulação de cobre de diâmetro nominal 3/4\". Ref.: AF/Armaflex M-18, K-Flex ST","m",1.0210999999999999,"Sinapi 97330",9.3000000000000007,"Pesquisa de Preços",null,{"$f":"ROUND(H1958*F1958,2)","v":9.5},null,{"$f":"SUM(J1958:L1960)","v":10.119999999999999}]
[null,null,"SF-00331","Auxiliar de encanador ou bombeiro hidráulico com encargos complementares","h",{"$f":"0.064*0.3","v":1.9199999999999998E-2},"Sinapi 97330",13.977,"Sinapi 88248",null,null,{"$f":"ROUND(H1959*F1959,2)","v":0.27}]
[null,null,"SF-00331","Encanador ou Bombeiro Hidráulico com Encargos Complementares","h",{"$f":"0.064*0.3","v":1.9199999999999998E-2},"Sinapi 97330",18.081,"Sinapi 88267",null,null,{"$f":"ROUND(H1960*F1960,2)","v":0.35}]
[null,null,"",null,null,null,null,""]
[null,null,"","As seguintes proporções foram consideradas quanto ao tempo de mão de obra: 70% para instalação do tubo e 30% para instalação do isolamento térmico.",null,null,null,""]
[null,null,"",null,null,null,null,""]
["SF-00332","Isolamento elastomérico para tubulações de cobre de 3/8\"","",null,"m",null,"Sinapi 97328 Adaptada",""]
[null,null,"",null,null,null,null,""]
[null,null,"SF-00332","Isolamento elastomérico em formato de tubo ou coquilha de espessura M, próprio para tubulação de cobre de diâmetro nominal 3/8\". Ref.: AF/Armaflex M-10, K-Flex ST","m",1.0210999999999999,"Sinapi 97328",6.28,"Pesquisa de Preços",null,{"$f":"ROUND(H1966*F1966,2)","v":6.41},null,{"$f":"SUM(J1966:L1968)","v":6.96}]
[null,null,"SF-00332","Auxiliar de encanador ou bombeiro hidráulico com encargos complementares","h",{"$f":"0.057*0.3","v":1.7100000000000001E-2},"Sinapi 97328",13.977,"Sinapi 88248",null,null,{"$f":"ROUND(H1967*F1967,2)","v":0.24}]
[null,null,"SF-00332","Encanador ou Bombeiro Hidráulico com Encargos Complementares","h",{"$f":"0.057*0.3","v":1.7100000000000001E-2},"Sinapi 97328",18.081,"Sinapi 88267",null,null,{"$f":"ROUND(H1968*F1968,2)","v":0.31}]
[null,null,"",null,null,null,null,""]
[null,null,"","As seguintes proporções foram consideradas quanto ao tempo de mão de obra: 70% para instalação do tubo e 30% para instalação do isolamento térmico.",null,null,null,""]
[null,null,"",null,null,null,null,""]
["SF-00333","Isolamento elastomérico para tubulações de cobre de 5/8\"","",null,"m",null,"Sinapi 97330 Adaptada",""]
[null,null,"",null,null,null,null,""]
[null,null,"SF-00333","Isolamento elastomérico em formato de tubo ou coquilha de espessura M, próprio para tubulação de cobre de diâmetro nominal 5/8\". Ref.: AF/Armaflex M-15, K-Flex ST","m",1.0210999999999999,"Sinapi 97330",7.77,"Pesquisa de Preços",null,{"$f":"ROUND(H1974*F1974,2)","v":7.93},null,{"$f":"SUM(J1974:L1976)","v":8.5499999999999989}]
[null,null,"SF-00333","Auxiliar de encanador ou bombeiro hidráulico com encargos complementares","h",{"$f":"0.064*0.3","v":1.9199999999999998E-2},"Sinapi 97330",13.977,"Sinapi 88248",null,null,{"$f":"ROUND(H1975*F1975,2)","v":0.27}]
[null,null,"SF-00333","Encanador ou Bombeiro Hidráulico com Encargos Complementares","h",{"$f":"0.064*0.3","v":1.9199999999999998E-2},"Sinapi 97330",18.081,"Sinapi 88267",null,null,{"$f":"ROUND(H1976*F1976,2)","v":0.35}]
[null,null,"",null,null,null,null,""]
[null,null,{"$f":"IF(AND(D1978<>\"\",A1976=\"\"),C1977,IF(D1978<>\"\",A1976,\"\"))","v":""},"As seguintes proporções foram consideradas quanto ao tempo de mão de obra: 70% para instalação do tubo e 30% para instalação do isolamento térmico.",null,null,null,""]
[null,null,"",null,null,null,null,""]
["SF-00334","Isolamento elastomérico para tubulações de cobre de 7/8\" / tubulações de ferro de 1/2\"","",null,"m",null,"Sinapi 97330 Adaptada",""]
[null,null,"",null,null,null,null,""]
[null,null,"SF-00334","Isolamento elastomérico em formato de tubo ou coquilha de espessura M, próprio para tubulação de cobre de diâmetro nominal 7/8\" e para tubulações de ferro de diâmetro nominal 1/2\". Ref.: AF/Armaflex M-22, K-Flex ST","m",1.0210999999999999,"Sinapi 97330",9.11,"Pesquisa de Preços",null,{"$f":"ROUND(H1982*F1982,2)","v":9.3000000000000007},null,{"$f":"SUM(J1982:L1984)","v":9.92}]
[null,null,"SF-00334","Auxiliar de encanador ou bombeiro hidráulico com encargos complementares","h",{"$f":"0.064*0.3","v":1.9199999999999998E-2},"Sinapi 97330",13.977,"Sinapi 88248",null,null,{"$f":"ROUND(H1983*F1983,2)","v":0.27}]
[null,null,"SF-00334","Encanador ou Bombeiro Hidráulico com Encargos Complementares","h",{"$f":"0.064*0.3","v":1.9199999999999998E-2},"Sinapi 97330",18.081,"Sinapi 88267",null,null,{"$f":"ROUND(H1984*F1984,2)","v":0.35}]
[null,null,"",null,null,null,null,""]
[null,null,"","As seguintes proporções foram consideradas quanto ao tempo de mão de obra: 70% para instalação do tubo e 30% para instalação do isolamento térmico.",null,null,null,""]
[null,null,"",null,null,null,null,""]
["SF-00335","Isolamento elastomérico para tubulações de cobre de 1\"","",null,"m",null,"Sinapi 97330 Adaptada",""]
[null,null,"",null,null,null,null,""]
[null,null,"SF-00335","Isolamento elastomérico em formato de tubo ou coquilha de espessura M, próprio para tubulação de cobre de diâmetro nominal 1\". Ref.: AF/Armaflex M-25, K-Flex ST","m",1.0210999999999999,"Sinapi 97330",9.56,"Pesquisa de Preços",null,{"$f":"ROUND(H1990*F1990,2)","v":9.76},null,{"$f":"SUM(J1990:L1992)","v":10.379999999999999}]
[null,null,"SF-00335","Auxiliar de encanador ou bombeiro hidráulico com encargos complementares","h",{"$f":"0.064*0.3","v":1.9199999999999998E-2},"Sinapi 97330",13.977,"Sinapi 88248",null,null,{"$f":"ROUND(H1991*F1991,2)","v":0.27}]
[null,null,"SF-00335","Encanador ou Bombeiro Hidráulico com Encargos Complementares","h",{"$f":"0.064*0.3","v":1.9199999999999998E-2},"Sinapi 97330",18.081,"Sinapi 88267",null,null,{"$f":"ROUND(H1992*F1992,2)","v":0.35}]
[null,null,"",null,null,null,null,""]
[null,null,"","As seguintes proporções foram consideradas quanto ao tempo de mão de obra: 70% para instalação do tubo e 30% para instalação do isolamento térmico.",null,null,null,""]
[null,null,"",null,null,null,null,""]
["SF-00336","Isolamento elastomérico para tubulações de ferro de 1 1/2\"","",null,"m",null,"Sinapi 97330 Adaptada",""]
[null,null,"",null,null,null,null,""]
[null,null,"SF-00336","Isolamento elastomérico em formato de tubo ou coquilha de espessura M, próprio para tubulação ferro de diâmetro nominal 1 1/2\". Ref.: AF/Armaflex M-48, K-Flex ST","m",1.0210999999999999,"Sinapi 97330",20.22,"Pesquisa de Preços",null,{"$f":"ROUND(H1998*F1998,2)","v":20.65},null,{"$f":"SUM(J1998:L2000)","v":21.27}]
[null,null,"SF-00336","Auxiliar de encanador ou bombeiro hidráulico com encargos complementares","h",{"$f":"0.064*0.3","v":1.9199999999999998E-2},"Sinapi 97330",13.977,"Sinapi 88248",null,null,{"$f":"ROUND(H1999*F1999,2)","v":0.27}]
[null,null,"SF-00336","Encanador ou Bombeiro Hidráulico com Encargos Complementares","h",{"$f":"0.064*0.3","v":1.9199999999999998E-2},"Sinapi 97330",18.081,"Sinapi 88267",null,null,{"$f":"ROUND(H2000*F2000,2)","v":0.35}]
[null,null,"",null,null,null,null,""]
[null,null,"","As seguintes proporções foram consideradas quanto ao tempo de mão de obra: 70% para instalação do tubo e 30% para instalação do isolamento térmico.",null,null,null,""]
[null,null,"",null,null,null,null,""]
["SF-00337","Isolamento elastomérico para tubulações de ferro de 1 1/4\"","",null,"m",null,"Sinapi 97330 Adaptada",""]
[null,null,"",null,null,null,null,""]
[null,null,"SF-00337","Isolamento elastomérico em formato de tubo ou coquilha de espessura M, próprio para tubulação ferro de diâmetro nominal 1 1/4\". Ref.: AF/Armaflex M-42, K-Flex ST","m",1.0210999999999999,"Sinapi 97330",16.93,"Pesquisa de Preços",null,{"$f":"ROUND(H2006*F2006,2)","v":17.29},null,{"$f":"SUM(J2006:L2008)","v":17.91}]
[null,null,"SF-00337","Auxiliar de encanador ou bombeiro hidráulico com encargos complementares","h",{"$f":"0.064*0.3","v":1.9199999999999998E-2},"Sinapi 97330",13.977,"Sinapi 88248",null,null,{"$f":"ROUND(H2007*F2007,2)","v":0.27}]
[null,null,"SF-00337","Encanador ou Bombeiro Hidráulico com Encargos Complementares","h",{"$f":"0.064*0.3","v":1.9199999999999998E-2},"Sinapi 97330",18.081,"Sinapi 88267",null,null,{"$f":"ROUND(H2008*F2008,2)","v":0.35}]
[null,null,"",null,null,null,null,""]
[null,null,"","As seguintes proporções foram consideradas quanto ao tempo de mão de obra: 70% para instalação do tubo e 30% para instalação do isolamento térmico.",null,null,null,""]
[null,null,"",null,null,null,null,""]
["SF-00338","Isolamento elastomérico para tubulações de ferro de 1\"","",null,"m",null,"Sinapi 97330 Adaptada",""]
[null,null,"",null,null,null,null,""]
[null,null,"SF-00338","Isolamento elastomérico em formato de tubo ou coquilha de espessura M, próprio para tubulação ferro de diâmetro nominal 1\". Ref.: AF/Armaflex M-35, K-Flex ST","m",1.0210999999999999,"Sinapi 97330",12.98,"Pesquisa de Preços",null,{"$f":"ROUND(H2014*F2014,2)","v":13.25},null,{"$f":"SUM(J2014:L2016)","v":13.87}]
[null,null,"SF-00338","Auxiliar de encanador ou bombeiro hidráulico com encargos complementares","h",{"$f":"0.064*0.3","v":1.9199999999999998E-2},"Sinapi 97330",13.977,"Sinapi 88248",null,null,{"$f":"ROUND(H2015*F2015,2)","v":0.27}]
[null,null,"SF-00338","Encanador ou Bombeiro Hidráulico com Encargos Complementares","h",{"$f":"0.064*0.3","v":1.9199999999999998E-2},"Sinapi 97330",18.081,"Sinapi 88267",null,null,{"$f":"ROUND(H2016*F2016,2)","v":0.35}]
[null,null,"",null,null,null,null,""]
[null,null,"","As seguintes proporções foram consideradas quanto ao tempo de mão de obra: 70% para instalação do tubo e 30% para instalação do isolamento térmico.",null,null,null,""]
[null,null,"",null,null,null,null,""]
["SF-00339","Proteção mecânica em alumínio","",null,"m2",null,"Senado Federal",""]
[null,null,"",null,null,null,null,""]
[null,null,"SF-00339","Auxiliar de encanador ou bombeiro hidráulico com encargos complementares","h",0.1,"Senado Federal",13.977,"Sinapi 88248",null,null,{"$f":"ROUND(H2022*F2022,2)","v":1.4},{"$f":"SUM(J2022:L2024)","v":17.61}]
[null,null,"SF-00339","Encanador ou Bombeiro Hidráulico com Encargos Complementares","h",0.1,"Senado Federal",18.081,"Sinapi 88267",null,null,{"$f":"ROUND(H2023*F2023,2)","v":1.81}]
[null,null,"SF-00339","Alumínio corrugado sem barreira espessura mínima = 0,15mm","m2",1.05,"Senado Federal",13.71,"Pesquisa de Preços",null,{"$f":"ROUND(H2024*F2024,2)","v":14.4}]
[null,null,"",null,null,null,null,""]
["SF-00340","Tubo de aço-carbono galvanizado 1 1/2\"","",null,"m",null,"Sinapi 92653 Adaptada",""]
[null,null,"",null,null,null,null,""]
[null,null,"SF-00340","Encanador ou Bombeiro Hidráulico com Encargos Complementares","h",0.29199999999999998,"Sinapi 92653",18.081,"Sinapi 88267",null,null,{"$f":"ROUND(H2028*F2028,2)","v":5.28},{"$f":"SUM(J2028:L2030)","v":46.19}]
[null,null,"SF-00340","Auxiliar de encanador ou bombeiro hidráulico com encargos complementares","h",0.29199999999999998,"Sinapi 92653",13.977,"Sinapi 88248",null,null,{"$f":"ROUND(H2029*F2029,2)","v":4.08}]
[null,null,"SF-00340","Tubo de aço galvanizado sem costura schedule 40 1 1/2\"","m",1.0389999999999999,"Sinapi 92653",35.442,"Sinapi 40624",null,{"$f":"ROUNDUP(H2030*F2030,2)","v":36.83}]
[null,null,"",null,null,null,null,""]
["SF-00341","Tubo de aço-carbono galvanizado 1 1/4\"","",null,"m",null,"Sinapi 92652 Adaptada",""]
[null,null,"",null,null,null,null,""]
[null,null,"SF-00341","Encanador ou Bombeiro Hidráulico com Encargos Complementares","h",0.27500000000000002,"Sinapi 92652",18.081,"Sinapi 88267",null,null,{"$f":"ROUND(H2034*F2034,2)","v":4.97},{"$f":"SUM(J2034:L2036)","v":39.69}]
[null,null,"SF-00341","Auxiliar de encanador ou bombeiro hidráulico com encargos complementares","h",0.27500000000000002,"Sinapi 92652",13.977,"Sinapi 88248",null,null,{"$f":"ROUND(H2035*F2035,2)","v":3.84}]
[null,null,"SF-00341","Tubo aço carbono sem costura schedule 40 diâmetros 1\"-2,50kg/m,1 1/4\"-3,38kg/m,1 1/2\"-4,05kg/m,2\"-5,43kg/m,2 1/2\"-8,36kg/m,3\"-11,29kg/m,3 1/2\"-13,57kg/m e 4\"-16,08kg/m","m",1.0389999999999999,"Sinapi 92652",29.720339999999997,"Orse 03062",null,{"$f":"ROUND(H2036*F2036,2)","v":30.88}]
[null,null,"",null,null,null,null,""]
["SF-00342","Tubo de aço-carbono galvanizado 1\"","",null,"m",null,"Sinapi 92688 Adaptada",""]
[null,null,"",null,null,null,null,""]
[null,null,"SF-00342","Encanador ou Bombeiro Hidráulico com Encargos Complementares","h",0.29699999999999999,"Sinapi 92688",18.081,"Sinapi 88267",null,null,{"$f":"ROUND(H2040*F2040,2)","v":5.37},{"$f":"SUM(J2040:L2042)","v":32.36}]
[null,null,"SF-00342","Auxiliar de encanador ou bombeiro hidráulico com encargos complementares","h",0.29699999999999999,"Sinapi 92688",13.977,"Sinapi 88248",null,null,{"$f":"ROUND(H2041*F2041,2)","v":4.1500000000000004}]
[null,null,{"$f":"IF(AND(D2042<>\"\",A2040=\"\"),C2041,IF(D2042<>\"\",A2040,\"\"))","v":"SF-00342"},"Tubo aço carbono sem costura schedule 40 diâmetros 1\"-2,50kg/m,1 1/4\"-3,38kg/m,1 1/2\"-4,05kg/m,2\"-5,43kg/m,2 1/2\"-8,36kg/m,3\"-11,29kg/m,3 1/2\"-13,57kg/m e 4\"-16,08kg/m","m",1.0389999999999999,"Sinapi 92688",21.982499999999998,"Orse 03062",null,{"$f":"ROUND(H2042*F2042,2)","v":22.84}]
[null,null,"",null,null,null,null,""]
["SF-00343","Tubo de aço-carbono galvanizado 3/4\"","",null,"m",null,"Sinapi 92688 Adaptada",""]
[null,null,"",null,null,null,null,""]
[null,null,"SF-00343","Encanador ou Bombeiro Hidráulico com Encargos Complementares","h",0.29699999999999999,"Sinapi 92688",18.081,"Sinapi 88267",null,null,{"$f":"ROUND(H2046*F2046,2)","v":5.37},{"$f":"SUM(J2046:L2048)","v":31.919999999999998}]
[null,null,"SF-00343","Auxiliar de encanador ou bombeiro hidráulico com encargos complementares","h",0.29699999999999999,"Sinapi 92688",13.977,"Sinapi 88248",null,null,{"$f":"ROUND(H2047*F2047,2)","v":4.1500000000000004}]
[null,null,"SF-00343","Tubo aco preto sem costura 3/4\", E= *2,87 mm, schedule 40, *1,69 kg/m","m",1.0389999999999999,"Sinapi 92688",21.564,"Sinapi 21150",null,{"$f":"ROUND(H2048*F2048,2)","v":22.4}]
[null,null,"",null,null,null,null,""]
["SF-00344","Tubo de cobre de 1/2\"","",null,"m",null,"Sinapi 97329 Adaptada",""]
[null,null,"",null,null,null,null,""]
[null,null,"SF-00344","Tubo de cobre flexivel, D = 1/2 \", E = 0,79 mm, para ar-condicionado/ instalacoes gas residenciais e comerciais","m",1.0210999999999999,"Sinapi 97329",16.38,"Sinapi 39660",null,{"$f":"ROUNDDOWN(H2052*F2052,2)","v":16.72},null,{"$f":"SUM(J2052:L2054)","v":18.079999999999998}]
[null,null,"SF-00344","Auxiliar de encanador ou bombeiro hidráulico com encargos complementares","h",{"$f":"0.061*0.7","v":4.2699999999999995E-2},"Sinapi 97329",13.977,"Sinapi 88248",null,null,{"$f":"ROUNDDOWN(H2053*F2053,2)","v":0.59}]
[null,null,"SF-00344","Encanador ou Bombeiro Hidráulico com Encargos Complementares","h",{"$f":"0.061*0.7","v":4.2699999999999995E-2},"Sinapi 97329",18.081,"Sinapi 88267",null,null,{"$f":"ROUND(H2054*F2054,2)","v":0.77}]
[null,null,"",null,null,null,null,""]
[null,null,"","As seguintes proporções foram consideradas quanto ao tempo de mão de obra: 70% para instalação do tubo e 30% para instalação do isolamento térmico.",null,null,null,""]
[null,null,"",null,null,null,null,""]
["SF-00345","Tubo de cobre de 1/4\" ","",null,"m",null,"Sinapi 97327 Adaptada",""]
[null,null,"",null,null,null,null,""]
[null,null,"SF-00345","Tubo de cobre flexivel, D = 1/4 \", E = 0,79 mm, para ar-condicionado/ instalacoes gas residenciais e comerciais","m",1.0210999999999999,"Sinapi 97327",7.8480000000000008,"Sinapi 39662",null,{"$f":"ROUND(H2060*F2060,2)","v":8.01},null,{"$f":"SUM(J2060:L2062)","v":9.18}]
[null,null,"SF-00345","Auxiliar de encanador ou bombeiro hidráulico com encargos complementares","h",{"$f":"0.052*0.7","v":3.6399999999999995E-2},"Sinapi 97327",13.977,"Sinapi 88248",null,null,{"$f":"ROUND(H2061*F2061,2)","v":0.51}]
[null,null,"SF-00345","Encanador ou Bombeiro Hidráulico com Encargos Complementares","h",{"$f":"0.052*0.7","v":3.6399999999999995E-2},"Sinapi 97327",18.081,"Sinapi 88267",null,null,{"$f":"ROUND(H2062*F2062,2)","v":0.66}]
[null,null,"",null,null,null,null,""]
[null,null,"","As seguintes proporções foram consideradas quanto ao tempo de mão de obra: 70% para instalação do tubo e 30% para instalação do isolamento térmico.",null,null,null,""]
[null,null,"",null,null,null,null,""]
["SF-00346","Tubo de cobre de 3/4\"","",null,"m",null,"Sinapi 97330 Adaptada",""]
[null,null,"",null,null,null,null,""]
[null,null,"SF-00346","Tubo de cobre flexivel, D = 3/4 \", E = 0,79 mm, para ar-condicionado/ instalacoes gas residenciais e comerciais","m",1.0210999999999999,"Sinapi 97330",24.651,"Sinapi 39666",null,{"$f":"ROUND(H2068*F2068,2)","v":25.17},null,{"$f":"SUM(J2068:L2070)","v":26.61}]
[null,null,"SF-00346","Auxiliar de encanador ou bombeiro hidráulico com encargos complementares","h",{"$f":"0.064*0.7","v":4.48E-2},"Sinapi 97330",13.977,"Sinapi 88248",null,null,{"$f":"ROUND(H2069*F2069,2)","v":0.63}]
[null,null,"SF-00346","Encanador ou Bombeiro Hidráulico com Encargos Complementares","h",{"$f":"0.064*0.7","v":4.48E-2},"Sinapi 97330",18.081,"Sinapi 88267",null,null,{"$f":"ROUND(H2070*F2070,2)","v":0.81}]
[null,null,"",null,null,null,null,""]
[null,null,"","As seguintes proporções foram consideradas quanto ao tempo de mão de obra: 70% para instalação do tubo e 30% para instalação do isolamento térmico.",null,null,null,""]
[null,null,"",null,null,null,null,""]
["SF-00347","Tubo de cobre de 3/8\"","",null,"m",null,"Sinapi 97328 Adaptada",""]
[null,null,"",null,null,null,null,""]
[null,null,"SF-00347","Tubo de cobre flexivel, D = 3/8 \", E = 0,79 mm, para ar-condicionado/ instalacoes gas residenciais e comerciais","m",1.0210999999999999,"Sinapi 97328",12.077999999999999,"Sinapi 39664",null,{"$f":"ROUND(H2076*F2076,2)","v":12.33},null,{"$f":"SUM(J2076:L2078)","v":13.610000000000001}]
[null,null,"SF-00347","Auxiliar de encanador ou bombeiro hidráulico com encargos complementares","h",{"$f":"0.057*0.7","v":3.9899999999999998E-2},"Sinapi 97328",13.977,"Sinapi 88248",null,null,{"$f":"ROUND(H2077*F2077,2)","v":0.56000000000000005}]
[null,null,"SF-00347","Encanador ou Bombeiro Hidráulico com Encargos Complementares","h",{"$f":"0.057*0.7","v":3.9899999999999998E-2},"Sinapi 97328",18.081,"Sinapi 88267",null,null,{"$f":"ROUND(H2078*F2078,2)","v":0.72}]
[null,null,"",null,null,null,null,""]
[null,null,"","As seguintes proporções foram consideradas quanto ao tempo de mão de obra: 70% para instalação do tubo e 30% para instalação do isolamento térmico.",null,null,null,""]
[null,null,"",null,null,null,null,""]
["SF-00348","Tubo de cobre de 5/8\"","",null,"m",null,"Sinapi 97330 Adaptada",""]
[null,null,"",null,null,null,null,""]
[null,null,"SF-00348","Tubo de cobre flexivel, D = 5/8 \", E = 0,79 mm, para ar-condicionado/ instalacoes gas residenciais e comerciais","m",1.0210999999999999,"Sinapi 97330",20.376000000000001,"Sinapi 39665",null,{"$f":"ROUND(H2084*F2084,2)","v":20.81},null,{"$f":"SUM(J2084:L2086)","v":22.249999999999996}]
[null,null,"SF-00348","Auxiliar de encanador ou bombeiro hidráulico com encargos complementares","h",{"$f":"0.064*0.7","v":4.48E-2},"Sinapi 97330",13.977,"Sinapi 88248",null,null,{"$f":"ROUND(H2085*F2085,2)","v":0.63}]
[null,null,"SF-00348","Encanador ou Bombeiro Hidráulico com Encargos Complementares","h",{"$f":"0.064*0.7","v":4.48E-2},"Sinapi 97330",18.081,"Sinapi 88267",null,null,{"$f":"ROUND(H2086*F2086,2)","v":0.81}]
[null,null,"",null,null,null,null,""]
[null,null,"","As seguintes proporções foram consideradas quanto ao tempo de mão de obra: 70% para instalação do tubo e 30% para instalação do isolamento térmico.",null,null,null,""]
[null,null,"",null,null,null,null,""]
["SF-00349","Tubo de cobre de 7/8\"","",null,"m",null,"Sinapi 97330 Adaptada",""]
[null,null,"",null,null,null,null,""]
[null,null,"SF-00349","Tubo de cobre flexivel, D = 7/8 \", E = 0,79 mm, para ar-condicionado/ instalacoes gas residenciais e comerciais","m",1.0210999999999999,"Sinapi 97330",23.021999999999998,"Pini 19.105.001505.SER",null,{"$f":"ROUND(H2092*F2092,2)","v":23.51},null,{"$f":"SUM(J2092:L2094)","v":24.95}]
[null,null,"SF-00349","Auxiliar de encanador ou bombeiro hidráulico com encargos complementares","h",{"$f":"0.064*0.7","v":4.48E-2},"Sinapi 97330",13.977,"Sinapi 88248",null,null,{"$f":"ROUND(H2093*F2093,2)","v":0.63}]
[null,null,"SF-00349","Encanador ou Bombeiro Hidráulico com Encargos Complementares","h",{"$f":"0.064*0.7","v":4.48E-2},"Sinapi 97330",18.081,"Sinapi 88267",null,null,{"$f":"ROUND(H2094*F2094,2)","v":0.81}]
[null,null,"",null,null,null,null,""]
[null,null,"","As seguintes proporções foram consideradas quanto ao tempo de mão de obra: 70% para instalação do tubo e 30% para instalação do isolamento térmico.",null,null,null,""]
[null,null,"",null,null,null,null,""]
["SF-00350","Tubo de cobre de 1\"","",null,"m",null,"Sinapi 97330 Adaptada",""]
[null,null,"",null,null,null,null,""]
[null,null,"SF-00350","Tubo de cobre flexivel, D = 1 \", E = 0,79 mm, para ar-condicionado/ instalacoes gas residenciais e comerciais","m",1.0210999999999999,"Sinapi 97330",26.712,"Orse 07469",null,{"$f":"ROUND(H2100*F2100,2)","v":27.28},null,{"$f":"SUM(J2100:L2102)","v":28.72}]
[null,null,"SF-00350","Auxiliar de encanador ou bombeiro hidráulico com encargos complementares","h",{"$f":"0.064*0.7","v":4.48E-2},"Sinapi 97330",13.977,"Sinapi 88248",null,null,{"$f":"ROUND(H2101*F2101,2)","v":0.63}]
[null,null,"SF-00350","Encanador ou Bombeiro Hidráulico com Encargos Complementares","h",{"$f":"0.064*0.7","v":4.48E-2},"Sinapi 97330",18.081,"Sinapi 88267",null,null,{"$f":"ROUND(H2102*F2102,2)","v":0.81}]
[null,null,"",null,null,null,null,""]
[null,null,"","As seguintes proporções foram consideradas quanto ao tempo de mão de obra: 70% para instalação do tubo e 30% para instalação do isolamento térmico.",null,null,null,""]
[null,null,"",null,null,null,null,""]
["SF-00351","Tubo de cobre de 1 1/8\"",{"$f":"IF(AND(D2106<>\"\",A2104=\"\"),C2105,IF(D2106<>\"\",A2104,\"\"))","v":""},null,"m",null,"Sinapi 97330 Adaptada",""]
[null,null,"",null,null,null,null,""]
[null,null,"SF-00351","Tubo de cobre flexivel, D = 1 1/8 \", E = 0,79 mm, para ar-condicionado/ instalacoes gas residenciais e comerciais","m",1.0210999999999999,"Sinapi 97330",29.222999999999999,"Pini 19.105.001506.SER",null,{"$f":"ROUND(H2108*F2108,2)","v":29.84},null,{"$f":"SUM(J2108:L2110)","v":31.279999999999998}]
[null,null,"SF-00351","Auxiliar de encanador ou bombeiro hidráulico com encargos complementares","h",{"$f":"0.064*0.7","v":4.48E-2},"Sinapi 97330",13.977,"Sinapi 88248",null,null,{"$f":"ROUND(H2109*F2109,2)","v":0.63}]
[null,null,"SF-00351","Encanador ou Bombeiro Hidráulico com Encargos Complementares","h",{"$f":"0.064*0.7","v":4.48E-2},"Sinapi 97330",18.081,"Sinapi 88267",null,null,{"$f":"ROUND(H2110*F2110,2)","v":0.81}]
[null,null,"",null,null,null,null,""]
[null,null,"","As seguintes proporções foram consideradas quanto ao tempo de mão de obra: 70% para instalação do tubo e 30% para instalação do isolamento térmico.",null,null,null,""]
[null,null,"",null,null,null,null,""]
["SF-00354","Instalação de armários reaproveitados","",null,"m2",null,"Senado Federal",""]
[null,null,"",null,null,null,null,""]
[null,null,"SF-00354","Marceneiro com encargos complementares","h",1.5,"Senado Federal",18.333000000000002,"Sinapi 88273",null,null,{"$f":"ROUND(H2116*F2116,2)","v":27.5},{"$f":"SUM(J2116:L2116)","v":27.5}]
[null,null,"",null,null,null,null,""]
["SF-00355","Mesa/tampo de MDF, fixada em parede com mão-francesa","",null,"m2",null,"Senado Federal",""]
[null,null,"",null,null,null,null,""]
[null,null,"SF-00355","Marceneiro com encargos complementares","h",2,"Senado Federal",18.333000000000002,"Sinapi 88273",null,null,{"$f":"ROUND(H2120*F2120,2)","v":36.67},{"$f":"SUM(J2120:L2124)","v":161.32999999999998}]
[null,null,"SF-00355","Ajudante de carpinteiro com encargos complementares","h",2,"Senado Federal",15.065999999999999,"Sinapi 88239",null,null,{"$f":"ROUND(H2121*F2121,2)","v":30.13}]
[null,null,"SF-00355","Suporte mao-francesa em aco, abas iguais 40 cm, capacidade minima 70 kg, branco","un",2,"Senado Federal",27.639000000000003,"Sinapi 37591",null,{"$f":"ROUND(H2122*F2122,2)","v":55.28}]
[null,null,"SF-00355","Fita acabamento bordo, em PVC, cor branca, e=19mm","m",{"$f":"0.5*2+2*1","v":3},"Senado Federal",0.29700000000000004,"Orse 03649",null,{"$f":"ROUND(H2123*F2123,2)","v":0.89}]
[null,null,"SF-00355","Chapa de MDF branco liso 2 faces, e = 25 mm, de *2,75 x 1,85* m","m2",1,"Senado Federal",38.357999999999997,"Sinapi 34666",null,{"$f":"ROUND(H2124*F2124,2)","v":38.36}]
[null,null,"",null,null,null,null,""]
["SF-00356","Painel para TV de 120 x 180 cm","",null,"un",null,"Senado Federal",""]
[null,null,"",null,null,null,null,""]
[null,null,"SF-00356","Marceneiro com encargos complementares","h",1,"Senado Federal",18.333000000000002,"Sinapi 88273",null,null,{"$f":"ROUND(H2128*F2128,2)","v":18.329999999999998},{"$f":"SUM(J2128:L2130)","v":253.3}]
[null,null,"SF-00356","Ajudante de carpinteiro com encargos complementares","h",1,"Senado Federal",15.065999999999999,"Sinapi 88239",null,null,15.07]
[null,null,"SF-00356","Painel de TV de 120 x 180 cm, fabricado em MDP. Ref.: Urbe Móveis Plus","un",1,"Senado Federal",219.9,"Pesquisa de Preços",null,{"$f":"ROUND(H2130*F2130,2)","v":219.9}]
[null,null,"",null,null,null,null,""]
["SF-00357","Painel para TV de 160 x 160 cm","",null,"un",null,"Senado Federal",""]
[null,null,"",null,null,null,null,""]
[null,null,"SF-00357","Marceneiro com encargos complementares","h",1,"Senado Federal",18.333000000000002,"Sinapi 88273",null,null,{"$f":"ROUND(H2134*F2134,2)","v":18.329999999999998},{"$f":"SUM(J2134:L2136)","v":535.75}]
[null,null,"SF-00357","Ajudante de carpinteiro com encargos complementares","h",1,"Senado Federal",15.065999999999999,"Sinapi 88239",null,null,15.07]
[null,null,"SF-00357","Painel de TV de 160 x 160 cm, fabricado em MDP. Ref.: HB Móveis Life Canyon, HB Móveis Livin","un",1,"Senado Federal",502.35,"Pesquisa de Preços",null,{"$f":"ROUND(H2136*F2136,2)","v":502.35}]
[null,null,"",null,null,null,null,""]
["SF-00358","Painel para TV de 90 x 120 cm","",null,"un",null,"Senado Federal",""]
[null,null,"",null,null,null,null,""]
[null,null,"SF-00358","Marceneiro com encargos complementares","h",1,"Senado Federal",18.333000000000002,"Sinapi 88273",null,null,{"$f":"ROUND(H2140*F2140,2)","v":18.329999999999998},{"$f":"SUM(J2140:L2142)","v":152.1}]
[null,null,"SF-00358","Ajudante de carpinteiro com encargos complementares","h",1,"Senado Federal",15.065999999999999,"Sinapi 88239",null,null,15.07]
[null,null,"SF-00358","Painel de TV de 90 x 120 cm, fabricado em MDP. Ref.: Germai Ipanema 90 x 120 x 26,5","un",1,"Senado Federal",118.7,"Pesquisa de Preços",null,{"$f":"ROUND(H2142*F2142,2)","v":118.7}]
[null,null,"",null,null,null,null,""]
["SF-00359","Batentes e guarnições para porta, em madeira","",null,"un",null,"Sinapi 90818",""]
[null,null,"",null,null,null,null,""]
[null,null,"SF-00359","Prego de aco polido com cabeca 18 x 27 (2 1/2 x 10)","kg",0.2,"Sinapi 90818",9.3149999999999995,"Sinapi 5061",null,{"$f":"ROUND(H2146*F2146,2)","v":1.86},null,{"$f":"SUM(J2146:L2152)","v":275.41000000000003}]
[null,null,"SF-00359","Tinta asfaltica impermeabilizante dispersa em agua, para materiais cimenticios","l",0.17369999999999999,"Sinapi 90818",6.1109999999999998,"Sinapi 7319",null,{"$f":"ROUND(H2147*F2147,2)","v":1.06}]
[null,null,"SF-00359","Carpinteiro de esquadria com encargos complementares","h",0.65500000000000003,"Sinapi 90818",18.045000000000002,"Sinapi 88261",null,null,{"$f":"ROUND(H2148*F2148,2)","v":11.82}]
[null,null,"SF-00359","Pedreiro com Encargos Complementares","h",1.617,"Sinapi 90818",18.117000000000001,"Sinapi 88309",null,null,29.3]
[null,null,"SF-00359","Servente com Encargos Complementares","h",1.1359999999999999,"Sinapi 90818",13.167000000000002,"Sinapi 88316",null,null,{"$f":"ROUND(H2150*F2150,2)","v":14.96}]
[null,null,"SF-00359","Argamassa traço 1:3 (cimento e areia média), preparo manual. AF_08/2014","m3",2.29E-2,"Sinapi 90818",{"$f":"OFFSET(INDEX('Composições Auxiliares'!A:L,MATCH(D2151,'Composições Auxiliares'!A:A,0),12),2,0)","v":366.43999999999994},"Sinapi 88629",{"$f":"ROUND(H2151*F2151,2)","v":8.39}]
[null,null,"SF-00359","Aduela / marco / batente para porta de 90x210cm, padrão médio - fornecimento e montagem. AF_08/2015","un",1,"Sinapi 90818",{"$f":"OFFSET(INDEX('Composições Auxiliares'!A:L,MATCH(D2152,'Composições Auxiliares'!A:A,0),12),2,0)","v":208.01999999999998},"Sinapi 90803",{"$f":"ROUND(H2152*F2152,2)","v":208.02}]
[null,null,"",null,null,null,null,""]
["SF-00360","Chapa de proteção para porta – Linha Acessibilidade","",null,"m2",null,"Seinfra C4621 Adaptada",""]
[null,null,"",null,null,null,null,""]
[null,null,"SF-00360","Servente com Encargos Complementares","h",0.3,"Seinfra C4621 Adaptada",13.167000000000002,"Sinapi 88316",null,null,{"$f":"ROUND(H2156*F2156,2)","v":3.95},{"$f":"SUM(J2156:L2158)","v":235.45}]
[null,null,"SF-00360","Marceneiro com encargos complementares","h",0.3,"Seinfra C4621 Adaptada",18.333000000000002,"Sinapi 88273",null,null,5.5]
[null,null,"SF-00360","Chapa de proteção em aço inox AISI 304, largura conforme projeto, 400 mm de altura, chapa com espessura de 1 mm, acabamento escovado fosco","m2",1,"Seinfra C4621 Adaptada",226,"Pesquisa de Preços",null,{"$f":"ROUND(H2158*F2158,2)","v":226}]
[null,null,"",null,null,null,null,""]
["SF-00361","Folha de porta 2,10x0,60m, com ou sem bandeira, estruturada em madeira","",null,"un",null,"Sinapi 91009 Adaptada",""]
[null,null,"",null,null,null,null,""]
[null,null,"SF-00361","Porta de madeira, folha media (NBR 15930) de 60 x 210 cm, e = 35 mm, nucleo sarrafeado, capa lisa em HDF, acabamento laminado natural para verniz","un ",1,"Sinapi 91009",153.495,"Sinapi 5020",null,{"$f":"ROUND(H2162*F2162,2)","v":153.5},null,{"$f":"SUM(J2162:L2164)","v":175.71}]
[null,null,"SF-00361","Carpinteiro de esquadria com encargos complementares","h",{"$f":"1.282-0.3","v":0.98199999999999998},"Sinapi 91009",18.045000000000002,"Sinapi 88261",null,null,{"$f":"ROUND(H2163*F2163,2)","v":17.72}]
[null,null,"SF-00361","Servente com Encargos Complementares","h",{"$f":"0.641-0.3","v":0.34100000000000003},"Sinapi 91009",13.167000000000002,"Sinapi 88316",null,null,{"$f":"ROUND(H2164*F2164,2)","v":4.49}]
[null,null,"",null,null,null,null,""]
[null,null,"","Adaptação: Foram reduzidos os coeficientes de MO conforme composição 74047/2",null,null,null,""]
[null,null,"",null,null,null,null,""]
["SF-00362","Folha de porta 2,10x0,70m, com ou sem bandeira, estruturada em madeira","",null,"un",null,"Sinapi 91010 Adaptada",""]
[null,null,"",null,null,null,null,""]
[null,null,{"$f":"IF(AND(D2170<>\"\",A2168=\"\"),C2169,IF(D2170<>\"\",A2168,\"\"))","v":"SF-00362"},"Porta de madeira, folha media (NBR 15930) de 70 x 210 cm, e = 35 mm, nucleo sarrafeado, capa lisa em HDF, acabamento em laminado natural para verniz","un ",1,"Sinapi 91010",105.75,"Sinapi 4981",null,{"$f":"ROUND(H2170*F2170,2)","v":105.75},null,{"$f":"SUM(J2170:L2172)","v":131.22}]
[null,null,"SF-00362","Carpinteiro de esquadria com encargos complementares","h",{"$f":"1.414-0.3","v":1.1139999999999999},"Sinapi 91010",18.045000000000002,"Sinapi 88261",null,null,{"$f":"ROUNDUP(H2171*F2171,2)","v":20.110000000000003}]
[null,null,"SF-00362","Servente com Encargos Complementares","h",{"$f":"0.707-0.3","v":0.40699999999999997},"Sinapi 91010",13.167000000000002,"Sinapi 88316",null,null,{"$f":"ROUND(H2172*F2172,2)","v":5.36}]
[null,null,"",null,null,null,null,""]
[null,null,"","Adaptação: Foram reduzidos os coeficientes de MO conforme composição 74047/2",null,null,null,""]
[null,null,"",null,null,null,null,""]
["SF-00363","Folha de porta 2,10x0,80m, com ou sem bandeira, estruturada em madeira","",null,"un",null,"Sinapi 91011 Adaptada",""]
[null,null,"",null,null,null,null,""]
[null,null,"SF-00363","Porta de madeira, folha media (NBR 15930) de 80 x 210 cm, e = 35 mm, nucleo sarrafeado, capa lisa em HDF, acabamento em laminado natural para verniz","un ",1,"Sinapi 91011",180.09,"Sinapi 4992",null,{"$f":"ROUND(H2178*F2178,2)","v":180.09},null,{"$f":"SUM(J2178:L2180)","v":208.79999999999998}]
[null,null,"SF-00363","Carpinteiro de esquadria com encargos complementares","h",{"$f":"1.546-0.3","v":1.246},"Sinapi 91011",18.045000000000002,"Sinapi 88261",null,null,{"$f":"ROUND(H2179*F2179,2)","v":22.48}]
[null,null,"SF-00363","Servente com Encargos Complementares","h",{"$f":"0.773-0.3","v":0.47300000000000003},"Sinapi 91011",13.167000000000002,"Sinapi 88316",null,null,{"$f":"ROUND(H2180*F2180,2)","v":6.23}]
[null,null,"",null,null,null,null,""]
[null,null,"","Adaptação: Foram reduzidos os coeficientes de MO conforme composição 74047/2",null,null,null,""]
[null,null,"",null,null,null,null,""]
["SF-00364","Folha de porta 2,10x0,90m, com ou sem bandeira, estruturada em madeira","",null,"un",null,"Sinapi 91012 Adaptada",""]
[null,null,"",null,null,null,null,""]
[null,null,"SF-00364","Porta de madeira, folha media (NBR 15930) de 90 x 210 cm, e = 35 mm, nucleo sarrafeado, capa lisa em HDF, acabamento em laminado natural para verniz","un ",1,"Sinapi 91012",165.45600000000002,"Sinapi 4987",null,{"$f":"ROUND(H2186*F2186,2)","v":165.46},null,{"$f":"SUM(J2186:L2188)","v":197.43}]
[null,null,"SF-00364","Carpinteiro de esquadria com encargos complementares","h",{"$f":"1.678-0.3","v":1.3779999999999999},"Sinapi 91012",18.045000000000002,"Sinapi 88261",null,null,{"$f":"ROUND(H2187*F2187,2)","v":24.87}]
[null,null,"SF-00364","Servente com Encargos Complementares","h",{"$f":"0.839-0.3","v":0.53899999999999992},"Sinapi 91012",13.167000000000002,"Sinapi 88316",null,null,{"$f":"ROUND(H2188*F2188,2)","v":7.1}]
[null,null,"",null,null,null,null,""]
[null,null,"","Adaptação: Foram reduzidos os coeficientes de MO conforme composição 74047/2",null,null,null,""]
[null,null,"",null,null,null,null,""]
["SF-00365","Folha de porta 2,10x1,0m, com ou sem bandeira, estruturada em madeira","",null,"un",null,"Sinapi 91012 Adaptada",""]
[null,null,"",null,null,null,null,""]
[null,null,"SF-00365","Porta de madeira, folha media (NBR 15930) de 100 x 210 cm, e = 35 mm, nucleo sarrafeado, capa lisa em HDF, acabamento em laminado natural para verniz","un ",1,"Sinapi 91012",181.476,"Sinapi 4989",null,{"$f":"ROUND(H2194*F2194,2)","v":181.48},null,{"$f":"SUM(J2194:L2195)","v":206.35}]
[null,null,"SF-00365","Carpinteiro de esquadria com encargos complementares","h",{"$f":"1.678-0.3","v":1.3779999999999999},"Sinapi 91012",18.045000000000002,"Sinapi 88261",null,null,{"$f":"ROUND(H2195*F2195,2)","v":24.87}]
[null,null,"SF-00365","Servente com Encargos Complementares","h",{"$f":"0.839-0.3","v":0.53899999999999992},"Sinapi 91012",13.167000000000002,"Sinapi 88316",null,null,{"$f":"ROUND(H2196*F2196,2)","v":7.1}]
[null,null,"",null,null,null,null,""]
[null,null,"","Adaptação: Foram reduzidos os coeficientes de MO conforme composição 74047/2",null,null,null,""]
[null,null,"",null,null,null,null,""]
["SF-00366","Instalação de batentes de madeira reaproveitados","",null,"un",null,"Sinapi 91294 Adaptada",""]
[null,null,"",null,null,null,null,""]
[null,null,"SF-00366","Pedreiro com Encargos Complementares","h",0.65500000000000003,"Sinapi 91294",18.117000000000001,"Sinapi 88309",null,null,{"$f":"ROUND(H2202*F2202,2)","v":11.87},{"$f":"SUM(J2202:L2207)","v":67.319999999999993}]
[null,null,"SF-00366","Carpinteiro de esquadria com encargos complementares","h",1.617,"Sinapi 91294",18.045000000000002,"Sinapi 88261",null,null,{"$f":"ROUND(H2203*F2203,2)","v":29.18}]
[null,null,"SF-00366","Servente com Encargos Complementares","h",1.1359999999999999,"Sinapi 91294",13.167000000000002,"Sinapi 88316",null,null,{"$f":"ROUND(H2204*F2204,2)","v":14.96}]
[null,null,"SF-00366","Prego de aco polido com cabeca 18 x 27 (2 1/2 x 10)","kg",0.2,"Sinapi 91294",9.3149999999999995,"Sinapi 5061",null,{"$f":"ROUND(H2205*F2205,2)","v":1.86}]
[null,null,"SF-00366","Tinta asfaltica impermeabilizante dispersa em agua, para materiais cimenticios","l",0.17369999999999999,"Sinapi 91294",6.1109999999999998,"Sinapi 7319",null,1.06]
[null,null,"SF-00366","Argamassa traço 1:3 (cimento e areia média), preparo manual. AF_08/2014","m3",2.29E-2,"Sinapi 91294",{"$f":"OFFSET(INDEX('Composições Auxiliares'!A:L,MATCH(D2207,'Composições Auxiliares'!A:A,0),12),2,0)","v":366.43999999999994},"Sinapi 88629",{"$f":"ROUND(H2207*F2207,2)","v":8.39}]
[null,null,"",null,null,null,null,""]
["SF-00367","Instalação de folhas de portas reaproveitadas","",null,"un",null,"Sinapi 72144",""]
[null,null,"",null,null,null,null,""]
[null,null,"SF-00367","Carpinteiro de esquadria com encargos complementares","h",2.2000000000000002,"Sinapi 72144",18.045000000000002,"Sinapi 88261",null,null,{"$f":"ROUND(H2211*F2211,2)","v":39.700000000000003},{"$f":"SUM(J2211:L2212)","v":68.67}]
[null,null,"SF-00367","Servente com Encargos Complementares","h",2.2000000000000002,"Sinapi 72144",13.167000000000002,"Sinapi 88316",null,null,{"$f":"ROUND(H2212*F2212,2)","v":28.97}]
[null,null,"",null,null,null,null,""]
["SF-00368","Dobradiça para porta","",null,"un",null,"Sinapi 74047/2 Adaptada",""]
[null,null,"",null,null,null,null,""]
[null,null,"SF-00368","Dobradiças em latão, reforçada com anéis, acabamento cromado, tamanho de 3 1/2 x 3\" ","un ",1,"Sinapi 74047/2 Adaptada",38.708999999999996,"Pini 12.104.000050.SER",null,{"$f":"ROUND(H2216*F2216,2)","v":38.71},null,{"$f":"SUM(J2216:L2218)","v":48.650000000000006}]
[null,null,"SF-00368","Ajudante de carpinteiro com encargos complementares","h",0.3,"Sinapi 74047/2",15.065999999999999,"Sinapi 88239",null,null,{"$f":"ROUND(H2217*F2217,2)","v":4.5199999999999996}]
[null,null,"SF-00368","Carpinteiro de esquadria com encargos complementares","h",0.3,"Sinapi 74047/2",18.045000000000002,"Sinapi 88261",null,null,{"$f":"ROUNDUP(H2218*F2218,2)","v":5.42}]
[null,null,"",null,null,null,null,""]
["SF-00369","Fechadura para banheiro maçaneta em barra","",null,"un",null,"Sinapi 90830 Adaptada",""]
[null,null,"",null,null,null,null,""]
[null,null,"SF-00369","Fechadura para porta de banheiro, com maçaneta em formato de barra, confeccionada em aço com acabamento inox polido. Ref.: MZ 270 WC Standard – Linha Standard – Papaiz","un ",1,"Sinapi 90830 Adaptada",88.99,"Pesquisa de Preços",null,{"$f":"ROUND(H2222*F2222,2)","v":88.99},null,{"$f":"SUM(J2222:L2224)","v":113.66999999999999}]
[null,null,"SF-00369","Carpinteiro de esquadria com encargos complementares","h",1.002,"Sinapi 90830 Adaptada",18.045000000000002,"Sinapi 88261",null,null,{"$f":"ROUND(H2223*F2223,2)","v":18.079999999999998}]
[null,null,"SF-00369","Servente com Encargos Complementares","h",0.501,"Sinapi 90830 Adaptada",13.167000000000002,"Sinapi 88316",null,null,{"$f":"ROUND(H2224*F2224,2)","v":6.6}]
[null,null,"",null,null,null,null,""]
["SF-00370","Fechadura para porta externa maçaneta em barra","",null,"un",null,"Sinapi 90830 Adaptada",""]
[null,null,"",null,null,null,null,""]
[null,null,"SF-00370","Fechadura para porta externa, com maçaneta em formato de barra, confeccionada em zamac com acabamento cromado. Ref.: MZ 270 EXT Standard – Linha Standard – Papaiz","un ",1,"Sinapi 90830 Adaptada",109.2,"Pesquisa de Preços",null,{"$f":"ROUND(H2228*F2228,2)","v":109.2},null,{"$f":"SUM(J2228:L2230)","v":133.88}]
[null,null,"SF-00370","Carpinteiro de esquadria com encargos complementares","h",1.002,"Sinapi 90830 Adaptada",18.045000000000002,"Sinapi 88261",null,null,{"$f":"ROUND(H2229*F2229,2)","v":18.079999999999998}]
[null,null,"SF-00370","Servente com Encargos Complementares","h",0.501,"Sinapi 90830 Adaptada",13.167000000000002,"Sinapi 88316",null,null,{"$f":"ROUND(H2230*F2230,2)","v":6.6}]
[null,null,"",null,null,null,null,""]
["SF-00371","Fechadura para porta interna maçaneta tubular","",null,"un",null,"Sinapi 90830 Adaptada",""]
[null,null,"",null,null,null,null,""]
[null,null,{"$f":"IF(AND(D2234<>\"\",A2232=\"\"),C2233,IF(D2234<>\"\",A2232,\"\"))","v":"SF-00371"},"Fechadura para porta interna, com acabamento cromado brilhante, maçaneta tipo pera, com pino giratório central. Ref.: CJ 030 (externo) – Linha Professionel – La Fonte","un ",1,"Sinapi 90830 Adaptada",632.99,"Pesquisa de Preços",null,{"$f":"ROUND(H2234*F2234,2)","v":632.99},null,{"$f":"SUM(J2234:L2236)","v":657.67000000000007}]
[null,null,"SF-00371","Carpinteiro de esquadria com encargos complementares","h",1.002,"Sinapi 90830",18.045000000000002,"Sinapi 88261",null,null,{"$f":"ROUND(H2235*F2235,2)","v":18.079999999999998}]
[null,null,"SF-00371","Servente com Encargos Complementares","h",0.501,"Sinapi 90830",13.167000000000002,"Sinapi 88316",null,null,{"$f":"ROUND(H2236*F2236,2)","v":6.6}]
[null,null,"",null,null,null,null,""]
["SF-00372","Instalação de ferragens de porta reaproveitadas","",null,"m",null,"Sinapi 90830 Adaptada",""]
[null,null,"",null,null,null,null,""]
[null,null,"SF-00372","Carpinteiro de esquadria com encargos complementares","h",1.002,"Sinapi 90830",18.045000000000002,"Sinapi 88261",null,null,{"$f":"ROUND(H2240*F2240,2)","v":18.079999999999998},{"$f":"SUM(J2240:L2241)","v":24.68}]
[null,null,"SF-00372","Servente com Encargos Complementares","h",0.501,"Sinapi 90830",13.167000000000002,"Sinapi 88316",null,null,{"$f":"ROUND(H2241*F2241,2)","v":6.6}]
[null,null,"",null,null,null,null,""]
["SF-00373","Mola hidráulica aérea ","",null,"un",null,"Orse 01778 Adaptada",""]
[null,null,"",null,null,null,null,""]
[null,null,"SF-00373","Marceneiro com encargos complementares","h",1,"Orse 01778 Adaptada",18.333000000000002,"Sinapi 88273",null,null,{"$f":"ROUND(H2245*F2245,2)","v":18.329999999999998},{"$f":"SUM(J2245:L2246)","v":137.17000000000002}]
[null,null,"SF-00373","Mola aérea para fechamento automático de portas com regulagem da velocidade de fechamento. Ref.: Mola automática – Modelo 453 - Coimbra","un",1,"Orse 01778 Adaptada",118.84,"Pesquisa de Preços",null,{"$f":"ROUND(H2246*F2246,2)","v":118.84}]
[null,null,"",null,null,null,null,""]
["SF-00374","Pivô em latão com acabamento cromado para portas pivotantes ","",null,"un",null,"Senado Federal",""]
[null,null,"",null,null,null,null,""]
[null,null,"SF-00374","Marceneiro com encargos complementares","h",{"$f":"1/2","v":0.5},"Senado Federal",18.333000000000002,"Sinapi 88273",null,null,{"$f":"ROUND(H2250*F2250,2)","v":9.17},{"$f":"SUM(J2250:L2251)","v":100.67}]
[null,null,"SF-00374","Pivô em latão com acabamento cromado para portas pivotantes até 150 kg. Conjunto completo composto de superior macho e fêmea e inferior macho e fêmea. Ref.: Pivô Strong 150 - La fonte","un",1,"Senado Federal",91.5,"Pesquisa de Preços",null,{"$f":"ROUND(H2251*F2251,2)","v":91.5}]
[null,null,"",null,null,null,null,""]
["SF-00375","Cabo de dados tipo UTP, tipo LSZH, categoria 6","",null,"m",null,"Sinapi 98295 Adaptada",""]
[null,null,"",null,null,null,null,""]
[null,null,"SF-00375","Auxiliar de eletricista com encargos complementares","h",2.8E-3,"Sinapi 98295 Adaptada",14.048999999999999,"Sinapi 88247",null,null,{"$f":"ROUND(H2255*F2255,2)","v":0.04},{"$f":"SUM(J2255:L2257)","v":2.2999999999999998}]
[null,null,"SF-00375","Eletricista com encargos complementares","h",2.8E-3,"Sinapi 98295 Adaptada",18.297000000000001,"Sinapi 88264",null,null,0.05]
[null,null,"SF-00375","Cabo de dados tipo UTP, tipo LSZH, categoria 6. Ref.: Furukawa Gigalan Max Green 23400182, Commscope 12427070-6","m",1,"Sinapi 98295 Adaptada",2.21,"Pesquisa de Preços",null,{"$f":"ROUND(H2257*F2257,2)","v":2.21}]
[null,null,"",null,null,null,null,""]
["SF-00376","Módulo (tomada) de rede RJ45, categoria 6, com conectorização e certificação","",null,"un",null,"Sinapi 98307 Adaptada",""]
[null,null,"",null,null,null,null,""]
[null,null,"SF-00376","Tampa p/ conector /RJ45. ref.: Schneider Electric PRM47761 (padrão Keystone), Schneider Electric PRM47771 (padrão AMP)","un ",1,"Senado Federal",6.25,"Pesquisa de Preços",null,{"$f":"ROUND(H2261*F2261,2)","v":6.25},null,{"$f":"SUM(J2261:L2265)","v":68.010000000000005}]
[null,null,"SF-00376","Módulo RJ 45 - CAT 6. Ref.: Furukawa Electric Conector Fêmea Gigalan CAT 6, Commscope 1375055-2","un ",1,"Senado Federal",27,"Pesquisa de Preços",null,27]
[null,null,"SF-00376","Certificação de ponto de rede","un ",1,"Senado Federal",21.42,"Pesquisa de Preços",null,{"$f":"ROUND(H2263*F2263,2)","v":21.42}]
[null,null,"SF-00376","Auxiliar de eletricista com encargos complementares","h",{"$f":"0.2062*2","v":0.41239999999999999},"Sinapi 98307 Adaptada",14.048999999999999,"Sinapi 88247",null,null,{"$f":"ROUNDUP(H2264*F2264,2)","v":5.8}]
[null,null,"SF-00376","Eletricista com encargos complementares","h",{"$f":"0.2062*2","v":0.41239999999999999},"Sinapi 98307 Adaptada",18.297000000000001,"Sinapi 88264",null,null,{"$f":"ROUNDDOWN(H2265*F2265,2)","v":7.54}]
[null,null,"",null,null,null,null,""]
["SF-00377","Painel de distribuição (patch panel) de 24 portas, categoria 6","",null,"un",null,"Sinapi 98302 Adaptada",""]
[null,null,"",null,null,null,null,""]
[null,null,"SF-00377","Auxiliar de eletricista com encargos complementares","h",{"$f":"6.2007 - 24*0.2062","v":1.2519},"Sinapi 98302",14.048999999999999,"Sinapi 88247",null,null,{"$f":"ROUND(H2269*F2269,2)","v":17.59},{"$f":"SUM(J2269:L2271)","v":451.49}]
[null,null,"SF-00377","Eletricista com encargos complementares","h",{"$f":"6.2007 - 24*0.2062","v":1.2519},"Sinapi 98302",18.297000000000001,"Sinapi 88264",null,null,22.91]
[null,null,"SF-00377","Painel de distribuição (patch panel) de 24 portas, categoria 6. Ref.: Furukawa Patch Panel Gigalan CAT 6 – 24 Portas, Commscope 1375014-2","un",1,"Sinapi 98302 Adaptada",410.99,"Pesquisa de Preços",null,{"$f":"ROUND(H2271*F2271,2)","v":410.99}]
[null,null,"",null,null,null,null,""]
["SF-00378","Cabo de telefonia tipo CCI 50x2","",null,"m",null,"Sinapi 98262 Adaptada",""]
[null,null,"",null,null,null,null,""]
[null,null,"SF-00378","Auxiliar de eletricista com encargos complementares","h",6.4100000000000004E-2,"Sinapi 98262",14.048999999999999,"Sinapi 88247",null,null,{"$f":"ROUND(H2275*F2275,2)","v":0.9},{"$f":"SUM(J2275:L2277)","v":2.6399999999999997}]
[null,null,"SF-00378","Eletricista com encargos complementares","h",6.4100000000000004E-2,"Sinapi 98262",18.297000000000001,"Sinapi 88264",null,null,{"$f":"ROUND(H2276*F2276,2)","v":1.17}]
[null,null,"SF-00378","Cabo de telefonia tipo CCI 50x2. Ref.: Multitoc CCI 50x2, Induscabos Cabos Telefônicos Interno CCI 50-2, GP Cabos Cabo CCI, CobreKabos CCI 50","m",1.05,"Sinapi 98262 Adaptada",0.54,"Pesquisa de Preços",null,{"$f":"ROUND(H2277*F2277,2)","v":0.56999999999999995}]
[null,null,"",null,null,null,null,""]
["SF-00379","Módulo (tomada) de rede RJ45, para telefonia","",null,"un",null,"Sinapi 72337 Adaptada",""]
[null,null,"",null,null,null,null,""]
[null,null,"SF-00379","Tampa p/ conector /RJ45. ref.: Schneider Electric PRM47761 (padrão Keystone), Schneider Electric PRM47771 (padrão AMP)","un ",1,"Senado Federal",6.25,"Pesquisa de Preços",null,{"$f":"ROUND(H2281*F2281,2)","v":6.25},null,{"$f":"SUM(J2281:L2284)","v":37.82}]
[null,null,"SF-00379","Tomada RJ45, 8 fios, CAT 5E (apenas modulo)","un ",1,"Senado Federal",24.903000000000002,"Sinapi 38104",null,{"$f":"ROUND(H2282*F2282,2)","v":24.9}]
[null,null,"SF-00379","Auxiliar de eletricista com encargos complementares","h",0.20619999999999999,"Sinapi 98307",14.048999999999999,"Sinapi 88247",null,null,{"$f":"ROUND(H2283*F2283,2)","v":2.9}]
[null,null,"SF-00379","Eletricista com encargos complementares","h",0.20619999999999999,"Sinapi 98307",18.297000000000001,"Sinapi 88264",null,null,{"$f":"ROUND(H2284*F2284,2)","v":3.77}]
[null,null,"",null,null,null,null,""]
["SF-00380","Grelha para retorno para portas, divisórias e paredes 525x325 mm","",null,"un",null,"Pini 19.104.000804.SER Adaptada",""]
[null,null,"",null,null,null,null,""]
[null,null,"SF-00380","Ajudante de operação em geral com encargos complementares","h",3.5,"Pini 19.104.000804.SER",14.103,"Sinapi 88241",null,null,{"$f":"ROUNDUP(H2288*F2288,2)","v":49.37},{"$f":"SUM(J2288:L2290)","v":347.37}]
[null,null,"SF-00380","Montador eletromecânico com encargos complementares","h",3.5,"Pini 19.104.000804.SER",18.971999999999998,"Sinapi 88279",null,null,{"$f":"ROUND(H2289*F2289,2)","v":66.400000000000006}]
[null,null,"SF-00380","Grelha para retorno para portas, divisórias e paredes 525x325 mm, Ref. Trox AGS-T","un ",1,"Pini 19.104.000804.SER",231.6,"Pesquisa de Preços",null,{"$f":"ROUND(H2290*F2290,2)","v":231.6}]
[null,null,""]

{"sheet":"Composições Auxiliares","index":2,"n_rows":194,"n_cols":12,"rows_kept":194,"cut":false,"hidden":false,"merged":[[18,0,23,0],[35,0,45,0],[2,1,2,11],[1,1,1,11],[0,1,0,11],[12,0,17,0],[5,0,11,0],[46,0,55,0],[24,0,28,0],[29,0,34,0],[105,0,110,0],[111,0,116,0],[56,0,64,0],[65,0,72,0],[73,0,79,0],[80,0,85,0],[86,0,92,0],[93,0,98,0],[99,0,104,0],[187,0,194,0],[117,0,122,0],[123,0,128,0],[129,0,134,0],[141,0,146,0],[153,0,160,0],[173,0,178,0],[135,0,140,0],[161,0,170,0],[147,0,152,0],[179,0,186,0],[171,0,172,11]]}
["SENADO FEDERAL","Ata de Registro de Preços para Reformas no SF - 2018/2019"]
["SECRETARIA DE INFRAESTRUTURA","COMPOSIÇÕES AUXILIARES"]
["SERVIÇO DE ORÇAMENTOS","Setembro de 2018 (data-base: Sinapi ago/2018, Pini ago/2018 e Orse jul/2018)"]
[]
["Discriminação",null,"Especificação do Serviço","Unidade","Coeficiente","Fonte do Coeficiente","Preço","Fonte do Preço","Composição Auxiliar","MAT.","M.O.","Total"]
["Martelete ou rompedor pneumático manual, 28 kg, com silenciador - CHP diurno. AF_07/2016",null,null,"CHP",null,{"$f":"F8","v":"Sinapi 5795"}]
[]
[null,null,"Martelete ou rompedor pneumático manual, 28 kg, com silenciador - manutenção. af_07/2016","H",1,"Sinapi 5795",0.95400000000000007,"Sinapi 53863",null,{"$f":"ROUND(G8*E8,2)","v":0.95},null,{"$f":"SUM(I8:K11)","v":16.420000000000002}]
[null,null,"Operador de martelete ou marteleteiro com encargos complementares","H",1,"Sinapi 5795",14.526000000000002,"Sinapi 88298",null,null,{"$f":"ROUND(G9*E9,2)","v":14.53}]
[null,null,"Martelete ou rompedor pneumático manual, 28 kg, com silenciador - depreciação. af_07/2016","H",1,"Sinapi 5795",0.76500000000000001,"Sinapi 95114",null,{"$f":"ROUND(G10*E10,2)","v":0.77}]
[null,null,"Martelete ou rompedor pneumático manual, 28 kg, com silenciador - juros. af_07/2016","H",1,"Sinapi 5795",0.17100000000000001,"Sinapi 95115",null,{"$f":"ROUND(G11*E11,2)","v":0.17}]
[null,null,""]
["Martelete ou rompedor pneumático manual, 28 kg, com silenciador - CHI diurno. AF_07/2016",null,"","CHI",null,{"$f":"F15","v":"Sinapi 5952"}]
[null,null,""]
[null,null,"Operador de martelete ou marteleteiro com encargos complementares","H",1,"Sinapi 5952",14.526000000000002,"Sinapi 88298",null,null,{"$f":"ROUND(G15*E15,2)","v":14.53},{"$f":"SUM(I15:K17)","v":15.459999999999999}]
[null,null,"Martelete ou rompedor pneumático manual, 28 kg, com silenciador - depreciação. af_07/2016","H",1,"Sinapi 5952",0.76500000000000001,"Sinapi 95114",null,{"$f":"ROUNDDOWN(G16*E16,2)","v":0.76}]
[null,null,"Martelete ou rompedor pneumático manual, 28 kg, com silenciador - juros. af_07/2016","H",1,"Sinapi 5952",0.17100000000000001,"Sinapi 95115",null,0.17]
[null,null,""]
["Argamassa traço 1:3 (cimento e areia média), preparo manual. AF_08/2014",null,"","M3",null,{"$f":"F21","v":"Sinapi 88629"}]
[null,null,""]
[null,null,"Areia media - posto jazida/fornecedor (retirado na jazida, sem transporte)","M3",1.1499999999999999,"Sinapi 88629",79.875,"Sinapi 370",null,{"$f":"ROUND(G21*E21,2)","v":91.86},null,{"$f":"SUM(I21:K23)","v":366.43999999999994}]
[null,null,"Cimento Portland composto CP II-32","KG",441.51,"Sinapi 88629",0.36899999999999999,"Sinapi 1379",null,162.91999999999999]
[null,null,"Servente com encargos complementares","H",8.48,"Sinapi 88629",13.167000000000002,"Sinapi 88316",null,null,{"$f":"ROUND(G23*E23,2)","v":111.66}]
[null,null,""]
["Fixação utilizando parafuso e bucha de nylon, somente mão de obra. af_10/2016",null,"","UN.",null,{"$f":"F27","v":"Sinapi 95541"}]
[null,null,""]
[null,null,"Auxiliar de encanador ou bombeiro hidráulico com encargos complementares","H",2.2700000000000001E-2,"Sinapi 95541",13.977,"Sinapi 88248",null,null,{"$f":"ROUND(G27*E27,2)","v":0.32},{"$f":"SUM(I27:K28)","v":3.25}]
[null,null,"Encanador ou bombeiro hidráulico com encargos complementares","H",0.16209999999999999,"Sinapi 95541",18.081,"Sinapi 88267",null,null,2.93]
[null,null,""]
["Fixação de tubos horizontais de PVC, CPVC ou cobre diâmetros menores ou iguais a 40 mm ou eletrocalhas até 150mm de largura, com abraçadeira metálica rígida tipo d 1/2\u0094, fixada em perfilado em laje. af_05/2015",null,"","UN.",null,{"$f":"F32","v":"Sinapi 91170"}]
[null,null,""]
[null,null,"Abracadeira em aco para amarracao de eletrodutos, tipo D, com 1/2\" e parafuso de fixacao","UN",0.65,"Sinapi 91170",0.80100000000000005,"Sinapi 392",null,{"$f":"ROUNDUP(G32*E32,2)","v":0.53},null,{"$f":"SUM(I32:K34)","v":1.92}]
[null,null,"Auxiliar de encanador ou bombeiro hidráulico com encargos complementares","H",0.01,"Sinapi 91170",13.977,"Sinapi 88248",null,null,{"$f":"ROUND(G33*E33,2)","v":0.14000000000000001}]
[null,null,"Encanador ou bombeiro hidráulico com encargos complementares","H",6.9000000000000006E-2,"Sinapi 91170",18.081,"Sinapi 88267",null,null,{"$f":"ROUNDUP(G34*E34,2)","v":1.25}]
[null,null,""]
["Fabricação de fôrma para vigas, em chapa de madeira compensada resinada, E = 17 mm. AF_12/2015",null,"","M2",null,{"$f":"F38","v":"Sinapi 92265"}]
[null,null,""]
[null,null,"Chapa de madeira compensada resinada para forma de concreto, de *2,2 x 1,1* m, e = 17 mm","M2",1.19,"Sinapi 92265",21.797999999999998,"Sinapi 1358",null,{"$f":"ROUNDDOWN(G38*E38,2)","v":25.93},null,{"$f":"SUM(I38:K45)","v":59.76}]
[null,null,"Peca de madeira nativa / regional 7,5 x 7,5cm (3x3) nao aparelhada (p/forma)","M",0.16200000000000001,"Sinapi 92265",4.6800000000000006,"Sinapi 4491",null,{"$f":"ROUNDDOWN(G39*E39,2)","v":0.75}]
[null,null,"Peca de madeira nativa/regional 2,5 x 7,0 cm (sarrafo-p/forma)","M",7.734,"Sinapi 92265",0.64800000000000002,"Sinapi 4517",null,5.01]
[null,null,"Prego de aco polido com cabeca 17 x 21 (2 x 11)","KG",0.155,"Sinapi 92265",9.4770000000000003,"Sinapi 5068",null,1.46]
[null,null,"Ajudante de carpinteiro com encargos complementares","H",0.222,"Sinapi 92265",15.065999999999999,"Sinapi 88239",null,null,{"$f":"ROUNDDOWN(G42*E42,2)","v":3.34}]
[null,null,"Carpinteiro de formas com encargos complementares","H",1.111,"Sinapi 92265",18.009,"Sinapi 88262",null,null,{"$f":"ROUNDDOWN(G43*E43,2)","v":20}]
[null,null,"Serra circular de bancada com motor elétrico potência de 5HP, com coifa para disco 10\" - CHP diurno. af_08/2015","CHP",5.3999999999999999E-2,"Sinapi 92265",15.803999999999998,"Sinapi 91692",{"$f":"ROUND(G44*E44,2)","v":0.85}]
[null,null,"Serra circular de bancada com motor elétrico potência de 5HP, com coifa para disco 10\" - CHI diurno. af_08/2015","CHI",0.16900000000000001,"Sinapi 92265",14.319000000000001,"Sinapi 91693",{"$f":"ROUND(G45*E45,2)","v":2.42}]
[null,null,""]
["Fabricação de escoras de viga do tipo garfo, em madeira. af_12/2015",null,"","M",null,{"$f":"F49","v":"Sinapi 92272"}]
[null,null,""]
[null,null,"Chapa de madeira compensada plastificada para forma de concreto, de 2,20 x 1,10 m, e = 18 mm","M2",0.126,"Sinapi 92272",31.005000000000003,"Sinapi 1345",null,{"$f":"ROUND(G49*E49,2)","v":3.91},null,{"$f":"SUM(I49:K55)","v":18.82}]
[null,null,"Peca de madeira nativa / regional 7,5 x 7,5cm (3x3) nao aparelhada (p/forma)","M",2.27,"Sinapi 92272",4.6800000000000006,"Sinapi 4491",null,10.62]
[null,null,"Prego de aco polido com cabeca 17 x 21 (2 x 11)","KG",1.7000000000000001E-2,"Sinapi 92272",9.4770000000000003,"Sinapi 5068",null,0.16]
[null,null,"Ajudante de carpinteiro com encargos complementares","H",3.4000000000000002E-2,"Sinapi 92272",15.065999999999999,"Sinapi 88239",null,null,{"$f":"ROUND(G52*E52,2)","v":0.51}]
[null,null,"Carpinteiro de formas com encargos complementares","H",0.17199999999999999,"Sinapi 92272",18.009,"Sinapi 88262",null,null,3.1]
[null,null,"Serra circular de bancada com motor elétrico potência de 5HP, com coifa para disco 10\" - CHP diurno. af_08/2015","CHP",0.02,"Sinapi 92272",15.803999999999998,"Sinapi 91692",{"$f":"ROUND(G54*E54,2)","v":0.32}]
[null,null,"Serra circular de bancada com motor elétrico potência de 5HP, com coifa para disco 10\" - CHI diurno. af_08/2015","CHI",1.4E-2,"Sinapi 92272",14.319000000000001,"Sinapi 91693",{"$f":"ROUND(G55*E55,2)","v":0.2}]
[null,null,""]
["Argamassa Traço 1:2:8 (Cimento, Cal E Areia Média) Para Emboço/Massa Única/Assentamento De Alvenaria De Vedação, Preparo Mecânico Com Betoneira 400 L. Af_06/2014",null,"","M3",null,{"$f":"F59","v":"Sinapi 87292"}]
[null,null,""]
[null,null,"Areia media - posto jazida/fornecedor (retirado na jazida, sem transporte)","M3",1.29,"Sinapi 87292",79.875,"Sinapi 370",null,{"$f":"ROUND(G59*E59,2)","v":103.04},null,{"$f":"SUM(I59:K64)","v":354.81000000000006}]
[null,null,"Cal hidratada CH-I para argamassas","KG",193.7,"Sinapi 87292",0.60300000000000009,"Sinapi 1106",null,116.8]
[null,null,"Cimento Portland composto CP II-32","KG",185.63,"Sinapi 87292",0.36899999999999999,"Sinapi 1379",null,68.5]
[null,null,"Operador de betoneira estacionária/misturador com encargos complementares","H",4.75,"Sinapi 87292",13.617000000000001,"Sinapi 88377",null,null,{"$f":"ROUND(G62*E62,2)","v":64.680000000000007}]
[null,null,"Betoneira capacidade nominal de 400 L, capacidade de mistura 280 L, motor elétrico trifásico potência de 2 cv, sem carregador - CHP diurno. af_10/2014","CHP",1.1100000000000001,"Sinapi 87292",0.93600000000000005,"Sinapi 88830",null,{"$f":"ROUND(G63*E63,2)","v":1.04}]
[null,null,"Betoneira capacidade nominal de 400 L, capacidade de mistura 280 L, motor elétrico trifásico potência de 2 cv, sem carregador - CHI diurno. af_10/2014","CHI",3.64,"Sinapi 87292",0.20700000000000002,"Sinapi 88831",null,{"$f":"ROUND(G64*E64,2)","v":0.75}]
[null,null,""]
["Contrapiso em argamassa traço 1:4 (cimento e areia), preparo mecânico com betoneira 400 l, aplicado em áreas secas sobre laje, aderido, espessura 3cm. AF_06/2014",null,"","M2",null,{"$f":"F68","v":"Sinapi 87630"}]
[null,null,""]
[null,null,"Cimento Portland composto CP II-32","KG",0.5,"Sinapi 87630",0.36899999999999999,"Sinapi 1379",null,{"$f":"ROUND(G68*E68,2)","v":0.18},null,{"$f":"SUM(I68:K72)","v":27.07}]
[null,null,"Aditivo adesivo liquido para argamassas de revestimentos cimenticios","L",0.435,"Sinapi 87630",7.7670000000000012,"Sinapi 7334",null,3.38]
[null,null,"Argamassa traço 1:4 (cimento e areia média) para contrapiso, preparo mecânico com betoneira 400 L. af_06/2014","M3",4.3099999999999999E-2,"Sinapi 87630",356.44499999999999,"Sinapi 87301",null,15.36]
[null,null,"Pedreiro com encargos complementares","H",0.33,"Sinapi 87630",18.117000000000001,"Sinapi 88309",null,null,{"$f":"ROUND(G71*E71,2)","v":5.98}]
[null,null,"Servente com encargos complementares","H",0.16500000000000001,"Sinapi 87630",13.167000000000002,"Sinapi 88316",null,null,{"$f":"ROUND(G72*E72,2)","v":2.17}]
[null,null,""]
["Reboco com argamassa pre-fabricada, espessura 0,5cm, preparo mecanico da argamassa",null,"","M2",null,{"$f":"F76","v":"Sinapi 84027"}]
[null,null,""]
[null,null,"Cimento Portland composto CP II-32","KG",1,"Sinapi 84027",0.36899999999999999,"Sinapi 1379",null,{"$f":"ROUND(G76*E76,2)","v":0.37},null,{"$f":"SUM(I76:K79)","v":27.22}]
[null,null,"Pedreiro com encargos complementares","H",0.8,"Sinapi 84027",18.117000000000001,"Sinapi 88309",null,null,{"$f":"ROUND(G77*E77,2)","v":14.49}]
[null,null,"Servente com encargos complementares","H",0.8,"Sinapi 84027",13.167000000000002,"Sinapi 88316",null,null,{"$f":"ROUND(G78*E78,2)","v":10.53}]
[null,null,"Argamassa traço 1:3 (cimento e areia média), preparo manual. af_08/2014","M3",5.0000000000000001E-3,"Sinapi 84027",366.42600000000004,"Sinapi 88629",null,{"$f":"ROUND(G79*E79,2)","v":1.83}]
[null,null,""]
["Argamassa traço 1:3 (cimento e areia grossa) para chapisco convencional, preparo manual. AF_06/2014",null,"","M3",null,{"$f":"F83","v":"Sinapi 87377"}]
[null,null,""]
[null,null,"Areia grossa - posto jazida/fornecedor (retirado na jazida, sem transporte)","M3",1.05,"Sinapi 87377",72,"Sinapi 367",null,{"$f":"ROUND(G83*E83,2)","v":75.599999999999994},null,{"$f":"SUM(I83:K85)","v":366.99}]
[null,null,"Cimento Portland composto CP II-32","KG",401.09,"Sinapi 87377",0.36899999999999999,"Sinapi 1379",null,{"$f":"ROUND(G84*E84,2)","v":148}]
[null,null,"Servente com encargos complementares","H",10.89,"Sinapi 87377",13.167000000000002,"Sinapi 88316",null,null,{"$f":"ROUND(G85*E85,2)","v":143.38999999999999}]
[null,null,""]
["Argamassa industrializada para chapisco colante, preparo com misturador de eixo horizontal de 300 kg. AF_06/2014",null,"","M3",null,{"$f":"F89","v":"Sinapi 87396"}]
[null,null,""]
[null,null,"Argamassa industrializada para chapisco colante","KG",1991.07,"Sinapi 87396",1.2150000000000001,"Sinapi 37553",null,{"$f":"ROUND(G89*E89,2)","v":2419.15},null,{"$f":"SUM(I89:K92)","v":2496.6600000000003}]
[null,null,"Operador de betoneira estacionária/misturador com encargos complementares","H",5.29,"Sinapi 87396",13.617000000000001,"Sinapi 88377",null,null,{"$f":"ROUND(G90*E90,2)","v":72.03}]
[null,null,"Misturador de argamassa, eixo horizontal, capacidade de mistura 300 kg, motor elétrico potência 5 cv - CHP diurno. af_06/2014","CHP",1.23,"Sinapi 87396",2.5830000000000002,"Sinapi 88386",null,{"$f":"ROUND(G91*E91,2)","v":3.18}]
[null,null,"Misturador de argamassa, eixo horizontal, capacidade de mistura 300 kg, motor elétrico potência 5 cv - CHI diurno. af_06/2014","CHI",4.0599999999999996,"Sinapi 87396",0.56700000000000006,"Sinapi 88392",null,{"$f":"ROUND(G92*E92,2)","v":2.2999999999999998}]
[null,null,""]
["Argamassa traço 1:4 (cimento e areia média) para contrapiso, preparo manual. AF_06/2014",null,"","M3",null,{"$f":"F96","v":"Sinapi 87373"}]
[null,null,""]
[null,null,"Areia media - posto jazida/fornecedor (retirado na jazida, sem transporte)","M3",1.51,"Sinapi 87373",79.875,"Sinapi 370",null,{"$f":"ROUND(G96*E96,2)","v":120.61},null,{"$f":"SUM(I96:K98)","v":432.42999999999995}]
[null,null,"Cimento Portland composto CP II-32","KG",435.03,"Sinapi 87373",0.36899999999999999,"Sinapi 1379",null,160.53]
[null,null,"Servente com encargos complementares","H",11.49,"Sinapi 87373",13.167000000000002,"Sinapi 88316",null,null,{"$f":"ROUND(G98*E98,2)","v":151.29}]
[null,null,""]
["Argamassa traço 1:4 (cimento e areia média), preparo manual. AF_08/2014",null,"","M3",null,{"$f":"F102","v":"Sinapi 88631"}]
[null,null,""]
[null,null,"Areia media - posto jazida/fornecedor (retirado na jazida, sem transporte)","M3",1.23,"Sinapi 88631",79.875,"Sinapi 370",null,{"$f":"ROUND(G102*E102,2)","v":98.25},null,{"$f":"SUM(I102:K104)","v":342.36}]
[null,null,"Cimento Portland composto CP II-32","KG",355.04,"Sinapi 88631",0.36899999999999999,"Sinapi 1379",null,131.01]
[null,null,"Servente com encargos complementares","H",8.59,"Sinapi 88631",13.167000000000002,"Sinapi 88316",null,null,{"$f":"ROUND(G104*E104,2)","v":113.1}]
[null,null,""]
["Fixação de tubos verticais de PPR diâmetros menores ou iguais a 40 mm com abraçadeira metálica rígida tipo D 1/2\", fixada em perfilado em alvenaria. af_05/2015",null,"","M",null,{"$f":"F108","v":"Sinapi 91173"}]
[null,null,""]
[null,null,"Abracadeira em aco para amarracao de eletrodutos, tipo D, com 1/2\" e parafuso de fixacao","UN",0.33300000000000002,"Sinapi 91173",0.80100000000000005,"Sinapi 392",null,{"$f":"ROUND(G108*E108,2)","v":0.27},null,{"$f":"SUM(I108:K110)","v":0.97}]
[null,null,"Auxiliar de encanador ou bombeiro hidráulico com encargos complementares","H",5.0000000000000001E-3,"Sinapi 91173",13.977,"Sinapi 88248",null,null,{"$f":"ROUND(G109*E109,2)","v":7.0000000000000007E-2}]
[null,null,"Encanador ou bombeiro hidráulico com encargos complementares","H",3.5000000000000003E-2,"Sinapi 91173",18.081,"Sinapi 88267",null,null,{"$f":"ROUND(G110*E110,2)","v":0.63}]
[null,null,""]
["Luva de emenda para eletroduto, aço galvanizado, DN 20 mm (3/4''), aparente, instalada em parede - fornecimento e instalação. af_11/2016_p",null,"","UN.",null,{"$f":"F114","v":"Sinapi 95757"}]
[null,null,""]
[null,null,"Luva para eletroduto, em aco galvanizado eletrolitico, diametro de 20 mm (3/4\")","UN",1,"Sinapi 95757",1.782,"Sinapi 2637",null,{"$f":"ROUND(G114*E114,2)","v":1.78},null,{"$f":"SUM(I114:K116)","v":7.6899999999999995}]
[null,null,"Auxiliar de eletricista com encargos complementares","H",0.1827,"Sinapi 95757",14.048999999999999,"Sinapi 88247",null,null,{"$f":"ROUND(G115*E115,2)","v":2.57}]
[null,null,"Eletricista com encargos complementares","H",0.1827,"Sinapi 95757",18.297000000000001,"Sinapi 88264",null,null,3.34]
[null,null,""]
["Luva de emenda para eletroduto, aço galvanizado, DN 25 mm (1''), aparente, instalada em parede - fornecimento e instalação. af_11/2016_p",null,"","UN.",null,{"$f":"F120","v":"Sinapi 95758"}]
[null,null,""]
[null,null,"Luva para eletroduto, em aco galvanizado eletrolitico, diametro de 25 mm (1\")","UN",1,"Sinapi 95758",2.0699999999999998,"Sinapi 2638",null,{"$f":"ROUND(G120*E120,2)","v":2.0699999999999998},null,{"$f":"SUM(I120:K122)","v":8.65}]
[null,null,"Auxiliar de eletricista com encargos complementares","H",0.20330000000000001,"Sinapi 95758",14.048999999999999,"Sinapi 88247",null,null,{"$f":"ROUND(G121*E121,2)","v":2.86}]
[null,null,"Eletricista com encargos complementares","H",0.20330000000000001,"Sinapi 95758",18.297000000000001,"Sinapi 88264",null,null,3.72]
[null,null,""]
["Luva de emenda para eletroduto, aço galvanizado, DN 32 mm (1 1/4''), aparente, instalada em parede - fornecimento e instalação. af_11/2016_p",null,"","UN.",null,{"$f":"F126","v":"Sinapi 95759"}]
[null,null,""]
[null,null,"Luva para eletroduto, em aco galvanizado eletrolitico, diametro de 32 mm (1 1/4\")","UN",1,"Sinapi 95759",3.6720000000000002,"Sinapi 2639",null,{"$f":"ROUND(G126*E126,2)","v":3.67},null,{"$f":"SUM(I126:K128)","v":11.18}]
[null,null,"Auxiliar de eletricista com encargos complementares","H",0.23219999999999999,"Sinapi 95759",14.048999999999999,"Sinapi 88247",null,null,{"$f":"ROUND(G127*E127,2)","v":3.26}]
[null,null,"Eletricista com encargos complementares","H",0.23219999999999999,"Sinapi 95759",18.297000000000001,"Sinapi 88264",null,null,4.25]
[null,null,""]
["Luva de emenda para eletroduto, aço galvanizado, DN 40 mm (1 1/2''), aparente, instalada em parede - fornecimento e instalação. af_11/2016_p",null,"","UN.",null,{"$f":"F132","v":"Sinapi 95760"}]
[null,null,""]
[null,null,"Luva para eletroduto, em aco galvanizado eletrolitico, diametro de 40 mm (1 1/2\")","UN",1,"Sinapi 95760",5.319,"Sinapi 2644",null,{"$f":"ROUND(G132*E132,2)","v":5.32},null,{"$f":"SUM(I132:K134)","v":13.9}]
[null,null,"Auxiliar de eletricista com encargos complementares","H",0.2651,"Sinapi 95760",14.048999999999999,"Sinapi 88247",null,null,{"$f":"ROUND(G133*E133,2)","v":3.72}]
[null,null,"Eletricista com encargos complementares","H",0.2651,"Sinapi 95760",18.297000000000001,"Sinapi 88264",null,null,{"$f":"ROUNDUP(G134*E134,2)","v":4.8599999999999994}]
[null,null,""]
["Luva de emenda para eletroduto, aço galvanizado, DN 50 mm (2''), aparente, instalada em parede - fornecimento e instalação. af_11/2016_p",null,"","UN.",null,"Sinapi 95760 Adaptada"]
[null,null,""]
[null,null,"Luva para eletroduto, em aco galvanizado eletrolitico, diametro de 50 mm (2\")","UN",1,"Sinapi 95760",7.4160000000000004,"Sinapi 2643",null,{"$f":"ROUND(G138*E138,2)","v":7.42},null,{"$f":"SUM(I138:K140)","v":15.99}]
[null,null,"Auxiliar de eletricista com encargos complementares","H",0.2651,"Sinapi 95760",14.048999999999999,"Sinapi 88247",null,null,{"$f":"ROUND(G139*E139,2)","v":3.72}]
[null,null,"Eletricista com encargos complementares","H",0.2651,"Sinapi 95760",18.297000000000001,"Sinapi 88264",null,null,4.8499999999999996]
[null,null,""]
["Fixação de tubos verticais de PPR diâmetros maiores que 40 mm e menores ou iguais a 75 mm com abraçadeira metálica rígida tipo D 1 1/2\", fixada em perfilado em alvenaria. af_05/2015",null,"","UN.",null,{"$f":"F144","v":"Sinapi 91174"}]
[null,null,""]
[null,null,"Abracadeira em aco para amarracao de eletrodutos, tipo D, com 1 1/2\" e parafuso de fixacao","UN",0.33300000000000002,"Sinapi 91174",1.6560000000000001,"Sinapi 394",null,{"$f":"ROUND(G144*E144,2)","v":0.55000000000000004},null,{"$f":"SUM(I144:K146)","v":1.8900000000000001}]
[null,null,"Auxiliar de encanador ou bombeiro hidráulico com encargos complementares","H",8.9999999999999993E-3,"Sinapi 91174",13.977,"Sinapi 88248",null,null,{"$f":"ROUND(G145*E145,2)","v":0.13}]
[null,null,"Encanador ou bombeiro hidráulico com encargos complementares","H",6.7000000000000004E-2,"Sinapi 91174",18.081,"Sinapi 88267",null,null,1.21]
[null,null,""]
["Fixação de tubos verticais de PPR diâmetros maiores que 40 mm e menores ou iguais a 75 mm com abraçadeira metálica rígida tipo D 2\", fixada em perfilado em alvenaria. af_05/2015",null,"","UN.",null,"Sinapi 91174 Adaptada"]
[null,null,""]
[null,null,"Abracadeira em aco para amarracao de eletrodutos, tipo D, com 2\" e parafuso de fixacao","UN",0.33300000000000002,"Sinapi 91174",1.8360000000000001,"Sinapi 396",null,{"$f":"ROUND(G150*E150,2)","v":0.61},null,{"$f":"SUM(I150:K152)","v":1.95}]
[null,null,"Auxiliar de encanador ou bombeiro hidráulico com encargos complementares","H",8.9999999999999993E-3,"Sinapi 91174",13.977,"Sinapi 88248",null,null,{"$f":"ROUND(G151*E151,2)","v":0.13}]
[null,null,"Encanador ou bombeiro hidráulico com encargos complementares","H",6.7000000000000004E-2,"Sinapi 91174",18.081,"Sinapi 88267",null,null,1.21]
[null,null,""]
["Aduela / marco / batente para porta de 90x210cm, padrão médio - fornecimento e montagem. AF_08/2015",null,"","UN.",null,{"$f":"F156","v":"Sinapi 90803"}]
[null,null,""]
[null,null,"Batente/ portal/ aduela/ marco macico, e= *3 cm, l= *13 cm, *60 cm a 120* cm x *210 cm,  em cedrinho/ angelim comercial/ eucalipto/ curupixa/ peroba/ cumaru ou equivalente da regiao (nao inclui alizares)","JG",1,"Sinapi 90803",128.322,"Sinapi 183",null,{"$f":"ROUND(G156*E156,2)","v":128.32},null,{"$f":"SUM(I156:K160)","v":208.01999999999998}]
[null,null,"Prego de aco polido com cabeca 12 x 12","KG",1.0800000000000001E-2,"Sinapi 90803",12.482999999999999,"Sinapi 5066",null,{"$f":"ROUND(G157*E157,2)","v":0.13}]
[null,null,"Prego de aco polido com cabeca 18 x 30 (2 3/4 x 10)","KG",2.35E-2,"Sinapi 90803",9.4770000000000003,"Sinapi 5075",null,0.22]
[null,null,"Carpinteiro de esquadria com encargos complementares","H",3.2210000000000001,"Sinapi 90803",18.045000000000002,"Sinapi 88261",null,null,{"$f":"ROUNDUP(G159*E159,2)","v":58.129999999999995}]
[null,null,"Servente com encargos complementares","H",1.611,"Sinapi 90803",13.167000000000002,"Sinapi 88316",null,null,{"$f":"ROUNDUP(G160*E160,2)","v":21.220000000000002}]
[null,null,""]
["Argamassa traço 1:2:9 (cimento, cal e areia média) para emboço/massa única/assentamento de alvenaria de vedação, preparo mecânico com betoneira 600 L. af_06/2014",null,"","M3",null,{"$f":"F164","v":"Sinapi 87294"}]
[null,null,""]
[null,null,"Areia media - posto jazida/fornecedor (retirado na jazida, sem transporte)","M3",1.31,"Sinapi 87294",79.875,"Sinapi 370",null,{"$f":"ROUND(G164*E164,2)","v":104.64},null,{"$f":"SUM(I164:K170)","v":339.64}]
[null,null,"Cal hidratada CH-I para argamassas","KG",174.87,"Sinapi 87294",0.60300000000000009,"Sinapi 1106",null,105.45]
[null,null,"Cimento Portland composto CP II-32","KG",167.58,"Sinapi 87294",0.36899999999999999,"Sinapi 1379",null,61.84]
[null,null,"Servente com encargos complementares","H",0.88,"Sinapi 87294",13.167000000000002,"Sinapi 88316",null,null,{"$f":"ROUND(G167*E167,2)","v":11.59}]
[null,null,"Operador de betoneira estacionária/misturador com encargos complementares","H",3.76,"Sinapi 87294",13.617000000000001,"Sinapi 88377",null,null,{"$f":"ROUND(G168*E168,2)","v":51.2}]
[null,null,"Betoneira capacidade nominal de 600 L, capacidade de mistura 360 L, motor elétrico trifásico potência de 4 cv, sem carregador - CHP diurno. af_11/2014","CHP",0.88,"Sinapi 87294",2.7,"Sinapi 89225",null,{"$f":"ROUND(G169*E169,2)","v":2.38}]
[null,null,"Betoneira capacidade nominal de 600 L, capacidade de mistura 360 L, motor elétrico trifásico potência de 4 cv, sem carregador - CHI diurno. af_11/2014","CHI",2.88,"Sinapi 87294",0.88200000000000001,"Sinapi 89226",null,2.54]
[]
["COMPOSIÇÕES AUXILIARES DAS AUXILIARES"]
[]
["Serra circular de bancada com motor elétrico potência de 5HP, com coifa para disco 10\" - CHI diurno. af_08/2015",null,null,"CHI",null,{"$f":"F176","v":"Sinapi 91693"}]
[]
[null,null,"Operador de máquinas e equipamentos com encargos complementares","H",1,"Sinapi 91693",14.256,"Sinapi 88297",null,null,{"$f":"ROUND(G176*E176,2)","v":14.26},{"$f":"SUM(I176:K178)","v":14.32}]
[null,null,"Serra circular de bancada com motor elétrico potência de 5HP, com coifa para disco 10\" - depreciação. af_08/2015","H",1,"Sinapi 91693",5.3999999999999999E-2,"Sinapi 91688",null,{"$f":"ROUND(G177*E177,2)","v":0.05}]
[null,null,"Serra circular de bancada com motor elétrico potência de 5HP, com coifa para disco 10\" - juros. af_08/2015","H",1,"Sinapi 91693",9.0000000000000011E-3,"Sinapi 91689",null,0.01]
[null,null,""]
["Serra circular de bancada com motor elétrico potência de 5HP, com coifa para disco 10\" - CHP diurno. af_08/2015",null,"","CHP",null,{"$f":"F182","v":"Sinapi 91692"}]
[null,null,""]
[null,null,"Operador de máquinas e equipamentos com encargos complementares","H",1,"Sinapi 91692",14.256,"Sinapi 88297",null,null,{"$f":"ROUND(G182*E182,2)","v":14.26},{"$f":"SUM(I182:K186)","v":15.809999999999999}]
[null,null,"Serra circular de bancada com motor elétrico potência de 5HP, com coifa para disco 10\" - depreciação. af_08/2015","H",1,"Sinapi 91692",5.3999999999999999E-2,"Sinapi 91688",null,{"$f":"ROUND(G183*E183,2)","v":0.05}]
[null,null,"Serra circular de bancada com motor elétrico potência de 5HP, com coifa para disco 10\" - juros. af_08/2015","H",1,"Sinapi 91692",9.0000000000000011E-3,"Sinapi 91689",null,0.01]
[null,null,"Serra circular de bancada com motor elétrico potência de 5HP, com coifa para disco 10\" - manutenção. af_08/2015","H",1,"Sinapi 91692",3.6000000000000004E-2,"Sinapi 91690",null,0.04]
[null,null,"Serra circular de bancada com motor elétrico potência de 5HP, com coifa para disco 10\" - materiais na operação. af_08/2015","H",1,"Sinapi 91692",1.4490000000000001,"Sinapi 91691",null,1.45]
[null,null,""]
["Argamassa traço 1:4 (cimento e areia média) para contrapiso, preparo mecânico com betoneira 400 L. af_06/2014",null,"","M3",null,{"$f":"F190","v":"Sinapi 87301"}]
[null,null,""]
[null,null,"Areia media - posto jazida/fornecedor (retirado na jazida, sem transporte)","M3",1.54,"Sinapi 87301",79.875,"Sinapi 370",null,{"$f":"ROUND(G190*E190,2)","v":123.01},null,{"$f":"SUM(I190:K194)","v":356.45000000000005}]
[null,null,"Cimento Portland composto CP II-32","KG",442.22,"Sinapi 87301",0.36899999999999999,"Sinapi 1379",null,{"$f":"ROUND(G191*E191,2)","v":163.18}]
[null,null,"Operador de betoneira estacionária/misturador com encargos complementares","H",5.0199999999999996,"Sinapi 87301",13.617000000000001,"Sinapi 88377",null,null,{"$f":"ROUND(G192*E192,2)","v":68.36}]
[null,null,"Betoneira capacidade nominal de 400 L, capacidade de mistura 280 L, motor elétrico trifásico potência de 2 cv, sem carregador - CHP diurno. af_10/2014","CHP",1.17,"Sinapi 87301",0.93600000000000005,"Sinapi 88830",null,1.1000000000000001]
[null,null,"Betoneira capacidade nominal de 400 L, capacidade de mistura 280 L, motor elétrico trifásico potência de 2 cv, sem carregador - CHI diurno. af_10/2014","CHI",3.85,"Sinapi 87301",0.20700000000000002,"Sinapi 88831",null,0.8]

{"sheet":"BDI","index":3,"n_rows":47,"n_cols":9,"rows_kept":47,"cut":false,"hidden":false,"merged":[[46,0,46,8],[0,0,0,8],[1,0,1,8],[3,0,3,3],[3,5,3,8],[18,0,18,3],[18,5,18,8],[4,0,5,0],[4,5,5,5]]}
["Ata de Registro de Preços para Reformas no SF - 2018/2019"]
["BENEFÍCIOS E DESPESAS INDIRETAS - BDI"]
[]
["BDI Edificações",null,null,null,null,"BDI mero fornecimento"]
["Componentes do BDI","Cálculo sem CPRB",null,null,null,"Componentes do BDI","Cálculo sem CPRB"]
[null,"(não-desonerado)",null,null,null,null,"(não-desonerado)"]
[null,"% considerado",null,null,null,null,"% considerado"]
["AC",0.04,null,null,null,"AC",1.6899999999999998E-2]
["S+G",8.0000000000000002E-3,null,null,null,"S+G",3.0000000000000001E-3]
["R",1.09E-2,null,null,null,"R",5.5999999999999999E-3]
["DF",0.01,null,null,null,"DF",8.5000000000000006E-3]
["L",6.1600000000000002E-2,null,null,null,"L",3.5000000000000003E-2]
["PIS",6.4999999999999997E-3,null,null,null,"PIS",6.4999999999999997E-3]
["COFINS",0.03,null,null,null,"COFINS",0.03]
["CPRB",0,null,null,null,"CPRB",0]
["ISS",0.02,null,null,null,"ISS",0]
["BDI Edificações",{"$f":"(((1+B8+B9+B10)*(1+B11)*(1+B12))/(1-(B13+B14+B15+B16))-1)","v":0.20335932421833602},null,null,null,"BDI mero fornecimento",{"$f":"(((1+G8+G9+G10)*(1+G11)*(1+G12))/(1-(G13+G14+G15+G16))-1)","v":0.11096454203424999}]
[]
["Referências TCU - BDI Edificações",null,null,null,null,"Referências TCU - BDI mero fornecimento"]
[null,"1º Quartil","Médio","3º Quartil",null,null,"1º Quartil","Médio","3º Quartil"]
["AC",0.03,0.04,5.5E-2,null,"AC",1.4999999999999999E-2,3.4500000000000003E-2,4.4900000000000002E-2]
["S+G",8.0000000000000002E-3,8.0000000000000002E-3,0.01,null,"S+G",3.0000000000000001E-3,4.7999999999999996E-3,8.2000000000000007E-3]
["R",9.7000000000000003E-3,1.2699999999999999E-2,1.2699999999999999E-2,null,"R",5.5999999999999999E-3,8.5000000000000006E-3,8.8999999999999999E-3]
["DF",5.8999999999999999E-3,1.23E-2,1.3899999999999999E-2,null,"DF",8.5000000000000006E-3,8.5000000000000006E-3,1.11E-2]
["L",6.1600000000000002E-2,7.400000000000001E-2,8.9599999999999999E-2,null,"L",3.5000000000000003E-2,5.11E-2,6.2199999999999998E-2]
[]
["BDI",0.2034,0.22120000000000001,0.25,null,"BDI",0.111,0.14019999999999999,0.16800000000000001]
[]
[]
[]
[]
[]
[]
[]
[]
[]
[]
[]
[]
[]
[]
[]
[]
[]
[]
[]
["Fonte: Acórdãos 2.639/2011-TCU-Plenário e 2.622/2013-TCU-Plenário."]