{"text_format":"1","workbook":"xlsx","n_sheets":4,"sheets":["Orçamentária","Composições","Composições Auxiliares","BDI"],"not_rendered":{"charts":0,"images":4,"macros":1,"external_links":0,"defined_names":1009,"comments":1,"pivot_tables":0},"unopened":[],"bounds":{"document_bytes":16777216,"sheet_cells":100000,"rows_first":2000,"rows_last":500,"rows_between":2000,"halvings":0,"cell_chars":16384,"cell_head_chars":4096},"cells_cut":0,"cells_raw":0,"read":"whole","date_system":"1900"}

{"sheet":"Orçamentária","index":0,"n_rows":386,"n_cols":13,"rows_kept":386,"cut":false,"hidden":false,"merged":[[0,1,0,12],[1,1,1,12],[2,1,2,12],[385,8,385,11],[384,1,384,7],[385,1,385,7]]}
[null,"Ata de Registro de Preços para Reformas no SF - 2018/2019"]
[null,"PLANILHA ORÇAMENTÁRIA"]
[null,"Data: Setembro de 2018 (data-base: Sinapi ago/2018, Pini ago/2018 e Orse jul/2018)"]
["-","Número-SF","Grande Área","Categoria","DISCRIMINAÇÃO","UN","QUANT. TOTAL","PREÇO UNITÁRIO","CUSTO DIRETO","BDI (%)","PREÇO UNITÁRIO COM BDI","CUSTO TOTAL","FONTE/CÓD./OBS."]
["-","SF-00001","Serviços de Apoio","Serviços Técnicos","Engenheiro(a) /Arquiteto(a) júnior","hh",3000,{"$f":"OFFSET(INDEX(Composições!A:M,MATCH(E5,Composições!B:B,0),13),2,0)","v":72.150000000000006},{"$f":"IF(ISNUMBER(H5),ROUND(G5*H5,2),\"-\")","v":216450},{"$f":"BDI!$B$17","v":0.20335932421833602},{"$f":"IF(ISNUMBER(H5),ROUND(H5*(1+J5),2),0)","v":86.82},{"$f":"ROUND(K5*G5,2)","v":260460},"Sinapi 90777"]
["-","SF-00002","Serviços de Apoio","Serviços Técnicos","Mestre de obras","hh",6000,{"$f":"OFFSET(INDEX(Composições!A:M,MATCH(E6,Composições!B:B,0),13),2,0)","v":21.75},{"$f":"IF(ISNUMBER(H6),ROUND(G6*H6,2),\"-\")","v":130500},{"$f":"BDI!$B$17","v":0.20335932421833602},{"$f":"IF(ISNUMBER(H6),ROUND(H6*(1+J6),2),0)","v":26.17},{"$f":"ROUND(K6*G6,2)","v":157020},"Sinapi 90780"]
["-","SF-00003","Serviços de Apoio","Serviços Técnicos","Planejamento físico-financeiro","un",10,{"$f":"OFFSET(INDEX(Composições!A:M,MATCH(E7,Composições!B:B,0),13),2,0)","v":1313.14},13131.4,{"$f":"BDI!$B$17","v":0.20335932421833602},1580.18,15801.8,"Senado Federal"]
["-","SF-00004","Serviços de Apoio","Serviços Técnicos","Projetos de segurança do trabalho","un",5,{"$f":"OFFSET(INDEX(Composições!A:M,MATCH(E8,Composições!B:B,0),13),2,0)","v":1838.1100000000001},9190.5499999999993,{"$f":"BDI!$B$17","v":0.20335932421833602},2211.91,11059.55,"Senado Federal"]
[null,"SF-00005","Serviços de Apoio","Serviços Preliminares","Demolição de alvenarias","m3",8,{"$f":"OFFSET(INDEX(Composições!A:M,MATCH(E9,Composições!B:B,0),13),2,0)","v":34.69},277.52,{"$f":"BDI!$B$17","v":0.20335932421833602},41.74,333.92,"Sinapi 97622"]
[null,"SF-00006","Serviços de Apoio","Serviços Preliminares","Demolição de concreto simples","m3",20,{"$f":"OFFSET(INDEX(Composições!A:M,MATCH(E10,Composições!B:B,0),13),2,0)","v":194.72},3894.4,{"$f":"BDI!$B$17","v":0.20335932421833602},234.32,4686.3999999999996,"Seinfra C1049 Adaptada"]
[null,"SF-00007","Serviços de Apoio","Serviços Preliminares","Demolição de contrapiso","m2",500,{"$f":"OFFSET(INDEX(Composições!A:M,MATCH(E11,Composições!B:B,0),13),2,0)","v":9.2200000000000006},4610,{"$f":"BDI!$B$17","v":0.20335932421833602},11.09,5545,"SCO/RJ - SC 05.05.0800 Adaptada"]
[null,"SF-00008","Serviços de Apoio","Serviços Preliminares","Demolição de fechamento ou divisória em gesso acartonado","m2",100,{"$f":"OFFSET(INDEX(Composições!A:M,MATCH(E12,Composições!B:B,0),13),2,0)","v":4.6399999999999997},464,{"$f":"BDI!$B$17","v":0.20335932421833602},5.58,558,"Sinapi 97638"]
[null,"SF-00009","Serviços de Apoio","Serviços Preliminares","Demolição de forro de gesso","m2",3300,{"$f":"OFFSET(INDEX(Composições!A:M,MATCH(E13,Composições!B:B,0),13),2,0)","v":3.14},10362,{"$f":"BDI!$B$17","v":0.20335932421833602},3.78,12474,"Sinapi 97641"]
[null,"SF-00010","Serviços de Apoio","Serviços Preliminares","Demolição de infraestrutura elétrica (eletrodutos, eletrocalhas, cabos)","m",5000,{"$f":"OFFSET(INDEX(Composições!A:M,MATCH(E14,Composições!B:B,0),13),2,0)","v":2.12},10600,{"$f":"BDI!$B$17","v":0.20335932421833602},2.5499999999999998,12750,"Sinapi 97661 Adaptada"]
[null,"SF-00011","Serviços de Apoio","Serviços Preliminares","Demolição de revestimento cerâmico, granito, mármore ou granitina","m2",340,{"$f":"OFFSET(INDEX(Composições!A:M,MATCH(E15,Composições!B:B,0),13),2,0)","v":7.72},2624.8,{"$f":"BDI!$B$17","v":0.20335932421833602},9.2899999999999991,3158.6,"Sinapi 97634"]
[null,"SF-00012","Serviços de Apoio","Serviços Preliminares","Demolição de revestimento em argamassa","m2",2000,{"$f":"OFFSET(INDEX(Composições!A:M,MATCH(E16,Composições!B:B,0),13),2,0)","v":2.0699999999999998},4140,{"$f":"BDI!$B$17","v":0.20335932421833602},2.4900000000000002,4980,"Sinapi 97631"]
[null,"SF-00013","Serviços de Apoio","Serviços Preliminares","Demolição de tubulação hidrossanitária embutida com conexões e acessórios","m",100,{"$f":"OFFSET(INDEX(Composições!A:M,MATCH(E17,Composições!B:B,0),13),2,0)","v":0.31},31,{"$f":"BDI!$B$17","v":0.20335932421833602},0.37,37,"Sinapi 97662"]
[null,"SF-00014","Serviços de Apoio","Serviços Preliminares","Demolição em concreto armado","m3",10,{"$f":"OFFSET(INDEX(Composições!A:M,MATCH(E18,Composições!B:B,0),13),2,0)","v":167.94},1679.4,{"$f":"BDI!$B$17","v":0.20335932421833602},202.09,2020.9,"Sinapi 97627"]
[null,"SF-00015","Serviços de Apoio","Serviços Preliminares","Locação de caçambas","un",110,330,36300,{"$f":"BDI!$B$17","v":0.20335932421833602},397.11,43682.1,"Pesquisa Simples"]
[null,"SF-00016","Serviços de Apoio","Serviços Preliminares","Remoção de armários","m2",240,{"$f":"OFFSET(INDEX(Composições!A:M,MATCH(E20,Composições!B:B,0),13),2,0)","v":10.93},2623.2,{"$f":"BDI!$B$17","v":0.20335932421833602},13.15,3156,"SCO/RJ - SC 05.05.1750 Adaptada"]
{"$rows_left_out":367}
{"sheet":"Composições","index":1,"n_rows":2291,"n_cols":13,"rows_kept":2291,"cut":false,"hidden":false,"merged":[[0,0,2,0],[2189,3,2189,6],[2197,3,2197,6],[2181,3,2181,6],[2173,3,2173,6],[2165,3,2165,6],[423,0,430,0],[423,1,430,1],[429,3,429,6],[153,1,159,1],[595,1,602,1],[535,0,542,0],[535,1,542,1],[543,0,550,0],[543,1,550,1],[574,0,580,0],[551,0,557,0],[551,1,557,1],[581,0,586,0],[581,1,586,1],[618,0,625,0],[618,1,625,1],[610,0,617,0],[610,1,617,1],[626,0,633,0],[626,1,633,1],[744,0,748,0],[744,1,748,1],[699,0,704,0],[669,1,676,1],[688,0,698,0],[688,1,698,1],[716,0,729,0],[716,1,729,1],[642,0,649,0],[730,0,739,0],[2272,1,2277,1],[1031,0,1038,0],[1031,1,1038,1],[749,0,753,0],[749,1,753,1],[754,0,758,0],[754,1,758,1],[642,1,649,1],[634,0,641,0],[634,1,641,1],[730,1,739,1],[681,0,687,0],[681,1,687,1],[705,0,708,0],[705,1,708,1],[2258,0,2265,0],[2258,1,2265,1],[2266,0,2271,0],[2143,1,2152,1],[2125,0,2130,0],[2125,1,2130,1],[2137,0,2142,0],[2137,1,2142,1],[2131,0,2136,0],[595,0,602,0],[505,0,510,0],[505,1,510,1],[465,0,470,0],[465,1,470,1],[498,0,504,0],[498,1,504,1],[558,0,565,0],[558,1,565,1],[491,1,497,1],[519,0,526,0],[2143,0,2152,0],[431,0,440,0],[431,1,440,1],[378,0,391,0],[378,1,391,1],[392,0,398,0],[392,1,398,1],[471,0,477,0],[471,1,477,1],[441,0,447,0],[441,1,447,1],[448,0,458,0],[399,0,410,0],[448,1,458,1],[459,0,464,0],[399,1,410,1],[574,1,580,1],[519,1,526,1],[566,0,573,0],[566,1,573,1],[527,0,534,0],[527,1,534,1],[587,0,594,0],[587,1,594,1],[2049,0,2056,0],[2278,0,2284,0],[2278,1,2284,1],[789,0,794,0],[789,1,794,1],[816,0,820,0],[816,1,820,1],[827,0,830,0],[827,1,830,1],[2266,1,2271,1],[2252,0,2257,0],[2252,1,2257,1],[1183,0,1189,0],[1183,1,1189,1],[1081,0,1087,0],[1081,1,1087,1],[1137,0,1143,0],[1137,1,1143,1],[2167,0,2174,0],[2167,1,2174,1],[2208,0,2212,0],[2208,1,2212,1],[2159,0,2166,0],[2159,1,2166,1],[2049,1,2056,1],[2231,0,2236,0],[2231,1,2236,1],[2213,0,2218,0],[2213,1,2218,1],[2183,0,2190,0],[2183,1,2190,1],[2175,0,2182,0],[2175,1,2182,1],[2131,1,2136,1],[2117,1,2124,1],[2153,0,2158,0],[2153,1,2158,1],[2073,0,2080,0],[2073,1,2080,1],[2081,0,2088,0],[2081,1,2088,1],[2117,0,2124,0],[2065,0,2072,0],[2065,1,2072,1],[2089,0,2096,0],[2089,1,2096,1],[2057,0,2064,0],[2057,1,2064,1],[2237,0,2241,0],[2237,1,2241,1],[2225,0,2230,0],[2225,1,2230,1],[2191,0,2198,0],[2191,1,2198,1],[2219,0,2224,0],[2219,1,2224,1],[2199,0,2207,0],[2199,1,2207,1],[2242,0,2246,0],[2242,1,2246,1],[2247,0,2251,0],[2247,1,2251,1],[603,0,609,0],[603,1,609,1],[699,1,704,1],[178,0,184,0],[178,1,184,1],[766,0,771,0],[766,1,771,1],[650,0,655,0],[650,1,655,1],[663,0,668,0],[663,1,668,1],[656,0,662,0],[656,1,662,1],[677,0,680,0],[677,1,680,1],[669,0,676,0],[2019,0,2024,0],[2019,1,2024,1],[2113,0,2116,0],[2113,1,2116,1],[1947,0,1954,0],[1947,1,1954,1],[1939,0,1946,0],[1939,1,1946,1],[1971,0,1978,0],[1971,1,1978,1],[1955,0,1962,0],[1955,1,1962,1],[1979,0,1986,0],[1979,1,1986,1],[1963,0,1970,0],[1963,1,1970,1],[2043,0,2048,0],[2043,1,2048,1],[2037,0,2042,0],[2037,1,2042,1],[2031,0,2036,0],[2031,1,2036,1],[2025,0,2030,0],[2025,1,2030,1],[1987,0,1994,0],[1987,1,1994,1],[2011,0,2018,0],[2011,1,2018,1],[2003,0,2010,0],[2003,1,2010,1],[1995,0,2002,0],[1995,1,2002,1],[1867,0,1873,0],[1867,1,1873,1],[1925,0,1930,0],[1925,1,1930,1],[1918,0,1924,0],[1918,1,1924,1],[1911,0,1917,0],[1911,1,1917,1],[1904,0,1910,0],[1904,1,1910,1],[1897,0,1903,0],[1897,1,1903,1],[1931,0,1938,0],[1931,1,1938,1],[1822,0,1827,0],[1822,1,1827,1],[1828,0,1833,0],[1828,1,1833,1],[1834,0,1838,0],[1834,1,1838,1],[1844,0,1848,0],[1844,1,1848,1],[1839,0,1843,0],[1839,1,1843,1],[1849,0,1854,0],[1849,1,1854,1],[1855,0,1860,0],[1855,1,1860,1],[1861,0,1866,0],[1861,1,1866,1],[1889,0,1896,0],[1889,1,1896,1],[1881,0,1888,0],[1881,1,1888,1],[1874,0,1880,0],[1874,1,1880,1],[1816,0,1821,0],[1816,1,1821,1],[1792,0,1797,0],[1792,1,1797,1],[1810,0,1815,0],[1810,1,1815,1],[1786,0,1791,0],[1786,1,1791,1],[1798,0,1803,0],[1798,1,1803,1],[1804,0,1809,0],[1804,1,1809,1],[1762,0,1767,0],[1762,1,1767,1],[1768,0,1773,0],[1768,1,1773,1],[1755,0,1761,0],[1755,1,1761,1],[1774,0,1779,0],[1774,1,1779,1],[1780,0,1785,0],[1780,1,1785,1],[1602,0,1606,0],[1602,1,1606,1],[1738,0,1742,0],[1738,1,1742,1],[1733,0,1737,0],[1733,1,1737,1],[1743,0,1748,0],[1743,1,1748,1],[1749,0,1754,0],[1749,1,1754,1],[1634,0,1644,0],[1634,1,1644,1],[1645,0,1655,0],[1645,1,1655,1],[1621,0,1626,0],[1621,1,1626,1],[1627,0,1633,0],[1627,1,1633,1],[1607,0,1613,0],[1607,1,1613,1],[1614,0,1620,0],[1614,1,1620,1],[1727,0,1732,0],[1727,1,1732,1],[1434,0,1441,0],[1434,1,1441,1],[1692,0,1698,0],[1692,1,1698,1],[1706,0,1712,0],[1706,1,1712,1],[1720,0,1726,0],[1720,1,1726,1],[1678,0,1684,0],[1678,1,1684,1],[1685,0,1691,0],[1685,1,1691,1],[1699,0,1705,0],[1699,1,1705,1],[1587,0,1591,0],[1587,1,1591,1],[1592,0,1596,0],[1592,1,1596,1],[1582,0,1586,0],[1582,1,1586,1],[1656,0,1666,0],[1656,1,1666,1],[1667,0,1677,0],[1667,1,1677,1],[1419,0,1433,0],[1419,1,1433,1],[1517,0,1522,0],[1517,1,1522,1],[1597,0,1601,0],[1597,1,1601,1],[1374,0,1388,0],[1374,1,1388,1],[1404,0,1418,0],[1404,1,1418,1],[1502,0,1516,0],[1502,1,1516,1],[1481,0,1487,0],[1481,1,1487,1],[1474,0,1480,0],[1474,1,1480,1],[1466,0,1473,0],[1466,1,1473,1],[1450,0,1457,0],[1450,1,1457,1],[1576,0,1581,0],[1576,1,1581,1],[1553,0,1558,0],[1553,1,1558,1],[1523,0,1528,0],[1523,1,1528,1],[1529,0,1534,0],[1529,1,1534,1],[1570,0,1575,0],[1570,1,1575,1],[1442,0,1449,0],[1442,1,1449,1],[1535,0,1541,0],[1535,1,1541,1],[1542,0,1546,0],[1542,1,1546,1],[1559,0,1563,0],[1559,1,1563,1],[1564,0,1569,0],[1564,1,1569,1],[1458,0,1465,0],[1458,1,1465,1],[1495,0,1501,0],[1495,1,1501,1],[1488,0,1494,0],[1488,1,1494,1],[1547,0,1552,0],[1547,1,1552,1],[1389,0,1403,0],[1389,1,1403,1],[1286,0,1291,0],[1286,1,1291,1],[1322,0,1328,0],[1322,1,1328,1],[1310,0,1315,0],[1310,1,1315,1],[1292,0,1297,0],[1292,1,1297,1],[1298,0,1303,0],[1298,1,1303,1],[1304,0,1309,0],[1304,1,1309,1],[1316,0,1321,0],[1316,1,1321,1],[1329,0,1343,0],[1329,1,1343,1],[1359,0,1373,0],[1359,1,1373,1],[1344,0,1358,0],[1344,1,1358,1],[1266,0,1272,0],[1266,1,1272,1],[1279,0,1285,0],[1279,1,1285,1],[1273,0,1278,0],[1273,1,1278,1],[1067,0,1073,0],[1067,1,1073,1],[1088,0,1094,0],[1088,1,1094,1],[1095,0,1101,0],[1095,1,1101,1],[1130,0,1136,0],[1130,1,1136,1],[1256,0,1260,0],[1256,1,1260,1],[1251,0,1255,0],[1251,1,1255,1],[1246,0,1250,0],[1246,1,1250,1],[1211,0,1217,0],[1211,1,1217,1],[1218,0,1224,0],[1218,1,1224,1],[1102,0,1108,0],[1102,1,1108,1],[1225,0,1231,0],[1225,1,1231,1],[1261,0,1265,0],[1261,1,1265,1],[1055,0,1059,0],[1055,1,1059,1],[1198,0,1203,0],[1198,1,1203,1],[1232,0,1239,0],[1232,1,1239,1],[1240,0,1245,0],[1240,1,1245,1],[1204,0,1210,0],[1204,1,1210,1],[1152,0,1159,0],[1152,1,1159,1],[1144,0,1151,0],[1144,1,1151,1],[1060,0,1066,0],[1060,1,1066,1],[975,0,981,0],[975,1,981,1],[989,0,995,0],[989,1,995,1],[1005,0,1012,0],[1005,1,1012,1],[996,0,1004,0],[996,1,1004,1],[1190,0,1197,0],[1190,1,1197,1],[1176,0,1182,0],[1176,1,1182,1],[1074,0,1080,0],[1074,1,1080,1],[1109,0,1115,0],[1109,1,1115,1],[1116,0,1122,0],[1116,1,1122,1],[1123,0,1129,0],[1123,1,1129,1],[1168,0,1175,0],[1168,1,1175,1],[1160,0,1167,0],[1160,1,1167,1],[914,0,924,0],[914,1,924,1],[1049,0,1054,0],[1049,1,1054,1],[935,0,943,0],[935,1,943,1],[925,0,929,0],[925,1,929,1],[930,0,934,0],[930,1,934,1],[1044,0,1048,0],[1044,1,1048,1],[1039,0,1043,0],[1039,1,1043,1],[944,0,948,0],[944,1,948,1],[1021,0,1030,0],[1021,1,1030,1],[968,0,974,0],[968,1,974,1],[982,0,988,0],[982,1,988,1],[1013,0,1020,0],[1013,1,1020,1],[882,1,888,1],[876,0,881,0],[876,1,881,1],[870,0,875,0],[870,1,875,1],[896,0,902,0],[896,1,902,1],[903,0,913,0],[903,1,913,1],[821,1,826,1],[772,0,776,0],[772,1,776,1],[777,0,781,0],[777,1,781,1],[795,0,801,0],[795,1,801,1],[821,0,826,0],[802,0,808,0],[802,1,808,1],[809,0,815,0],[809,1,815,1],[759,0,765,0],[759,1,765,1],[709,0,715,0],[709,1,715,1],[740,0,743,0],[740,1,743,1],[782,0,788,0],[782,1,788,1],[301,0,306,0],[301,1,306,1],[511,0,518,0],[511,1,518,1],[491,0,497,0],[478,0,484,0],[478,1,484,1],[371,0,377,0],[371,1,377,1],[485,0,490,0],[485,1,490,1],[459,1,464,1],[417,0,422,0],[417,1,422,1],[411,0,416,0],[411,1,416,1],[209,0,213,0],[209,1,213,1],[232,0,242,0],[232,1,242,1],[357,0,370,0],[357,1,370,1],[332,1,341,1],[332,0,341,0],[271,0,285,0],[271,1,285,1],[342,0,347,0],[342,1,347,1],[348,0,356,0],[348,1,356,1],[307,0,321,0],[307,1,321,1],[286,0,300,0],[286,1,300,1],[322,0,331,0],[322,1,331,1],[249,0,256,0],[249,1,256,1],[264,1,270,1],[214,0,218,0],[214,1,218,1],[257,0,263,0],[257,1,263,1],[264,0,270,0],[41,0,45,0],[5,0,8,0],[5,1,8,1],[58,0,62,0],[58,1,62,1],[41,1,45,1],[160,0,164,0],[160,1,164,1],[86,0,90,0],[86,1,90,1],[9,0,12,0],[9,1,12,1],[76,0,80,0],[76,1,80,1],[51,0,57,0],[51,1,57,1],[32,0,35,0],[32,1,35,1],[27,0,31,0],[27,1,31,1],[96,0,100,0],[96,1,100,1],[153,0,159,0],[13,0,16,0],[13,1,16,1],[223,0,231,0],[223,1,231,1],[200,0,204,0],[200,1,204,1],[101,0,104,0],[101,1,104,1],[17,1,21,1],[17,0,21,0],[219,0,222,0],[219,1,222,1],[143,1,147,1],[165,0,169,0],[165,1,169,1],[81,0,85,0],[81,1,85,1],[115,0,118,0],[115,1,118,1],[170,0,173,0],[170,1,173,1],[36,1,40,1],[36,0,40,0],[174,1,177,1],[174,0,177,0],[63,0,67,0],[63,1,67,1],[46,0,50,0],[46,1,50,1],[205,0,208,0],[205,1,208,1],[110,0,114,0],[110,1,114,1],[119,0,123,0],[119,1,123,1],[196,0,199,0],[143,0,147,0],[105,0,109,0],[105,1,109,1],[196,1,199,1],[185,1,191,1],[124,0,128,0],[124,1,128,1],[959,0,967,0],[959,1,967,1],[889,0,895,0],[1713,0,1719,0],[1713,1,1719,1],[192,0,195,0],[192,1,195,1],[68,0,75,0],[68,1,75,1],[134,0,137,0],[134,1,137,1],[138,0,142,0],[138,1,142,1],[91,0,95,0],[91,1,95,1],[129,0,133,0],[129,1,133,1],[185,0,191,0],[148,0,152,0],[148,1,152,1],[889,1,895,1],[882,0,888,0],[243,0,248,0],[243,1,248,1],[0,2,0,12],[1,2,1,12],[2,2,2,12],[22,1,26,1],[22,0,26,0],[2285,0,2290,0],[2285,1,2290,1],[2272,0,2277,0],[2097,0,2104,0],[2097,1,2104,1],[2105,0,2112,0],[2105,1,2112,1],[831,0,835,0],[831,1,835,1],[836,0,844,0],[836,1,844,1],[861,0,869,0],[861,1,869,1],[852,0,860,0],[852,1,860,1],[845,0,851,0],[845,1,851,1],[949,0,958,0],[949,1,958,1]]}
[null,"SENADO FEDERAL","Ata de Registro de Preços para Reformas no SF - 2018/2019"]
[null,"SECRETARIA DE INFRAESTRUTURA","COMPOSIÇÕES"]
[null,"SERVIÇO DE ORÇAMENTOS","Outubro de 2018 (data-base: Sinapi ago/2018, Pini ago/2018 e Orse jul/2018)"]
[]
["Item","Discriminação",null,"Especificação do Serviço","Unidade","Coeficiente","Fonte do Coeficiente","Preço","Fonte do Preço","Composição Auxiliar","MAT.","M.O.","TOTAL"]
["SF-00001","Engenheiro(a) /Arquiteto(a) júnior",{"$f":"IF(AND(D6<>\"\",A21=\"\"),C22,IF(D6<>\"\",A21,\"\"))","v":""},null,"hh",null,"Sinapi 90777"]
[null,null,{"$f":"IF(AND(D7<>\"\",A22=\"\"),C6,IF(D7<>\"\",A22,\"\"))","v":""}]
[null,null,{"$f":"IF(AND(D8<>\"\",A6=\"\"),C7,IF(D8<>\"\",A6,\"\"))","v":"SF-00001"},"Engenheiro civil de obra júnior com encargos complementares","h",1,"Sinapi 90777",72.153000000000006,"Sinapi 90777",null,null,{"$f":"ROUND(H8*F8,2)","v":72.150000000000006},{"$f":"SUM(J8:L8)","v":72.150000000000006}]
[null,null,"",null,null,null,null,""]
["SF-00002","Mestre de obras","",null,"hh",null,"Sinapi 90780",""]
[null,null,""]
[null,null,"SF-00002","Mestre de obras com encargos complementares","h",1,"Sinapi 90780",21.753000000000004,"Sinapi 90780",null,null,{"$f":"ROUND(H12*F12,2)","v":21.75},{"$f":"SUM(J12:L12)","v":21.75}]
[null,null,"",null,null,null,null,""]
["SF-00003","Planejamento físico-financeiro","",null,"un",null,"Senado Federal",""]
[null,null,"",null,null,null,null,""]
[null,null,"SF-00003","Engenheiro Civil de Obra Pleno","h",16,"Senado Federal",82.070999999999998,"Sinapi 90778",null,null,{"$f":"ROUND(H16*F16,2)","v":1313.14},{"$f":"SUM(J16:L16)","v":1313.14}]
[null,null,"",null,null,null,null,""]
["SF-00004","Projetos de segurança do trabalho","",null,"un",null,"Senado Federal",""]
[null,null,"",null,null,null,null,""]
[null,null,"SF-00004","Engenheiro de Segurança do Trabalho","h",20,"Senado Federal",82.070999999999998,"Sinapi 90778",null,null,{"$f":"ROUND(H20*F20,2)","v":1641.42},{"$f":"SUM(J20:L21)","v":1838.1100000000001}]
{"$rows_left_out":2272}
{"sheet":"Composições Auxiliares","index":2,"n_rows":194,"n_cols":12,"rows_kept":194,"cut":false,"hidden":false,"merged":[[18,0,23,0],[35,0,45,0],[2,1,2,11],[1,1,1,11],[0,1,0,11],[12,0,17,0],[5,0,11,0],[46,0,55,0],[24,0,28,0],[29,0,34,0],[105,0,110,0],[111,0,116,0],[56,0,64,0],[65,0,72,0],[73,0,79,0],[80,0,85,0],[86,0,92,0],[93,0,98,0],[99,0,104,0],[187,0,194,0],[117,0,122,0],[123,0,128,0],[129,0,134,0],[141,0,146,0],[153,0,160,0],[173,0,178,0],[135,0,140,0],[161,0,170,0],[147,0,152,0],[179,0,186,0],[171,0,172,11]]}
["SENADO FEDERAL","Ata de Registro de Preços para Reformas no SF - 2018/2019"]
["SECRETARIA DE INFRAESTRUTURA","COMPOSIÇÕES AUXILIARES"]
["SERVIÇO DE ORÇAMENTOS","Setembro de 2018 (data-base: Sinapi ago/2018, Pini ago/2018 e Orse jul/2018)"]
[]
["Discriminação",null,"Especificação do Serviço","Unidade","Coeficiente","Fonte do Coeficiente","Preço","Fonte do Preço","Composição Auxiliar","MAT.","M.O.","Total"]
["Martelete ou rompedor pneumático manual, 28 kg, com silenciador - CHP diurno. AF_07/2016",null,null,"CHP",null,{"$f":"F8","v":"Sinapi 5795"}]
[]
[null,null,"Martelete ou rompedor pneumático manual, 28 kg, com silenciador - manutenção. af_07/2016","H",1,"Sinapi 5795",0.95400000000000007,"Sinapi 53863",null,{"$f":"ROUND(G8*E8,2)","v":0.95},null,{"$f":"SUM(I8:K11)","v":16.420000000000002}]
[null,null,"Operador de martelete ou marteleteiro com encargos complementares","H",1,"Sinapi 5795",14.526000000000002,"Sinapi 88298",null,null,{"$f":"ROUND(G9*E9,2)","v":14.53}]
[null,null,"Martelete ou rompedor pneumático manual, 28 kg, com silenciador - depreciação. af_07/2016","H",1,"Sinapi 5795",0.76500000000000001,"Sinapi 95114",null,{"$f":"ROUND(G10*E10,2)","v":0.77}]
[null,null,"Martelete ou rompedor pneumático manual, 28 kg, com silenciador - juros. af_07/2016","H",1,"Sinapi 5795",0.17100000000000001,"Sinapi 95115",null,{"$f":"ROUND(G11*E11,2)","v":0.17}]
[null,null,""]
["Martelete ou rompedor pneumático manual, 28 kg, com silenciador - CHI diurno. AF_07/2016",null,"","CHI",null,{"$f":"F15","v":"Sinapi 5952"}]
[null,null,""]
[null,null,"Operador de martelete ou marteleteiro com encargos complementares","H",1,"Sinapi 5952",14.526000000000002,"Sinapi 88298",null,null,{"$f":"ROUND(G15*E15,2)","v":14.53},{"$f":"SUM(I15:K17)","v":15.459999999999999}]
[null,null,"Martelete ou rompedor pneumático manual, 28 kg, com silenciador - depreciação. af_07/2016","H",1,"Sinapi 5952",0.76500000000000001,"Sinapi 95114",null,{"$f":"ROUNDDOWN(G16*E16,2)","v":0.76}]
[null,null,"Martelete ou rompedor pneumático manual, 28 kg, com silenciador - juros. af_07/2016","H",1,"Sinapi 5952",0.17100000000000001,"Sinapi 95115",null,0.17]
[null,null,""]
["Argamassa traço 1:3 (cimento e areia média), preparo manual. AF_08/2014",null,"","M3",null,{"$f":"F21","v":"Sinapi 88629"}]
[null,null,""]
{"$rows_left_out":175}
{"sheet":"BDI","index":3,"n_rows":47,"n_cols":9,"rows_kept":47,"cut":false,"hidden":false,"merged":[[46,0,46,8],[0,0,0,8],[1,0,1,8],[3,0,3,3],[3,5,3,8],[18,0,18,3],[18,5,18,8],[4,0,5,0],[4,5,5,5]]}
["Ata de Registro de Preços para Reformas no SF - 2018/2019"]
["BENEFÍCIOS E DESPESAS INDIRETAS - BDI"]
[]
["BDI Edificações",null,null,null,null,"BDI mero fornecimento"]
["Componentes do BDI","Cálculo sem CPRB",null,null,null,"Componentes do BDI","Cálculo sem CPRB"]
[null,"(não-desonerado)",null,null,null,null,"(não-desonerado)"]
[null,"% considerado",null,null,null,null,"% considerado"]
["AC",0.04,null,null,null,"AC",1.6899999999999998E-2]
["S+G",8.0000000000000002E-3,null,null,null,"S+G",3.0000000000000001E-3]
["R",1.09E-2,null,null,null,"R",5.5999999999999999E-3]
["DF",0.01,null,null,null,"DF",8.5000000000000006E-3]
["L",6.1600000000000002E-2,null,null,null,"L",3.5000000000000003E-2]
["PIS",6.4999999999999997E-3,null,null,null,"PIS",6.4999999999999997E-3]
["COFINS",0.03,null,null,null,"COFINS",0.03]
["CPRB",0,null,null,null,"CPRB",0]
["ISS",0.02,null,null,null,"ISS",0]
["BDI Edificações",{"$f":"(((1+B8+B9+B10)*(1+B11)*(1+B12))/(1-(B13+B14+B15+B16))-1)","v":0.20335932421833602},null,null,null,"BDI mero fornecimento",{"$f":"(((1+G8+G9+G10)*(1+G11)*(1+G12))/(1-(G13+G14+G15+G16))-1)","v":0.11096454203424999}]
[]
["Referências TCU - BDI Edificações",null,null,null,null,"Referências TCU - BDI mero fornecimento"]
[null,"1º Quartil","Médio","3º Quartil",null,null,"1º Quartil","Médio","3º Quartil"]
{"$rows_left_out":27}